{
  "id": "delete",
  "type": "action",
  "parameters": [
    "record",
    "filters"
  ],
  "confirm": true,
  "message": {
    "success": "Registro apagado com sucesso",
    "error": "Erro ao apagar",
    "warning": "Este registro nao pode ser apagado",
    "confirm": "Deseja apagar este registro?"
  }
}