{
  "id": "edit",
  "layout": "form",
  "type": "form",
  "templateOptions": {
    "recover": "read",
    "wrapper": "record"
  },
  "fields": [
    {
      "key": "usr_codigo",
      "label": "C\u00f3digo",
      "required": true,
      "readonly": true,
      "order": 1,
      "component": "input[text]",
      "wrapper": "col-sm-12"
    },
    {
      "order": 2,
      "key": "usr_role",
      "label": "Perfil",
      "required": true,
      "component": "select[local]",
      "wrapper": "col-sm-12",
      "options": [
      ]
    },
    {
      "order": 3,
      "required": true,
      "key": "usr_name",
      "label": "Nome",
      "component": "input[text]",
      "wrapper": "col-sm-6"
    },
    {
      "order": 4,
      "key": "usr_email",
      "label": "E-mail",
      "required": false,
      "component": "input[text]",
      "wrapper": "col-sm-6"
    },
    {
      "order": 5,
      "key": "usr_login",
      "label": "Usu\u00e1rio",
      "required": true,
      "component": "input[text]",
      "wrapper": "col-sm-6"
    },
    {
      "order": 6,
      "key": "usr_password",
      "label": "Senha",
      "wrapper": "col-sm-6",
      "component": "input[password]"
    }
  ],
  "actions": [
    {
      "id": "add",
      "position": {
        "fab": 0
      },
      "className": "btn waves-effect btn-theme",
      "classIcon": "zmdi zmdi-plus"
    },
    {
      "id": "save",
      "position": {
        "top": 0,
        "bottom": 0
      },
      "className": "btn btn-theme waves-effect",
      "classIcon": "",
      "label": "Salvar"
    },
    {
      "id": "save",
      "position": {
        "top": 1,
        "bottom": 1
      },
      "className": "btn btn-default",
      "classIcon": "",
      "label": "Salvar e Fechar",
      "after": "index"
    },
    {
      "id": "index",
      "position": {
        "top": 2,
        "bottom": 2
      },
      "className": "btn btn-link waves-effect",
      "classIcon": "",
      "label": "Fechar"
    }
  ],
  "_id": "573e17871b12b",
  "groups": []
}