[
  {
    "name": "Administração",
    "href": "",
    "icon": "zmdi zmdi-settings",
    "items": [
      {
        "name": "Usuários",
        "href": "#/view/infra/usuario/index",
        "icon": "zmdi zmdi-account"
      },
      {
        "name": "Páginas",
        "href": "#/view/infra/page/index",
        "icon": "zmdi zmdi-collection-item"
      }
    ]
  }
]