{
  "properties": {
    "module": "infra",
    "entity": "Usuario",
    "id": "",
    "name": "Usu\u00e1rio",
    "description": null
  },
  "driver": {
    "collection": "TBL_USUARIO",
    "id": null
  },
  "items": [
    {
      "_id": "573e181099221",
      "name": "usr_codigo",
      "behavior": "pk",
      "type": "int",
      "length": 10,
      "required": false,
      "nullable": false,
      "create": false,
      "read": true,
      "update": false,
      "label": "C\u00f3digo"
    },
    {
      "_id": "573e18969bc7a",
      "name": "usr_role",
      "type": "string",
      "behavior": "restricted",
      "length": 250,
      "options": [
      ],
      "label": "Perfil",
      "create": true,
      "read": true,
      "update": true
    },
    {
      "_id": "573e18c7c24b7",
      "name": "usr_name",
      "type": "string",
      "length": 10,
      "create": true,
      "read": true,
      "update": true,
      "required": true,
      "nullable": false,
      "label": "Nome"
    },
    {
      "_id": "573e18f59cb37",
      "name": "usr_email",
      "type": "string",
      "length": 250,
      "label": "E-mail",
      "create": true,
      "read": true,
      "update": true
    },
    {
      "_id": "573e1913ad24b",
      "name": "usr_login",
      "type": "string",
      "length": 250,
      "label": "Usu\u00e1rio",
      "required": true,
      "create": true,
      "read": true,
      "update": true
    },
    {
      "_id": "573e19390bd48",
      "name": "usr_password",
      "type": "string",
      "length": 250,
      "label": "Senha",
      "create": true,
      "read": true,
      "update": true
    },
    {
      "_id": "57404c7031e60",
      "name": "usr_token",
      "type": "string",
      "label": "Token",
      "required": false,
      "create": true,
      "read": true,
      "update": true
    }
  ]
}