{
  "id": "update",
  "type": "action",
  "parameters": [
    "record",
    "filters"
  ],
  "message": {
    "success": "Registro salvo com sucesso",
    "error": "Erro ao salvar",
    "warning": "A validaçao emperrou as coisas"
  }
}