week_day,hq_name,masterpieces_this_day,common_ticket_price,hq_location,consessions,num_visitors
wednesday,Главный штаб,213,400,center,True,2713.0
thursday,Главный штаб,172,400,center,True,2309.0
friday,Главный штаб,232,400,center,True,
saturday,Новый штаб,324,600,north,False,7843.0
sunday,Новый штаб,321,600,north,False,
