module github.com/kubernetes-csi/external-attacher

go 1.19

require (
	github.com/container-storage-interface/spec v1.8.0
	github.com/davecgh/go-spew v1.1.1
	github.com/evanphx/json-patch v5.6.0+incompatible
	github.com/golang/mock v1.6.0
	github.com/golang/protobuf v1.5.3
	github.com/kubernetes-csi/csi-lib-utils v0.13.0
	github.com/kubernetes-csi/csi-test/v4 v4.4.0
	google.golang.org/grpc v1.54.0
	k8s.io/api v0.26.3
	k8s.io/apimachinery v0.26.3
	k8s.io/client-go v0.26.3
	k8s.io/csi-translation-lib v0.26.3
	k8s.io/klog/v2 v2.90.1
)

require (
	github.com/beorn7/perks v1.0.1 // indirect
	github.com/blang/semver/v4 v4.0.0 // indirect
	github.com/cespare/xxhash/v2 v2.2.0 // indirect
	github.com/emicklei/go-restful/v3 v3.10.0 // indirect
	github.com/go-logr/logr v1.2.3 // indirect
	github.com/go-openapi/jsonpointer v0.19.5 // indirect
	github.com/go-openapi/jsonreference v0.20.0 // indirect
	github.com/go-openapi/swag v0.22.3 // indirect
	github.com/gogo/protobuf v1.3.2 // indirect
	github.com/golang/groupcache v0.0.0-20210331224755-41bb18bfe9da // indirect
	github.com/google/gnostic v0.6.9 // indirect
	github.com/google/go-cmp v0.5.9 // indirect
	github.com/google/gofuzz v1.2.0 // indirect
	github.com/imdario/mergo v0.3.13 // indirect
	github.com/josharian/intern v1.0.0 // indirect
	github.com/json-iterator/go v1.1.12 // indirect
	github.com/mailru/easyjson v0.7.7 // indirect
	github.com/matttproud/golang_protobuf_extensions v1.0.4 // indirect
	github.com/modern-go/concurrent v0.0.0-20180306012644-bacd9c7ef1dd // indirect
	github.com/modern-go/reflect2 v1.0.2 // indirect
	github.com/munnerz/goautoneg v0.0.0-20191010083416-a7dc8b61c822 // indirect
	github.com/pkg/errors v0.9.1 // indirect
	github.com/prometheus/client_golang v1.14.0 // indirect
	github.com/prometheus/client_model v0.3.0 // indirect
	github.com/prometheus/common v0.37.0 // indirect
	github.com/prometheus/procfs v0.8.0 // indirect
	github.com/spf13/pflag v1.0.5 // indirect
	golang.org/x/net v0.8.0 // indirect
	golang.org/x/oauth2 v0.4.0 // indirect
	golang.org/x/sys v0.6.0 // indirect
	golang.org/x/term v0.6.0 // indirect
	golang.org/x/text v0.8.0 // indirect
	golang.org/x/time v0.2.0 // indirect
	google.golang.org/appengine v1.6.7 // indirect
	google.golang.org/genproto v0.0.0-20230110181048-76db0878b65f // indirect
	google.golang.org/protobuf v1.28.1 // indirect
	gopkg.in/inf.v0 v0.9.1 // indirect
	gopkg.in/yaml.v2 v2.4.0 // indirect
	gopkg.in/yaml.v3 v3.0.1 // indirect
	k8s.io/component-base v0.26.0 // indirect
	k8s.io/kube-openapi v0.0.0-20221110221610-a28e98eb7c70 // indirect
	k8s.io/utils v0.0.0-20221108210102-8e77b1f39fe2 // indirect
	sigs.k8s.io/json v0.0.0-20220713155537-f223a00ba0e2 // indirect
	sigs.k8s.io/structured-merge-diff/v4 v4.2.3 // indirect
	sigs.k8s.io/yaml v1.3.0 // indirect
)
