#Position (bp)	mapping quality
15458.0	60.0
46373.0	59.98330550918197
77288.0	59.57667088461981
108203.0	60.0
139118.0	60.0
170033.0	60.0
200948.0	60.0
231863.0	59.99043367346939
262778.0	60.0
293693.0	60.0
324608.0	60.0
355523.0	60.0
386438.0	60.0
417353.0	60.0
448268.0	60.0
479183.0	60.0
510098.0	59.98476964081736
541013.0	56.992078162133616
571928.0	60.0
602843.0	60.0
633758.0	60.0
664673.0	60.0
695588.0	60.0
726503.0	60.0
757418.0	60.0
788333.0	60.0
819248.0	60.0
850163.0	60.0
881078.0	60.0
911993.0	60.0
942908.0	59.30266343825666
973823.0	60.0
1004738.0	60.0
1035653.0	60.0
1066568.0	60.0
1082774.0	0.0
1098231.5	60.0
1128398.0	60.0
1159313.0	60.0
1190228.0	59.92845038599134
1221143.0	60.0
1252058.0	60.0
1282973.0	59.93469591226321
1313888.0	60.0
1344803.0	59.64855584730358
1375718.0	60.0
1406633.0	60.0
1437548.0	58.69458128078818
1468463.0	60.0
1499378.0	60.0
1530293.0	60.0
1561208.0	60.0
1592123.0	60.0
1623038.0	59.53143772527032
1653953.0	58.88245033112583
1684868.0	60.0
1715783.0	60.0
1746698.0	60.0
1777613.0	60.0
1808528.0	60.0
1839443.0	60.0
1870358.0	60.0
1901273.0	59.250985545335084
1932188.0	60.0
1963103.0	60.0
1994018.0	59.98840803709428
2024933.0	60.0
2055848.0	60.0
2086763.0	59.984923122854156
2117678.0	60.0
2148593.0	59.03346887707225
2179508.0	59.95043222365275
2210423.0	60.0
2241338.0	60.0
2272253.0	60.0
2303168.0	60.0
2334083.0	0.0
2356900.0	0.0
2372357.5	60.0
2395913.0	59.97849462365591
2426828.0	60.0
2457743.0	60.0
2488658.0	59.634630659253375
2519573.0	60.0
2550488.0	58.3666746814138
2581403.0	60.0
2612318.0	60.0
2643233.0	60.0
2674148.0	59.983050847457626
2705063.0	60.0
2735978.0	60.0
2766893.0	60.0
2797808.0	59.97907220090687
2828723.0	60.0
2859638.0	60.0
2890553.0	60.0
2921468.0	60.0
2952383.0	60.0
2983298.0	59.844554613785384
3014213.0	60.0
3045128.0	59.332633788037775
3076043.0	60.0
3106958.0	60.0
3137873.0	60.0
3168788.0	60.0
3199703.0	60.0
3230618.0	60.0
3261533.0	59.92716678805535
3292448.0	59.9933818663137
3323363.0	60.0
3354278.0	60.0
3385193.0	59.99503763129601
3406192.0	59.700575815738965
3421649.5	59.92522199719583
3447023.0	59.981929525148075
3477938.0	60.0
3508853.0	60.0
3539768.0	60.0
3570683.0	60.0
3601598.0	59.71061628014414
3632513.0	60.0
3663428.0	59.93115942028985
3694343.0	59.92370847543261
3725258.0	59.23919089759798
3756173.0	60.0
3787088.0	60.0
3818003.0	59.39148073022312
3848918.0	60.0
3879833.0	59.54756817896192
3910748.0	60.0
3941663.0	59.98709122203098
3972578.0	60.0
4003493.0	60.0
4034408.0	60.0
4065323.0	60.0
4096238.0	60.0
4127153.0	60.0
4158068.0	60.0
4188983.0	60.0
4219898.0	59.965211459754435
4250813.0	60.0
4281728.0	60.0
4298150.0	0.0
4313607.5	60.0
4343558.0	59.8969923841487
4374473.0	60.0
4405388.0	60.0
4436303.0	60.0
4467218.0	60.0
4498133.0	60.0
4529048.0	60.0
4559963.0	60.0
4590878.0	60.0
4621793.0	60.0
4652708.0	60.0
4683623.0	60.0
4714538.0	59.969826502388734
4745453.0	60.0
4776368.0	60.0
4807283.0	59.285907492561535
4838198.0	60.0
4869113.0	60.0
4900028.0	60.0
4927000.5	60.0
4942458.0	60.0
4961858.0	60.0
4992773.0	60.0
5023688.0	59.93459518382717
5054603.0	60.0
5085518.0	59.941520467836256
5116433.0	60.0
5147348.0	59.99148090302428
5178263.0	60.0
5209178.0	60.0
5240093.0	59.793633369923164
5271008.0	59.556451612903224
5301923.0	60.0
5332838.0	60.0
5363753.0	59.98068254990341
5394668.0	60.0
5425583.0	60.0
5456498.0	60.0
5487413.0	59.94128028236804
5518328.0	60.0
5549243.0	59.99314990295696
5580158.0	60.0
5611073.0	60.0
5641988.0	60.0
5672903.0	60.0
5701876.0	59.98404467491025
5717333.5	60.0
5734733.0	60.0
5765648.0	59.983579638752055
5796563.0	60.0
5827478.0	60.0
5858393.0	59.969325153374236
5889308.0	60.0
5920223.0	60.0
5951138.0	59.974689165186504
5982053.0	60.0
6012968.0	60.0
6043883.0	60.0
6074798.0	60.0
6105713.0	59.97546012269939
6136628.0	60.0
6167543.0	59.63129864809504
6198458.0	59.15045674368619
6229373.0	60.0
6260288.0	60.0
6291203.0	60.0
6322118.0	60.0
6353033.0	59.956479690522244
6383948.0	60.0
6414863.0	60.0
6445778.0	59.9652978600347
6476693.0	60.0
6507608.0	60.0
6538523.0	60.0
6569438.0	60.0
6600353.0	54.5414913957935
6631268.0	60.0
6662183.0	60.0
6693098.0	60.0
6724013.0	59.294415292353825
6754928.0	60.0
6785843.0	60.0
6816758.0	60.0
6847673.0	60.0
6878588.0	60.0
6909503.0	60.0
6940418.0	59.754861520329996
6971333.0	59.985862393967956
7002248.0	60.0
7033163.0	56.754658385093165
7064078.0	60.0
7094993.0	60.0
7125908.0	60.0
7156823.0	60.0
7187738.0	59.97424892703863
7218653.0	60.0
7249568.0	59.97081002189248
7280483.0	60.0
7311398.0	60.0
7342313.0	60.0
7373228.0	60.0
7404143.0	60.0
7435058.0	59.19896640826873
7465973.0	60.0
7496888.0	60.0
7527803.0	60.0
7558718.0	59.86690328305235
7589633.0	58.82675814751286
7620548.0	59.39093655589124
7651463.0	59.98307475317348
7682378.0	60.0
7713293.0	60.0
7744208.0	59.88175182481752
7775123.0	60.0
7806038.0	60.0
7836953.0	60.0
7867868.0	59.69284111768305
7898783.0	60.0
7929698.0	60.0
7960613.0	60.0
7991528.0	60.0
8022443.0	60.0
8053358.0	60.0
8084273.0	60.0
8115188.0	60.0
8146103.0	59.990276738967836
8177018.0	60.0
8207933.0	60.0
8238848.0	60.0
8269763.0	60.0
8300678.0	60.0
8331593.0	60.0
8362508.0	60.0
8393423.0	60.0
8424338.0	60.0
8455253.0	60.0
8486168.0	60.0
8517083.0	60.0
8547998.0	59.895546206296245
8578913.0	60.0
8609828.0	59.77077955601445
8640743.0	60.0
8671658.0	60.0
8702573.0	60.0
8733488.0	59.98525798525799
8764403.0	60.0
8795318.0	60.0
8826233.0	59.294318181818184
8857148.0	59.93877551020408
8888063.0	59.98599585062241
8907423.5	60.0
8922881.0	59.06291604036934
8949893.0	60.0
8980808.0	59.98811410459588
9011723.0	60.0
9042638.0	60.0
9073553.0	59.9712067748765
9104468.0	60.0
9135383.0	59.9531650201244
9166298.0	60.0
9197213.0	59.81588032220944
9228128.0	60.0
9259043.0	60.0
9289958.0	60.0
9320873.0	60.0
9351788.0	60.0
9382703.0	59.65902578796562
9413618.0	59.99000333222259
9444533.0	60.0
9475448.0	60.0
9506363.0	60.0
9537278.0	60.0
9568193.0	60.0
9599108.0	60.0
9630023.0	60.0
9660938.0	60.0
9691853.0	60.0
9722768.0	59.95085206223759
9753683.0	59.989585141468496
9784598.0	60.0
9804756.5	60.0
9820214.0	60.0
9846428.0	59.91048865885219
9877343.0	60.0
9908258.0	60.0
9939173.0	59.36464199517297
9970088.0	59.95759947814742
1.0001003E7	60.0
1.0031918E7	60.0
1.0062833E7	60.0
1.0093748E7	60.0
1.0124663E7	59.991842284160434
1.0155578E7	60.0
1.0186493E7	59.99103004933473
1.0217408E7	60.0
1.0248323E7	59.98959236773634
1.0279238E7	59.89114770972723
1.0310153E7	60.0
1.0341068E7	60.0
1.0371983E7	60.0
1.0402898E7	60.0
1.0433813E7	60.0
1.0464728E7	60.0
1.0495643E7	60.0
1.0526558E7	60.0
1.0557473E7	60.0
1.0588388E7	60.0
1.0619303E7	60.0
1.0650218E7	60.0
1.0681133E7	59.727666597895606
1.0712048E7	60.0
1.0742963E7	59.73185506915076
1.0773878E7	59.935469002074214
1.0802968E7	59.44412442396313
1.08184255E7	0.0
1.0835708E7	60.0
1.0866623E7	60.0
1.0897538E7	60.0
1.0928453E7	60.0
1.0959368E7	60.0
1.0990283E7	60.0
1.1021198E7	59.98705780845557
1.1052113E7	59.155727155727156
1.1083028E7	59.99109263657957
1.1113943E7	60.0
1.1144858E7	59.99263532588683
1.1175773E7	60.0
1.1206688E7	60.0
1.1237603E7	60.0
1.1268518E7	59.883847549909255
1.1299433E7	58.54065669589135
1.1330348E7	60.0
1.1361263E7	60.0
1.1392178E7	60.0
1.1423093E7	60.0
1.1454008E7	60.0
1.1484923E7	60.0
1.1515838E7	60.0
1.1546753E7	60.0
1.1577668E7	60.0
1.1608583E7	60.0
1.1639498E7	59.98993288590604
1.1670413E7	60.0
1.1701328E7	60.0
1.1732243E7	60.0
1.1763158E7	60.0
1.1794073E7	60.0
1.1824988E7	60.0
1.1855903E7	59.884357881923314
1.1886818E7	60.0
1.1917733E7	60.0
1.1948648E7	60.0
1.1979563E7	60.0
1.2010478E7	59.986979166666664
1.2041393E7	60.0
1.2072308E7	60.0
1.2103223E7	59.29329794293298
1.2134138E7	59.777015057573074
1.2165053E7	59.994768962510896
1.2195968E7	59.65545529122231
1.2215464E7	60.0
1.2229885E7	0.0
1.2241304E7	60.0
1.2257798E7	60.0
1.2288713E7	60.0
1.23047525E7	43.0
1.232021E7	60.0
1.2339318E7	60.0
1.23494465E7	60.0
1.2360651E7	0.0
