#Position (bp)	insert size
15458.0	371.96774193548384
46373.0	358.8787878787879
77288.0	396.7894736842105
108203.0	326.3125
139118.0	400.68
170033.0	319.875
200948.0	385.3809523809524
231863.0	355.38709677419354
262778.0	388.0
293693.0	389.95238095238096
324608.0	355.43333333333334
355523.0	365.5357142857143
386438.0	535.1333333333333
417353.0	346.20588235294116
448268.0	336.55
479183.0	357.92857142857144
510098.0	334.4583333333333
541013.0	326.0
571928.0	353.4
602843.0	318.25
633758.0	425.47222222222223
664673.0	362.0769230769231
695588.0	405.9736842105263
726503.0	338.72
757418.0	396.2631578947368
788333.0	377.05555555555554
819248.0	316.46153846153845
850163.0	358.55172413793105
881078.0	329.4166666666667
911993.0	367.7692307692308
942908.0	320.9428571428571
973823.0	394.39130434782606
1004738.0	430.44444444444446
1035653.0	325.625
1066568.0	415.8666666666667
1082774.0	51.0
1098231.5	548.5263157894736
1128398.0	366.9583333333333
1159313.0	378.6896551724138
1190228.0	353.6
1221143.0	395.42857142857144
1252058.0	368.1666666666667
1282973.0	376.65384615384613
1313888.0	363.3333333333333
1344803.0	218.0
1375718.0	341.1578947368421
1406633.0	382.88
1437548.0	489.27272727272725
1468463.0	480.2
1499378.0	339.34615384615387
1530293.0	628.2592592592592
1561208.0	371.5
1592123.0	468.2142857142857
1623038.0	374.2352941176471
1653953.0	537.68
1684868.0	354.03225806451616
1715783.0	361.258064516129
1746698.0	632.6538461538462
1777613.0	401.96774193548384
1808528.0	379.6666666666667
1839443.0	378.81481481481484
1870358.0	333.7307692307692
1901273.0	445.7857142857143
1932188.0	370.70588235294116
1963103.0	343.17391304347825
1994018.0	344.0
2024933.0	361.5
2055848.0	312.5945945945946
2086763.0	443.22222222222223
2117678.0	364.875
2148593.0	365.08
2179508.0	311.0238095238095
2210423.0	395.90625
2241338.0	331.9130434782609
2272253.0	448.74285714285713
2303168.0	321.15384615384613
2334083.0	0.0
2356900.0	0.0
2372357.5	273.5
2395913.0	343.1764705882353
2426828.0	365.6111111111111
2457743.0	360.125
2488658.0	448.30434782608694
2519573.0	450.7894736842105
2550488.0	411.1304347826087
2581403.0	403.4347826086956
2612318.0	466.51612903225805
2643233.0	376.3333333333333
2674148.0	382.8235294117647
2705063.0	302.0625
2735978.0	350.92
2766893.0	356.05
2797808.0	343.0625
2828723.0	440.4
2859638.0	374.38709677419354
2890553.0	352.3157894736842
2921468.0	435.0
2952383.0	320.42857142857144
2983298.0	333.04347826086956
3014213.0	374.962962962963
3045128.0	338.32
3076043.0	404.3888888888889
3106958.0	321.7647058823529
3137873.0	424.04545454545456
3168788.0	385.72727272727275
3199703.0	355.05882352941177
3230618.0	404.40625
3261533.0	382.0
3292448.0	417.85185185185185
3323363.0	465.3636363636364
3354278.0	365.5
3385193.0	345.4782608695652
3406192.0	289.5
3421649.5	449.81481481481484
3447023.0	375.9230769230769
3477938.0	365.875
3508853.0	341.48275862068965
3539768.0	352.7857142857143
3570683.0	376.76
3601598.0	328.1333333333333
3632513.0	393.962962962963
3663428.0	362.0
3694343.0	322.9230769230769
3725258.0	328.2962962962963
3756173.0	300.7894736842105
3787088.0	436.05263157894734
3818003.0	389.5217391304348
3848918.0	391.4117647058824
3879833.0	340.0869565217391
3910748.0	376.05555555555554
3941663.0	352.9
3972578.0	529.9583333333334
4003493.0	337.5833333333333
4034408.0	456.46666666666664
4065323.0	400.05555555555554
4096238.0	330.625
4127153.0	337.25925925925924
4158068.0	309.3076923076923
4188983.0	351.0833333333333
4219898.0	391.72727272727275
4250813.0	312.6296296296296
4281728.0	358.4
4298150.0	0.0
4313607.5	323.8
4343558.0	378.4166666666667
4374473.0	408.2
4405388.0	434.6363636363636
4436303.0	361.75
4467218.0	382.08
4498133.0	357.70588235294116
4529048.0	376.53846153846155
4559963.0	357.2903225806452
4590878.0	354.43333333333334
4621793.0	369.6666666666667
4652708.0	451.875
4683623.0	409.54545454545456
4714538.0	329.70588235294116
4745453.0	468.4117647058824
4776368.0	379.2413793103448
4807283.0	374.08
4838198.0	366.3157894736842
4869113.0	391.04347826086956
4900028.0	374.4642857142857
4927000.5	387.60714285714283
4942458.0	322.0
4961858.0	329.4761904761905
4992773.0	374.27272727272725
5023688.0	397.375
5054603.0	384.4516129032258
5085518.0	324.6666666666667
5116433.0	483.4117647058824
5147348.0	347.5
5178263.0	373.38461538461536
5209178.0	548.1666666666666
5240093.0	377.2916666666667
5271008.0	337.82608695652175
5301923.0	334.28
5332838.0	383.6296296296296
5363753.0	375.2307692307692
5394668.0	383.72727272727275
5425583.0	352.6969696969697
5456498.0	369.6
5487413.0	388.0769230769231
5518328.0	290.95
5549243.0	303.93333333333334
5580158.0	495.23809523809524
5611073.0	346.89285714285717
5641988.0	387.6666666666667
5672903.0	426.72727272727275
5701876.0	278.4117647058824
5717333.5	427.0
5734733.0	393.9583333333333
5765648.0	382.2142857142857
5796563.0	389.89285714285717
5827478.0	447.02702702702703
5858393.0	379.15
5889308.0	487.6923076923077
5920223.0	268.5
5951138.0	563.0
5982053.0	349.9
6012968.0	360.09090909090907
6043883.0	432.4
6074798.0	349.3636363636364
6105713.0	407.4375
6136628.0	353.5882352941176
6167543.0	290.25
6198458.0	366.94444444444446
6229373.0	405.3939393939394
6260288.0	347.06451612903226
6291203.0	877.75
6322118.0	339.2
6353033.0	429.6764705882353
6383948.0	347.6470588235294
6414863.0	273.0
6445778.0	348.1578947368421
6476693.0	362.6842105263158
6507608.0	495.82758620689657
6538523.0	426.3
6569438.0	369.962962962963
6600353.0	402.85714285714283
6631268.0	490.2857142857143
6662183.0	341.3
6693098.0	441.4
6724013.0	599.3214285714286
6754928.0	377.47058823529414
6785843.0	324.1666666666667
6816758.0	426.6818181818182
6847673.0	416.48148148148147
6878588.0	343.96875
6909503.0	348.55172413793105
6940418.0	372.7142857142857
6971333.0	359.28
7002248.0	414.4
7033163.0	451.7857142857143
7064078.0	382.90909090909093
7094993.0	374.5
7125908.0	391.2
7156823.0	569.2941176470588
7187738.0	448.5483870967742
7218653.0	500.02702702702703
7249568.0	449.61764705882354
7280483.0	402.875
7311398.0	411.61538461538464
7342313.0	21299.95
7373228.0	366.08
7404143.0	362.3
7435058.0	357.76190476190476
7465973.0	442.22727272727275
7496888.0	436.3809523809524
7527803.0	385.8
7558718.0	352.6333333333333
7589633.0	386.48
7620548.0	293.11764705882354
7651463.0	382.8695652173913
7682378.0	361.6969696969697
7713293.0	357.16
7744208.0	362.77272727272725
7775123.0	398.30434782608694
7806038.0	387.2258064516129
7836953.0	393.5625
7867868.0	267.92857142857144
7898783.0	621.741935483871
7929698.0	391.2
7960613.0	350.44
7991528.0	409.72
8022443.0	382.34615384615387
8053358.0	363.55555555555554
8084273.0	335.2
8115188.0	381.53846153846155
8146103.0	399.6470588235294
8177018.0	421.97058823529414
8207933.0	370.64285714285717
8238848.0	474.1818181818182
8269763.0	382.3
8300678.0	487.1904761904762
8331593.0	400.741935483871
8362508.0	381.9230769230769
8393423.0	448.05263157894734
8424338.0	267.0
8455253.0	491.03125
8486168.0	380.3636363636364
8517083.0	361.4761904761905
8547998.0	441.8333333333333
8578913.0	363.12
8609828.0	343.3636363636364
8640743.0	393.8787878787879
8671658.0	445.125
8702573.0	390.7
8733488.0	409.53846153846155
8764403.0	288.0
8795318.0	405.0833333333333
8826233.0	399.1818181818182
8857148.0	316.65
8888063.0	431.3333333333333
8907423.5	0.0
8922881.0	449.0625
8949893.0	441.25
8980808.0	368.59090909090907
9011723.0	373.2142857142857
9042638.0	412.9230769230769
9073553.0	418.76190476190476
9104468.0	388.51612903225805
9135383.0	364.9130434782609
9166298.0	360.3333333333333
9197213.0	422.3181818181818
9228128.0	344.1875
9259043.0	313.8333333333333
9289958.0	405.09090909090907
9320873.0	369.0
9351788.0	346.82608695652175
9382703.0	369.25
9413618.0	326.0
9444533.0	403.1
9475448.0	335.0
9506363.0	323.6818181818182
9537278.0	440.43333333333334
9568193.0	509.3666666666667
9599108.0	375.10714285714283
9630023.0	392.45714285714286
9660938.0	352.6
9691853.0	329.03225806451616
9722768.0	543.7916666666666
9753683.0	395.89285714285717
9784598.0	373.2352941176471
9804756.5	370.92857142857144
9820214.0	417.25
9846428.0	415.6875
9877343.0	352.5833333333333
9908258.0	349.6
9939173.0	562.5862068965517
9970088.0	355.54545454545456
1.0001003E7	318.0
1.0031918E7	380.5
1.0062833E7	432.39130434782606
1.0093748E7	461.0
1.0124663E7	389.7037037037037
1.0155578E7	407.8888888888889
1.0186493E7	418.93939393939394
1.0217408E7	426.48387096774195
1.0248323E7	399.42857142857144
1.0279238E7	376.3
1.0310153E7	383.0
1.0341068E7	349.5
1.0371983E7	339.0
1.0402898E7	391.1111111111111
1.0433813E7	414.0769230769231
1.0464728E7	334.7894736842105
1.0495643E7	354.17391304347825
1.0526558E7	389.07142857142856
1.0557473E7	347.7878787878788
1.0588388E7	301.4230769230769
1.0619303E7	276.92857142857144
1.0650218E7	370.4
1.0681133E7	447.82142857142856
1.0712048E7	349.95238095238096
1.0742963E7	343.1111111111111
1.0773878E7	358.625
1.0802968E7	467.22222222222223
1.08184255E7	0.0
1.0835708E7	383.625
1.0866623E7	349.8333333333333
1.0897538E7	352.57142857142856
1.0928453E7	377.57142857142856
1.0959368E7	323.5416666666667
1.0990283E7	357.4736842105263
1.1021198E7	714.5882352941177
1.1052113E7	306.7
1.1083028E7	397.21875
1.1113943E7	402.15625
1.1144858E7	393.6896551724138
1.1175773E7	435.7692307692308
1.1206688E7	379.8695652173913
1.1237603E7	441.1333333333333
1.1268518E7	310.4117647058824
1.1299433E7	374.76190476190476
1.1330348E7	325.59090909090907
1.1361263E7	347.76190476190476
1.1392178E7	360.5
1.1423093E7	317.5
1.1454008E7	341.03125
1.1484923E7	351.3333333333333
1.1515838E7	358.61538461538464
1.1546753E7	401.61538461538464
1.1577668E7	397.55555555555554
1.1608583E7	379.0
1.1639498E7	346.48148148148147
1.1670413E7	358.8421052631579
1.1701328E7	348.4
1.1732243E7	380.17857142857144
1.1763158E7	405.37931034482756
1.1794073E7	344.0
1.1824988E7	367.6060606060606
1.1855903E7	348.1666666666667
1.1886818E7	378.7083333333333
1.1917733E7	356.6666666666667
1.1948648E7	444.1764705882353
1.1979563E7	357.8888888888889
1.2010478E7	377.2
1.2041393E7	395.7692307692308
1.2072308E7	480.7916666666667
1.2103223E7	325.4230769230769
1.2134138E7	337.8333333333333
1.2165053E7	323.04545454545456
1.2195968E7	340.0
1.2215464E7	388.25
1.2229885E7	0.0
1.2241304E7	401.3333333333333
1.2257798E7	319.90909090909093
1.2288713E7	315.8095238095238
1.23047525E7	0.0
1.232021E7	429.8333333333333
1.2339318E7	413.0
1.23494465E7	415.0
1.2360651E7	0.0
