# Position (bp)	A	C	G	T	N
0.0	20.558555610102005	26.613211149293626	39.66072110402008	13.167512136584303	0.0
1.0	21.45857197403589	24.076801396389026	16.298478154148256	38.16614847542682	0.0
2.0	27.37868307826371	24.040084962692664	17.13414302053265	31.447088938510976	0.0
3.0	18.55311753204432	27.291983489028894	13.84423202259396	40.310666956332824	0.0
4.0	33.82758807294767	15.774663131121812	14.400129877157855	35.99761891877266	0.0
5.0	37.77598276790523	14.932687129779213	25.756596661281637	21.534733441033925	0.0
6.0	31.07156298725738	17.785902467874617	25.13038335394376	26.012151190924243	0.0
7.0	33.8629166443025	19.00059041382642	23.17642638613064	23.960066555740433	0.0
8.0	19.400428265524624	32.296573875803	24.80728051391863	23.495717344753746	0.0
9.0	26.53072118720974	23.311802701115678	17.631986334276412	32.52548977739818	0.0
10.0	24.75901368695745	19.071204132715554	29.988816104809075	26.18096607551792	0.0
11.0	25.3524123623597	22.155433799670195	21.79371243151231	30.69844140645779	0.0
12.0	21.874170427395807	23.562516591452084	26.466684364215553	28.096628616936552	0.0
13.0	21.99671453553071	29.2406337766944	21.641672407397593	27.1209792803773	0.0
14.0	28.210147611237502	23.51198349293688	23.23157504893921	25.046293846886407	0.0
15.0	28.577465532724105	22.42353811209128	22.92007817864878	26.078918176535844	0.0
16.0	27.540897097625326	22.226912928759894	22.08970976253298	28.142480211081793	0.0
17.0	27.81729097518571	22.00094831673779	22.190611664295876	27.991149043780624	0.0
18.0	27.463973913958135	21.994319974755445	22.77269380456506	27.769012306721365	0.0
19.0	27.430792666911803	22.3984871565898	22.9237800073541	27.246940169144295	0.0
20.0	28.05793146875164	22.333000997008973	22.34349582830456	27.26557170593483	0.0
21.0	27.019659239842724	22.589777195281783	22.977719528178245	27.412844036697248	0.0
22.0	26.73609294049924	23.119995813491027	22.800774504160344	27.34313674184939	0.0
23.0	26.75408808317225	22.36560263309127	22.982080351078835	27.89822893265765	0.0
24.0	27.166032027541597	22.88873819832038	22.523603359240518	27.416410202910647	0.0052162119868551455
25.0	27.959789572373563	22.412625657586332	22.730350539090576	26.89723423094953	0.0
26.0	27.478414646832416	23.072922084677	22.453968584208884	26.9894933943618	0.005201289919900136
27.0	27.480519480519483	22.441558441558442	23.02857142857143	27.04935064935065	0.0
28.0	27.245835279464426	22.637396855052156	23.363952462504542	26.75281540297888	0.0
29.0	27.697170691263345	22.743289460047674	22.11628147994611	27.443258368742875	0.0
30.0	26.69877770872177	23.43070229956495	23.249430287963538	26.62108970374974	0.0
31.0	27.35888140859658	23.076126359399275	22.22682547902641	27.338166752977735	0.0
32.0	26.872702800641925	22.70538903556453	23.35248744629083	27.06942071750272	0.0
33.0	26.591450160438878	23.087672083635237	22.7564434323569	27.56443432356899	0.0
34.0	27.14581178903826	22.5387797311272	23.624612202688727	26.69079627714581	0.0
35.0	27.217710650183623	22.14348523250401	23.348678425490093	27.29012569182227	0.0
36.0	27.08031463465121	23.411302007865867	22.94555992548127	26.562823432001657	0.0
37.0	26.91193211218048	23.03114974645555	22.524060850667492	27.532857290696473	0.0
38.0	27.43697261479526	22.2446549671274	22.881399803282083	27.43697261479526	0.0
39.0	26.932435930623868	23.173699197514885	22.640434895159203	27.253429976702044	0.0
40.0	27.674454747966635	22.877272962751903	22.36439931616847	27.08387297311299	0.0
41.0	26.99202155217076	22.75411874417159	22.691949020826858	27.561910682830792	0.0
42.0	26.929256284011398	22.233739310702255	23.270277273905158	27.566727131381185	0.0
43.0	26.988651085660987	22.74965020469503	23.00357568533969	27.258123024304297	0.0
44.0	26.924073594195384	22.38922000518269	23.0007774034724	27.685928997149524	0.0
45.0	26.778871051268773	22.90523045054376	22.936302433972035	27.379596064215434	0.0
46.0	27.640845070422536	22.726801988400993	22.333264291632148	27.299088649544323	0.0
47.0	27.325912503235827	23.05462076106653	22.692208128397617	26.927258607300026	0.0
48.0	26.841260804306195	23.10439418249573	22.67998550799648	27.374359505201596	0.0
49.0	27.003367003367	23.237503237503237	22.543382543382542	27.21056721056721	0.005180005180005181
50.0	27.744676441635146	23.206051499922285	22.200922232008704	26.848349826433864	0.0
51.0	27.33447399802976	22.725151656556232	23.031057188780007	26.909317156634	0.0
52.0	27.186479340556797	22.805744206542588	22.567266317590338	27.44051013531028	0.0
53.0	26.954807243293725	22.663830228817517	22.81948840346599	27.56187412442277	0.0
54.0	26.61164746184989	23.39354302917056	22.8018270528392	27.192982456140353	0.0
55.0	26.96920920089309	23.038579365491458	23.023002232722366	26.96920920089309	0.0
56.0	27.461570419609473	22.507270461154967	22.663066057332777	27.368093061902783	0.0
57.0	27.635268459860836	23.055353619275106	22.328383009658324	26.98099491120573	0.0
58.0	27.043437645959834	22.97991592713685	23.073330219523587	26.903316207379728	0.0
59.0	26.805836838552217	22.957885444254035	22.807290855273408	27.42898686192034	0.0
60.0	27.29255374389864	22.562052134178003	22.826877141966975	27.31851697995638	0.0
61.0	27.18254998701636	22.56556738509478	23.55751752791483	26.694365099974032	0.0
62.0	27.425305274097166	23.460639127045983	21.93816575733957	27.175889841517275	0.0
63.0	27.26469518216309	22.883426017358765	23.05493477469986	26.796944025778284	0.0
64.0	27.225457570715474	22.894134775374376	22.602953410981698	27.27745424292845	0.0
65.0	27.434963579604577	23.168574401664934	22.669094693028097	26.727367325702396	0.0
66.0	27.82056619483764	22.720649458784347	23.105745212323065	26.353039134054956	0.0
67.0	27.556226572261554	22.985214493960846	22.324031653477718	27.12411495210329	0.010412328196584757
68.0	26.801707977504684	23.198292022495316	22.83378462820246	27.16621537179754	0.0
69.0	26.68646142626452	23.34218888367974	23.243215085690473	26.728134604365266	0.0
70.0	27.15766446169071	23.120995885202355	22.798062399083285	26.92327725402365	0.0
71.0	27.140103162611368	22.617621007659043	22.86771218673475	27.374563642994843	0.0
72.0	27.07942464040025	23.134250573274965	22.66520742130498	27.121117365019803	0.0
73.0	27.38969630671459	22.67020888680523	22.732718653956347	27.207376152523832	0.0
74.0	27.817433439274737	22.67493356953056	23.22200802375866	26.285624967436043	0.0
75.0	26.875553933580104	23.356446483499298	22.75168135133726	27.016318231583337	0.0
76.0	27.661016949152543	22.4980443285528	22.466753585397655	27.374185136897	0.0
77.0	27.149864328950112	22.35441452723857	23.058860363180962	27.43686078063035	0.0
78.0	27.317327766179538	22.369519832985386	22.90187891440501	27.41127348643006	0.0
79.0	27.398548075416514	22.959210320154593	22.698072805139187	26.94416879928971	0.0
80.0	27.097481976804932	23.04879322954759	22.81893219099363	27.03479260265385	0.0
81.0	27.600627286983798	22.80710925248301	22.822791427077888	26.769472033455305	0.0
82.0	27.23613361911234	23.242197710282817	22.442364995556485	27.079303675048354	0.0
83.0	27.169081115004445	22.708017363108624	22.948590554887296	27.17431096699963	0.0
84.0	27.823677055009412	22.296590671407653	22.887471240326292	26.992261033256643	0.0
85.0	27.742036717401536	22.736544798368115	22.60578482138187	26.915633662848474	0.0
86.0	27.20234358652438	22.358233940154847	23.03829252981795	27.401129943502823	0.0
87.0	27.11864406779661	23.106298388784264	22.60410127641766	27.17095626700147	0.0
88.0	27.30175346767862	23.056791415859724	22.993980633342055	26.647474483119606	0.0
89.0	27.517411111692937	22.930303188982563	22.45378855317589	27.09849714614861	0.0
90.0	27.34272693939553	22.460845424545596	23.30941281231994	26.887014823738937	0.0
91.0	27.550432276657062	23.122871364946292	22.546502488865602	26.780193869531043	0.0
92.0	27.052532242843665	23.141449093006187	22.695816294432213	27.11020236971794	0.0
93.0	27.04234220053518	22.556272627105304	23.42725221680046	26.974132955559053	0.0
94.0	27.34333998110633	22.819355515902174	22.62517056785977	27.21213393513173	0.0
95.0	27.40445191096178	23.125787484250317	22.795044099118016	26.67471650566989	0.0
96.0	27.103245457409937	22.76546581241466	23.18558974897595	26.945698981199456	0.0
97.0	27.30854081311062	22.65994327135203	22.870049374934343	27.161466540603	0.0
98.0	27.539278020072512	22.52114970311597	22.489622195365456	27.44995008144606	0.0
99.0	26.497163269594452	23.733977726413112	22.87770540029418	26.891153603698253	0.0
100.0	27.18053804119378	22.966582597730138	22.74590163934426	27.106977721731816	0.0
101.0	27.476743574919848	22.867504073159196	22.956850790981235	26.69890156093972	0.0
102.0	27.166140904311252	22.56572029442692	23.107255520504733	27.160883280757098	0.0
103.0	27.689798495291207	23.044141632030303	22.444362603251435	26.82169726942705	0.0
104.0	27.090899521027424	22.469603663350703	22.895941891678508	27.543554923943365	0.0
105.0	27.155943982310205	22.417605559650415	22.886174581446774	27.540275876592606	0.0
106.0	27.34840103261156	22.62262262262262	22.70691744375955	27.32205890100627	0.0
107.0	27.16257507112001	23.206195342956484	22.963860499420505	26.667369086503	0.0
108.0	27.15099114297765	23.175875158161112	23.102066638549136	26.571067060312103	0.0
109.0	27.47733502002952	22.68606367278094	22.70187644950453	27.13472485768501	0.0
110.0	27.46100337268128	22.53899662731872	22.502107925801013	27.497892074198987	0.0
111.0	26.46981281307672	22.873714737674664	23.05826522541524	27.598207223833377	0.0
112.0	27.044854881266488	23.472295514511874	23.055408970976256	26.427440633245382	0.0
113.0	27.62970391090938	22.932390352034624	22.552382963002056	26.88552277405394	0.0
114.0	27.159972555021906	22.921834591228162	22.874333667599092	27.043859186150843	0.0
115.0	27.291446673706442	23.416050686378036	22.381203801478353	26.91129883843717	0.0
116.0	27.579103058475518	23.268712693465744	22.14357403201099	27.008610216047753	0.0
117.0	26.51302922987473	22.781330937153125	23.389185474919394	27.31645435805275	0.0
118.0	27.282344229345178	22.91336083782926	22.68591981381572	27.118375119009837	0.0
119.0	26.964805504101612	22.651495104525008	22.709711563905795	27.673987827467585	0.0
120.0	27.02674079957638	23.43658988615303	22.917659518136087	26.619009796134495	0.0
121.0	27.08443691068969	22.67189320902638	22.836105519652506	27.40756436063142	0.0
122.0	27.057951054137092	23.058586714694354	22.724864922131584	27.158597309036974	0.0
123.0	26.740858505564386	22.73449920508744	23.555908850026498	26.968733439321674	0.0
124.0	27.305509890226443	22.076682399109085	22.850930688868857	27.766877021795622	0.0
125.0	27.21774193548387	22.6018675721562	22.867147707979626	27.313242784380304	0.0
126.0	26.587048832271766	22.983014861995755	22.85031847133758	27.579617834394902	0.0
127.0	26.817481811905903	23.344485157453136	23.08427592799108	26.75375710264988	0.0
128.0	26.564244325128918	23.475625963531975	22.917441922279515	27.042687789059595	0.0
129.0	26.987926174139677	23.126429445242273	22.536035317270358	27.349609063347696	0.0
130.0	27.92231976589519	22.293163075285978	23.054003724394786	26.730513434424047	0.0
131.0	26.90649779149593	22.675749028790378	22.798148049598215	27.61960513011548	0.0
132.0	26.747963150327493	22.754140263059803	23.441077799669845	27.05681878694286	0.0
133.0	26.950543594116393	22.814964826263058	22.463227456832232	27.77126412278832	0.0
134.0	27.129674081186323	22.579612738038087	23.006347682295832	27.284365498479758	0.0
135.0	26.91856121250934	23.006724303554275	22.750560358629524	27.324154125306865	0.0
136.0	27.142247358873117	22.815067762245224	22.57496531853591	27.46771956034575	0.0
137.0	27.321266485130014	23.567729190026164	22.382401623151264	26.728602701692562	0.0
138.0	27.105249105569502	22.84936188391093	22.774603513643402	27.270785496876165	0.0
139.0	26.72791368443542	23.298792864010256	23.021044760175194	26.952248691379125	0.0
140.0	27.032661570535094	22.670658042444007	23.28005559416261	27.01662479285829	0.0
141.0	27.01097136740701	23.162964945143163	23.152261172063152	26.673802515386676	0.0
142.0	27.239145564537715	23.282830986669524	22.790299266556026	26.68772418223674	0.0
143.0	27.393588506486545	22.595689932454167	23.340838426074836	26.669883134984453	0.0
144.0	27.14347032943449	22.937010408842152	23.258933361948706	26.660585899774652	0.0
145.0	26.59831445595577	23.125234848891512	22.921251811691448	27.355198883461266	0.0
146.0	26.817473537155443	22.717747568642203	22.975659556176456	27.489119338025898	0.0
147.0	27.129032258064516	22.462365591397848	22.865591397849464	27.543010752688176	0.0
148.0	27.218425442608833	23.40311036969273	22.386051767744714	26.99241241995372	0.0
149.0	26.80812106198503	22.925305616888362	23.29689267058	26.969680650546614	0.0
150.0	26.620332956198478	23.597866494262163	22.96751252626475	26.814288023274607	0.0
151.0	27.69902441653641	22.821107098582438	22.45997951813723	27.01988896674392	0.0
152.0	27.60908257375546	22.501483199395935	23.073189148373874	26.816245078474733	0.0
153.0	27.358592400690846	22.943652849740932	22.684585492227978	27.01316925734024	0.0
154.0	27.55901258575055	22.63814616755793	22.859612164425	26.94322908226652	0.0
155.0	26.761173033221514	23.558056487393138	22.573314576344554	27.107455903040794	0.0
156.0	26.514372327180208	23.482921019866833	22.914523899745575	27.088182753207384	0.0
157.0	28.074547621627477	23.06317044100119	21.827933687290063	27.034348250081266	0.0
158.0	27.14851163042889	23.01686276636122	22.64273708181966	27.19188852139023	0.0
159.0	27.05078125	22.347005208333336	22.932942708333336	27.669270833333332	0.0
160.0	27.628720399739297	22.708016510971106	22.93612861177493	26.727134477514664	0.0
161.0	27.680269521273704	22.37135249687551	22.566972776177796	27.381405205672987	0.0
162.0	26.866808070919674	23.15222711698483	23.24468374394953	26.736281068145974	0.0
163.0	27.622054101126654	22.865073749523756	22.168399281554453	27.344472867795133	0.0
164.0	27.17065460293236	23.300812121872784	22.4069330135717	27.12160026162315	0.0
165.0	27.79202356920727	22.598068634404495	22.794478694964265	26.81542910142397	0.0
166.0	27.219613410505623	22.813148411051653	22.796767500273017	27.170470678169707	0.0
167.0	27.18579234972678	23.14207650273224	22.721311475409838	26.95081967213115	0.0
168.0	26.668125136731568	23.381098227958873	22.527893239991247	27.42288339531831	0.0
169.0	27.53297936394986	22.748918933712847	22.776287700476217	26.941814001861076	0.0
170.0	27.084931506849312	23.134246575342466	22.723287671232878	27.057534246575344	0.0
171.0	26.5660998354361	23.335161821173887	23.066374108612177	27.032364234777837	0.0
172.0	26.804350214215095	22.59145336702186	23.646050752499175	26.952652971547842	0.0054926947160276835
173.0	26.95437053326003	22.495876855415066	22.96316657504123	27.586586036283673	0.0
174.0	26.696011004126547	22.905089408528198	22.932599724896836	27.466299862448416	0.0
175.0	27.0494962285966	23.823156967461323	22.165941749710953	26.96140505423113	0.0
176.0	27.293780326422585	22.491177767975298	22.89920599911778	27.31583590648434	0.0
177.0	26.396555531022305	23.123206005740784	23.08456612938839	27.39567233384853	0.0
178.0	26.820643164990603	22.880981323903193	22.864404906619516	27.433970604486685	0.0
179.0	27.694096799202573	23.335917598848155	22.63816590984605	26.331819692103224	0.0
180.0	27.06345684490792	22.459507432882184	23.236077213223876	27.240958508986026	0.0
181.0	26.959178006109415	23.14357123021383	22.7214662593724	27.175784504304364	0.0
182.0	26.8185607113087	22.867463184217836	22.85079188663518	27.46318421783829	0.0
183.0	27.166536878406944	22.738903103793525	23.100456113027033	26.994103904772498	0.0
184.0	26.72159438846518	23.142014140177032	22.746757223180982	27.389634248176808	0.0
185.0	26.840550632558656	23.17895558156384	22.694086830518863	27.286406955358633	0.0
186.0	26.943467827445726	22.841676432836657	23.500195323399744	26.714660416317876	0.0
187.0	27.221911682504192	22.895472330911122	22.856344326439352	27.026271660145333	0.0
188.0	27.631947165164828	23.204790955392625	22.342866737560865	26.820395141881683	0.0
189.0	26.767195470598125	23.555132014126354	22.94411121699647	26.733561298279053	0.0
190.0	26.869946091644202	22.641509433962266	23.624213836477985	26.864330637915547	0.0
191.0	26.766029246344207	23.475815523059616	22.919010123734534	26.839145106861643	0.0
192.0	27.169811320754718	22.855533652492255	23.103351168684878	26.871303858068153	0.0
193.0	27.036326714801444	23.05956678700361	21.779106498194945	28.125	0.0
194.0	27.29685470664634	22.74549664012649	22.621266022926196	27.330735784064604	0.005646846236376983
195.0	27.4120574595634	22.910304264223505	23.221355050333674	26.456283225879424	0.0
196.0	26.845028908287045	23.160639383289876	23.381702754789707	26.612628953633376	0.0
197.0	27.24278900749489	22.433568021803314	22.967295026118556	27.356347944583238	0.0
198.0	27.30891719745223	23.379208371246587	22.22474977252047	27.081437670609642	0.005686988171064605
199.0	27.040264251950568	23.156216185431973	22.615183096987302	27.188336465630158	0.0
200.0	27.475035663338087	23.121255349500714	22.425106990014264	26.978601997146935	0.0
201.0	25.675907402114888	23.601028865390113	23.39525578736782	27.32780794512718	0.0
202.0	26.71436748712078	23.188322839152832	23.125357756153406	26.971951917572984	0.0
203.0	27.589567211235313	23.14703353396389	22.522212668386356	26.741186586414443	0.0
204.0	26.786841954187956	23.175842470865145	23.152879040128596	26.884436534818303	0.0
205.0	26.743718015065266	23.023402909550917	22.758898280719915	27.473980794663905	0.0
206.0	26.928390513469953	23.134929772046974	22.760764448537877	27.1759152659452	0.0
207.0	26.880479926165208	22.404245500692202	23.344485463774802	27.370789109367788	0.0
208.0	27.131962098451584	23.10492257915415	23.45736075803097	26.305754564363298	0.0
209.0	27.458589134715627	22.489285300590755	22.929456735781304	27.12266882891231	0.0
210.0	26.649260226283726	22.66898752538439	23.32463011314186	27.35712213519002	0.0
211.0	27.088416405251543	23.260137097711166	22.626931567328917	27.024514929708378	0.0
212.0	27.517755268366518	22.45313773431133	23.3612760507626	26.66783094655955	0.0
213.0	26.884920634920633	23.22595704948646	23.126750700280112	26.75653594771242	0.005835667600373483
214.0	27.235510848587634	23.638809287092812	22.41651558570677	26.709164278612786	0.0
215.0	27.13255554904145	23.368704930527056	22.835199624787478	26.663539895644018	0.0
216.0	27.16317893251822	23.25417352457089	22.625205737126734	26.957441805784153	0.0
217.0	27.61972079872769	22.660069505801967	22.701301761206338	27.018907934264004	0.0
218.0	26.673745059871408	23.89547572700997	22.8573113903144	26.567569161800268	0.005898661003952103
219.0	27.05082742316785	23.77068557919622	22.56501182033097	26.613475177304963	0.0
220.0	27.07777975238434	23.47609738759552	22.095847402405074	27.35027545761507	0.0
221.0	27.21177238473862	23.414228920666943	22.642852904527384	26.73114579006705	0.0
222.0	27.182964549131572	23.48917439923864	22.436354984534855	26.891506067094934	0.0
223.0	26.7856077331583	23.67086341667164	22.519243391610477	27.024285458559582	0.0
224.0	26.87200956937799	23.40311004784689	23.014354066985646	26.710526315789473	0.0
225.0	26.94772142044434	24.234984130786273	22.312713336127914	26.504581112641475	0.0
226.0	27.57875787578758	23.03030303030303	22.664266426642666	26.726672667266726	0.0
227.0	27.465254798146923	23.62072077492329	22.25497864147765	26.65904578545214	0.0
228.0	26.44538322269161	23.663246831623415	23.349426674713335	26.541943270971636	0.0
229.0	26.91795740561471	23.299854791868345	22.88238141335915	26.89375605033882	0.006050338818973862
230.0	27.395681707908782	23.034934497816593	22.719553614750122	26.849830179524503	0.0
231.0	27.555366269165248	23.10172791433439	22.554149428084692	26.788756388415674	0.0
232.0	26.44007810593117	23.059555772516475	23.15718818647791	27.343177935074443	0.0
233.0	26.760477210156008	23.420006118078923	22.36769654328541	27.45182012847966	0.0
234.0	26.876112167883658	23.311038841504573	22.94900902006504	26.863839970546728	0.0
235.0	27.58323589143947	22.709089790140933	23.398362976183147	26.309311342236448	0.0
236.0	27.268235439441664	23.72923228954357	22.240751034525353	26.76178123648941	0.0
237.0	27.122422441018017	23.301752430491053	23.085020744318534	26.490804384172396	0.0
238.0	27.463651050080774	23.145271529762645	22.256741642848265	27.134335777308316	0.0
239.0	26.63300922463226	23.092744951383697	22.80603340812765	27.468212415856396	0.0
240.0	26.979069040924713	22.842861605748205	22.924086223055294	27.25398313027179	0.0
241.0	26.908863138114626	23.069213905418103	22.69339179455058	27.328531161916693	0.0
242.0	26.945317410433688	23.142677561282213	22.727844123192963	27.184160905091137	0.0
243.0	26.89441778226825	23.345541803485727	23.18135892902248	26.578681485223544	0.0
244.0	26.20405576679341	23.479087452471482	23.00380228136882	27.313054499366284	0.0
245.0	26.975147778554632	22.443272103222526	23.225068327718805	27.356511790504033	0.0
246.0	27.196225933953844	23.19265587147775	22.567894938161416	27.04322325640699	0.0
247.0	26.75542469436088	23.100556871279522	22.83812327977981	27.305895154579783	0.0
248.0	27.088818958319955	24.340119452828976	22.14372872647871	26.42733286237236	0.0
249.0	27.22756306858507	22.833731208465064	22.607910187754047	27.33079553519582	0.0
250.0	27.136198860693938	23.200414293112377	23.278094251683065	26.385292594510616	0.0
251.0	27.65570146924977	22.435314003380576	22.272786373683527	27.636198153686127	0.0
252.0	27.52754057753732	23.27097320904765	22.873345935727787	26.328140277687247	0.0
253.0	27.131377801006074	23.41412425687594	22.36231789377409	27.092180048343895	0.0
254.0	26.193751228139124	23.115215824981988	22.754961682059342	27.936071264819546	0.0
255.0	26.815311760063143	23.158379373848987	22.62562483556959	27.400684030518285	0.0
256.0	27.546372697867845	23.341474684797674	22.6483596276982	26.463792989636282	0.0
257.0	27.543046357615896	23.576158940397352	22.503311258278146	26.37748344370861	0.0
258.0	26.73985362608117	23.64604125083167	22.335329341317365	27.27877578176979	0.0
259.0	27.711406260428483	23.39985316692251	22.438763932456784	26.44997664019222	0.0
260.0	27.241055875653224	22.959935682701328	22.79914243601769	26.999866005627766	0.0
261.0	26.85341054474446	23.56070298296411	23.183623998383947	26.402262473907477	0.0
262.0	27.269035532994923	23.194585448392555	22.95093062605753	26.585448392554987	0.0
263.0	27.356759328485015	23.407870590634133	22.59226534357371	26.643104737307144	0.0
264.0	27.073520376817527	23.769540582974948	22.34282203563383	26.81411700457369	0.0
265.0	27.503941866045107	23.472955371220948	22.88338931925687	26.13971344347707	0.0
266.0	27.32466102278202	23.89703351916856	22.6994287287494	26.07887672930002	0.0
267.0	26.94648043147559	23.938597704328586	22.313649564375602	26.801272299820216	0.0
268.0	27.255065223424925	23.605328892589508	22.73105745212323	26.39467110741049	0.013877324451845686
269.0	26.98766636471326	23.656888021740645	22.960072468817504	26.39537314472859	0.0
270.0	26.759674705552438	22.833707234997195	22.9388670779585	27.453729669097026	0.014021312394840156
271.0	26.771486991468656	23.746739053796798	22.9147571035747	26.567016851159842	0.0
272.0	26.97760136092997	23.979302523390984	22.71051885455061	26.33257726112844	0.0
273.0	26.97700903978931	22.969606377678126	23.026549932379528	27.026834650153038	0.0
274.0	27.291562477673786	23.09780667285847	22.89776380652997	26.71286704293777	0.0
275.0	26.64128717138342	24.041086050854762	22.834362878896712	26.483263898865104	0.0
276.0	26.845976348428035	23.903951543120854	22.043553504470722	27.206518603980385	0.0
277.0	27.102803738317753	23.552850829529813	23.321017170180394	26.023328261972033	0.0
278.0	27.148991920809372	23.567945265303152	22.548948249508697	26.734114564378775	0.0
279.0	27.135127230184263	23.442527054694352	22.499268792044457	26.923076923076923	0.0
280.0	27.483103144284453	23.332353805465765	23.111960035263003	26.072583014986776	0.0
281.0	26.120670556088914	24.42951037589543	23.18883391182335	26.260985156192305	0.0
282.0	26.5974025974026	23.413729128014843	23.116883116883116	26.871985157699445	0.0
283.0	27.626285203397405	23.260318879451646	22.798390701832812	26.31500521531813	0.0
284.0	26.680656524020087	23.083264633140974	23.21816682904894	27.017912013790003	0.0
285.0	27.829620710415416	23.59271523178808	22.350993377483444	26.226670680313063	0.0
286.0	26.8335097535158	23.756237713594437	22.644790564040527	26.765461968849237	0.0
287.0	26.684390429168246	23.965058868211166	22.415495632358525	26.93505507026206	0.0
288.0	26.513761467889907	24.04434250764526	22.24770642201835	27.194189602446485	0.0
289.0	27.34687596183441	23.307171437365344	22.753154816866726	26.59279778393352	0.0
290.0	26.993342622697014	23.215668060071216	22.534448056974764	27.256541260257006	0.0
291.0	26.625604241384686	24.348978637143304	22.98456260720412	26.04085451426789	0.0
292.0	27.43577694235589	22.650375939849624	23.175125313283207	26.73872180451128	0.0
293.0	27.34442779399006	23.732155532770722	22.667402792018297	26.25601388122092	0.0
294.0	26.814180347370925	24.276310571813784	22.682211119041952	26.22729796177334	0.0
295.0	26.936268644811356	23.881311318497247	22.541277817659726	26.641142219031664	0.0
296.0	27.168048957242934	23.407681777920928	22.489733472904422	26.93453579193172	0.0
297.0	26.529282397979966	23.556243381933697	23.01050745296082	26.90396676712552	0.0
298.0	27.55068128946494	22.125290794283814	23.122299767364574	27.201728148886673	0.0
299.0	28.272574808014827	19.957630858857797	24.15923735545944	27.610556977667933	0.0
300.0	38.603646833013435	0.0	31.573896353166987	29.822456813819574	0.0
