"sample","T.cell..CD4..naive..activated.","NK.cell..CD56dim.CD16.","T.cell..CD4..TFH","T.cell..CD4..memory.TREG","T.cell..CD4..TH1.17","B.cell..naive","T.cell..CD4..TH2","T.cell..CD4..TH1","T.cell..CD4..naive","T.cell..CD4..TH17","Monocyte..classical","Monocyte..non.classical","T.cell..CD4..naive.TREG","T.cell..CD8..naive","T.cell..CD8..naive..activated."
"T.cell..CD4..naive..activated.",1,0.643808003174567,0.718138506960335,0.680517530465282,0.733195952864642,0.626283794123579,0.733092134017796,0.723925360867552,0.725108669796314,0.727720222694737,0.404130639088689,0.563953089276515,0.735952130626758,0.69804596155501,0.907342913629505
"NK.cell..CD56dim.CD16.",0.643808003174567,1,0.85665628197231,0.856495867469026,0.895090602924805,0.825093322114214,0.883164233058779,0.911943984398052,0.879665047144939,0.890473676474096,0.572189039943875,0.835874822158003,0.878659156053088,0.894403942687538,0.788707137550288
"T.cell..CD4..TFH",0.718138506960335,0.85665628197231,1,0.974205331837255,0.93595072906343,0.795470682997226,0.989092392059185,0.973967384214176,0.96362874787672,0.987529264996971,0.55409411907501,0.772316765604491,0.964587203451514,0.940865073910213,0.863822037095943
"T.cell..CD4..memory.TREG",0.680517530465282,0.856495867469026,0.974205331837255,1,0.880282092659725,0.763933530795272,0.956259933456817,0.937096602563172,0.92042483367904,0.959609867701112,0.562879753988736,0.782454561048469,0.924492171174409,0.9015835127472,0.833748640474303
"T.cell..CD4..TH1.17",0.733195952864642,0.895090602924805,0.93595072906343,0.880282092659725,1,0.864933137742217,0.968113277525465,0.984750270431907,0.971716849987856,0.971810375113529,0.556875352733751,0.793701825893034,0.966873989190467,0.965468583072411,0.868059501403521
"B.cell..naive",0.626283794123579,0.825093322114214,0.795470682997226,0.763933530795272,0.864933137742217,1,0.831720823904594,0.860249381901544,0.867887023900502,0.837260601090282,0.561811920759752,0.784669600702745,0.861391557512013,0.886416785214233,0.741722233360266
"T.cell..CD4..TH2",0.733092134017796,0.883164233058779,0.989092392059185,0.956259933456817,0.968113277525465,0.831720823904594,1,0.987686817207115,0.979536430012842,0.996155702391247,0.566916367731812,0.796061313401253,0.975861734892774,0.95979331877202,0.873792935375338
"T.cell..CD4..TH1",0.723925360867552,0.911943984398052,0.973967384214176,0.937096602563172,0.984750270431907,0.860249381901544,0.987686817207115,1,0.982782626595198,0.99145733354128,0.57247320459452,0.807995131157973,0.978370185587033,0.977470096814967,0.871575942758923
"T.cell..CD4..naive",0.725108669796314,0.879665047144939,0.96362874787672,0.92042483367904,0.971716849987856,0.867887023900502,0.979536430012842,0.982782626595198,1,0.982232087881358,0.558362579782875,0.78457300525202,0.988775103322334,0.988840558471133,0.868711211874183
"T.cell..CD4..TH17",0.727720222694737,0.890473676474096,0.987529264996971,0.959609867701112,0.971810375113529,0.837260601090282,0.996155702391247,0.99145733354128,0.982232087881358,1,0.571238976257654,0.801634077133149,0.976592442778807,0.968074973622579,0.875209666905213
"Monocyte..classical",0.404130639088689,0.572189039943875,0.55409411907501,0.562879753988736,0.556875352733751,0.561811920759752,0.566916367731812,0.57247320459452,0.558362579782875,0.571238976257654,1,0.694786677277596,0.552921783806013,0.56560548111182,0.492553803177877
"Monocyte..non.classical",0.563953089276515,0.835874822158003,0.772316765604491,0.782454561048469,0.793701825893034,0.784669600702745,0.796061313401253,0.807995131157973,0.78457300525202,0.801634077133149,0.694786677277596,1,0.789454915089764,0.79829598995951,0.695442346342702
"T.cell..CD4..naive.TREG",0.735952130626758,0.878659156053088,0.964587203451514,0.924492171174409,0.966873989190467,0.861391557512013,0.975861734892774,0.978370185587033,0.988775103322334,0.976592442778807,0.552921783806013,0.789454915089764,1,0.978592759154872,0.879749862112856
"T.cell..CD8..naive",0.69804596155501,0.894403942687538,0.940865073910213,0.9015835127472,0.965468583072411,0.886416785214233,0.95979331877202,0.977470096814967,0.988840558471133,0.968074973622579,0.56560548111182,0.79829598995951,0.978592759154872,1,0.853517120918695
"T.cell..CD8..naive..activated.",0.907342913629505,0.788707137550288,0.863822037095943,0.833748640474303,0.868059501403521,0.741722233360266,0.873792935375338,0.871575942758923,0.868711211874183,0.875209666905213,0.492553803177877,0.695442346342702,0.879749862112856,0.853517120918695,1
