<?xml version="1.0" encoding="utf-8"?>
<!-- Generator: Adobe Illustrator 24.1.1, SVG Export Plug-In . SVG Version: 6.00 Build 0)  -->
<svg version="1.1" id="Capa_1" xmlns="http://www.w3.org/2000/svg" xmlns:xlink="http://www.w3.org/1999/xlink" x="0px" y="0px"
	 viewBox="0 0 264.5 125.33" style="enable-background:new 0 0 264.5 125.33;" xml:space="preserve">
<style type="text/css">
	.st0{fill:#951B81;}
	.st1{fill:#36A9E1;}
	.st2{fill:#F39200;}
	.st3{fill:#7B6A58;}
	.st4{fill:#2FAC66;}
	.st5{fill:#E6007E;}
</style>
<g>
	<g>
		<path class="st0" d="M27.64,112.91h-5.51V99.3l-5.8,13.61l-5.8-13.61v13.61H6.15V89.52h1.83c2.17,0,3.75,1.04,4.77,3.11L17,101.9
			l4.04-9.27c1.01-2.07,2.6-3.11,4.77-3.11h1.83V112.91z"/>
		<path class="st0" d="M36.42,95.59v12.38c0,0.65,0.14,1.18,0.42,1.57s0.66,0.59,1.14,0.59s0.86-0.2,1.14-0.59
			c0.28-0.39,0.42-0.92,0.42-1.57V95.59h5.5v18.72h-0.03c-0.13,1.24-0.58,2.33-1.38,3.26s-2.04,1.4-3.75,1.4h-8v-3.1h5.46
			c0.79,0,1.34-0.15,1.65-0.46c0.31-0.31,0.49-0.71,0.53-1.19v-1.32h-3.52c-1.66,0-2.92-0.45-3.79-1.35c-0.87-0.9-1.3-2.09-1.3-3.57
			V95.59H36.42z"/>
		<path class="st0" d="M54.38,89.54h8.19c2.11,0,3.77,0.48,4.97,1.44c1.21,0.96,1.81,2.18,1.81,3.65v1.17
			c0,1.08-0.21,1.96-0.63,2.64c-0.42,0.68-1.16,1.2-2.21,1.57v0.14c1.31,0.34,2.28,0.96,2.91,1.88c0.63,0.91,0.95,2,0.95,3.26v2.03
			c0,1.7-0.6,3.06-1.81,4.08s-2.86,1.52-4.97,1.52h-3.94c-1.77,0-3.09-0.51-3.96-1.52s-1.3-2.32-1.3-3.91V89.54z M59.88,99.15h1.74
			c0.7,0,1.25-0.28,1.64-0.85c0.39-0.56,0.59-1.23,0.59-2v-1.34c0-0.77-0.2-1.4-0.59-1.91c-0.4-0.51-0.94-0.76-1.64-0.76h-1.74
			V99.15z M64.86,104.95c0-1.1-0.28-1.94-0.85-2.5c-0.56-0.56-1.3-0.85-2.2-0.85h-1.95v5.55c0,0.99,0.19,1.74,0.57,2.25
			s1,0.76,1.85,0.76c0.92,0,1.58-0.25,1.98-0.76c0.39-0.51,0.59-1.26,0.59-2.25V104.95z"/>
		<path class="st0" d="M73.07,107.48V95.61h5.5v12.04c0,0.88,0.17,1.52,0.51,1.91c0.34,0.4,0.79,0.59,1.35,0.59
			c0.56,0,0.96-0.14,1.18-0.42V95.61h5.51v17.3h-6.53c-2.94,0-4.93-0.54-5.97-1.61S73.07,108.96,73.07,107.48z"/>
		<path class="st0" d="M90.18,100.03c0-1.25,0.43-2.3,1.3-3.15c0.87-0.85,2.13-1.27,3.79-1.27h3.94c1.66,0,2.92,0.45,3.79,1.35
			s1.3,2.09,1.3,3.57v0.98h-5.5v-1.15c0-0.65-0.14-1.15-0.42-1.49c-0.28-0.34-0.66-0.51-1.14-0.51s-0.86,0.17-1.14,0.51
			c-0.28,0.34-0.42,0.83-0.42,1.49c0,1.09,0.63,1.84,1.89,2.23l2.42,0.76c2.88,0.9,4.31,2.5,4.31,4.79c0,1.36-0.43,2.5-1.3,3.4
			c-0.87,0.9-2.13,1.35-3.79,1.35h-3.94c-1.66,0-2.92-0.45-3.79-1.35c-0.87-0.9-1.3-2.09-1.3-3.57v-0.98h5.5v0.98
			c0,0.65,0.14,1.18,0.42,1.57s0.66,0.59,1.14,0.59s0.86-0.2,1.14-0.59c0.28-0.39,0.42-0.92,0.42-1.57c0-1.3-0.63-2.14-1.89-2.54
			l-2.42-0.76C91.62,103.77,90.18,102.22,90.18,100.03z"/>
		<path class="st0" d="M107.43,93.6v-3.47h5.51v3.47H107.43z M112.94,95.61v17.3h-5.51v-17.3H112.94z"/>
		<path class="st0" d="M130.36,101.04v11.87h-5.5v-12.04c0-0.88-0.17-1.52-0.51-1.91c-0.34-0.39-0.79-0.59-1.35-0.59
			s-0.96,0.14-1.18,0.42v14.12h-5.51v-17.3h6.53c2.94,0,4.93,0.54,5.97,1.61C129.85,98.29,130.36,99.56,130.36,101.04z"/>
		<path class="st0" d="M138.92,105.13v2.84c0,0.65,0.14,1.18,0.42,1.57s0.66,0.59,1.14,0.59s0.86-0.2,1.14-0.59
			c0.28-0.39,0.42-0.92,0.42-1.57v-0.98h5.5v0.98c0,1.48-0.43,2.67-1.3,3.57c-0.87,0.9-2.13,1.35-3.79,1.35h-3.94
			c-1.66,0-2.92-0.45-3.79-1.35c-0.87-0.9-1.3-2.09-1.3-3.57v-7.44c0-1.48,0.43-2.67,1.3-3.57s2.13-1.35,3.79-1.35h3.94
			c1.66,0,2.92,0.45,3.79,1.35s1.3,2.09,1.3,3.57C147.55,103.6,144.67,105.13,138.92,105.13z M142.05,100.36
			c0-0.65-0.14-1.15-0.42-1.49c-0.28-0.34-0.66-0.51-1.14-0.51s-0.86,0.17-1.14,0.51c-0.28,0.34-0.42,0.83-0.42,1.49v2.6
			C141.01,102.97,142.05,102.1,142.05,100.36z"/>
		<path class="st0" d="M150.61,100.03c0-1.25,0.43-2.3,1.3-3.15c0.87-0.85,2.13-1.27,3.79-1.27h3.94c1.66,0,2.92,0.45,3.79,1.35
			s1.3,2.09,1.3,3.57v0.98h-5.5v-1.15c0-0.65-0.14-1.15-0.42-1.49c-0.28-0.34-0.66-0.51-1.14-0.51s-0.86,0.17-1.14,0.51
			c-0.28,0.34-0.42,0.83-0.42,1.49c0,1.09,0.63,1.84,1.89,2.23l2.42,0.76c2.88,0.9,4.31,2.5,4.31,4.79c0,1.36-0.43,2.5-1.3,3.4
			c-0.87,0.9-2.13,1.35-3.79,1.35h-3.94c-1.66,0-2.92-0.45-3.79-1.35c-0.87-0.9-1.3-2.09-1.3-3.57v-0.98h5.5v0.98
			c0,0.65,0.14,1.18,0.42,1.57s0.66,0.59,1.14,0.59s0.86-0.2,1.14-0.59c0.28-0.39,0.42-0.92,0.42-1.57c0-1.3-0.63-2.14-1.89-2.54
			l-2.42-0.76C152.05,103.77,150.61,102.22,150.61,100.03z"/>
		<path class="st0" d="M167.79,100.03c0-1.25,0.43-2.3,1.3-3.15c0.87-0.85,2.13-1.27,3.79-1.27h3.94c1.66,0,2.92,0.45,3.79,1.35
			s1.3,2.09,1.3,3.57v0.98h-5.5v-1.15c0-0.65-0.14-1.15-0.42-1.49c-0.28-0.34-0.66-0.51-1.14-0.51s-0.86,0.17-1.14,0.51
			c-0.28,0.34-0.42,0.83-0.42,1.49c0,1.09,0.63,1.84,1.89,2.23l2.42,0.76c2.88,0.9,4.31,2.5,4.31,4.79c0,1.36-0.43,2.5-1.3,3.4
			c-0.87,0.9-2.13,1.35-3.79,1.35h-3.94c-1.66,0-2.92-0.45-3.79-1.35c-0.87-0.9-1.3-2.09-1.3-3.57v-0.98h5.5v0.98
			c0,0.65,0.14,1.18,0.42,1.57s0.66,0.59,1.14,0.59s0.86-0.2,1.14-0.59c0.28-0.39,0.42-0.92,0.42-1.57c0-1.3-0.63-2.14-1.89-2.54
			l-2.42-0.76C169.23,103.77,167.79,102.22,167.79,100.03z"/>
		<path class="st0" d="M201.23,104.59h5.5v3.38c0,1.48-0.43,2.67-1.3,3.57c-0.87,0.9-2.13,1.35-3.79,1.35h-5.29
			c-1.66,0-2.92-0.45-3.79-1.35c-0.87-0.9-1.3-2.09-1.3-3.57V94.46c0-1.48,0.43-2.67,1.3-3.57c0.87-0.9,2.13-1.35,3.79-1.35h5.29
			c1.66,0,2.92,0.45,3.79,1.35c0.87,0.9,1.3,2.09,1.3,3.57v2.71h-5.5v-2.2c0-0.77-0.2-1.4-0.59-1.91s-0.94-0.76-1.65-0.76
			c-0.71,0-1.25,0.25-1.65,0.76s-0.59,1.14-0.59,1.91v12.33c0,0.77,0.2,1.43,0.59,2c0.39,0.56,0.94,0.85,1.65,0.85
			c0.7,0,1.25-0.28,1.65-0.85c0.39-0.56,0.59-1.23,0.59-2V104.59z"/>
		<path class="st0" d="M218.49,102.53v-2c0-0.65-0.14-1.18-0.42-1.57c-0.28-0.39-0.66-0.59-1.14-0.59s-0.86,0.2-1.14,0.59
			s-0.42,0.92-0.42,1.57v0.64h-5.5v-0.64c0-1.48,0.43-2.67,1.3-3.57s2.13-1.35,3.79-1.35h3.94c1.66,0,2.92,0.45,3.79,1.35
			s1.3,2.09,1.3,3.57v7.44c0,1.48-0.43,2.67-1.3,3.57c-0.87,0.9-2.13,1.35-3.79,1.35h-3.94c-1.66,0-2.92-0.45-3.79-1.35
			c-0.87-0.9-1.3-2.09-1.3-3.57C209.87,104.34,212.74,102.53,218.49,102.53z M215.36,108.14c0,0.65,0.14,1.15,0.42,1.49
			c0.28,0.34,0.66,0.51,1.14,0.51s0.86-0.17,1.14-0.51c0.28-0.34,0.42-0.83,0.42-1.49v-3.45
			C216.41,104.69,215.36,105.84,215.36,108.14z"/>
		<path class="st0" d="M241.17,100.53v2.57h-5.5v-2.23c0-0.88-0.17-1.52-0.51-1.91c-0.34-0.39-0.79-0.59-1.35-0.59
			s-0.96,0.14-1.18,0.42v14.12h-5.51v-17.3h8.73c1.93,0,3.3,0.45,4.11,1.35C240.77,97.87,241.17,99.06,241.17,100.53z"/>
		<path class="st0" d="M258.35,112.9h-9.03c-1.66,0-2.92-0.45-3.79-1.35c-0.87-0.9-1.3-2.09-1.3-3.57v-7.44
			c0-1.48,0.43-2.67,1.3-3.57s2.13-1.35,3.79-1.35h3.52v-6.07h5.51V112.9z M250.15,98.96c-0.28,0.39-0.42,0.92-0.42,1.57v7.61
			c0,0.65,0.14,1.15,0.42,1.49c0.28,0.34,0.66,0.51,1.14,0.51s0.86-0.17,1.14-0.51c0.28-0.34,0.42-0.83,0.42-1.49v-7.61
			c0-0.65-0.14-1.18-0.42-1.57c-0.28-0.39-0.66-0.59-1.14-0.59S250.43,98.57,250.15,98.96z"/>
	</g>
	<g>
		<path class="st1" d="M126.41,16.25c-4.42,8.73-12.18,10.98-14.68,11c-0.13-0.01-0.26-0.04-0.4-0.04c-0.09,0-0.16,0.02-0.25,0.02
			c-0.19-0.01-0.31-0.02-0.31-0.02l0.05,0.05c-0.86,0.06-1.68,0.22-2.44,0.54c-2.75,1.15-4.68,3.87-4.68,7.04
			c0,4.21,3.41,7.63,7.63,7.63c4.03,0,7.29-3.13,7.57-7.09l0.03,0.03c0.13-11.83,10.9-15.34,10.9-15.34L126.41,16.25z"/>
		<path class="st0" d="M147.78,36.83c-4.42,8.73-12.18,10.98-14.68,11c-0.13-0.01-0.26-0.04-0.4-0.04c-0.09,0-0.16,0.02-0.25,0.02
			c-0.19-0.01-0.31-0.02-0.31-0.02l0.05,0.05c-0.86,0.06-1.68,0.22-2.44,0.54c-2.75,1.15-4.68,3.87-4.68,7.04
			c0,4.21,3.41,7.63,7.63,7.63c4.03,0,7.29-3.13,7.57-7.09l0.03,0.03c0.13-11.83,10.9-15.34,10.9-15.34L147.78,36.83z"/>
		<path class="st2" d="M151.57,29.07c-8.73-4.42-10.98-12.18-11-14.68c0.01-0.13,0.04-0.26,0.04-0.4c0-0.09-0.02-0.16-0.02-0.25
			c0.01-0.19,0.02-0.31,0.02-0.31l-0.05,0.05c-0.06-0.86-0.22-1.68-0.54-2.44c-1.15-2.75-3.87-4.68-7.04-4.68
			c-4.21,0-7.63,3.41-7.63,7.63c0,4.03,3.13,7.29,7.09,7.57l-0.03,0.03c11.83,0.13,15.34,10.9,15.34,10.9L151.57,29.07z"/>
		<path class="st0" d="M138.77,52.12c4.98-8.42,12.87-10.16,15.37-10.01c0.13,0.02,0.26,0.06,0.39,0.07
			c0.09,0.01,0.17-0.01,0.25-0.01c0.19,0.02,0.31,0.05,0.31,0.05l-0.05-0.05c0.86,0,1.7-0.11,2.47-0.38
			c2.82-0.97,4.92-3.55,5.13-6.71c0.28-4.2-2.91-7.83-7.11-8.11c-4.02-0.26-7.48,2.65-8.02,6.58l-0.02-0.03
			c-0.91,11.8-11.88,14.59-11.88,14.59L138.77,52.12z"/>
		<path class="st3" d="M137.32,74.76c4.77-8.54,12.61-10.48,15.11-10.4c0.13,0.01,0.26,0.05,0.39,0.06c0.09,0,0.17-0.02,0.25-0.01
			c0.19,0.02,0.31,0.04,0.31,0.04l-0.05-0.05c0.86-0.02,1.69-0.15,2.46-0.44c2.79-1.04,4.83-3.68,4.96-6.84
			c0.17-4.21-3.1-7.76-7.31-7.93c-4.02-0.16-7.41,2.84-7.85,6.78l-0.02-0.03c-0.61,11.82-11.51,14.88-11.51,14.88L137.32,74.76z"/>
		<path class="st4" d="M116.8,53.34c4.77-8.54,12.61-10.48,15.11-10.4c0.13,0.01,0.26,0.05,0.39,0.06c0.09,0,0.17-0.02,0.25-0.01
			c0.19,0.02,0.31,0.04,0.31,0.04l-0.05-0.05c0.86-0.02,1.69-0.15,2.46-0.44c2.79-1.04,4.83-3.68,4.96-6.84
			c0.17-4.21-3.1-7.76-7.31-7.93c-4.02-0.16-7.41,2.84-7.85,6.78l-0.02-0.03c-0.61,11.82-11.51,14.88-11.51,14.88L116.8,53.34z"/>
		<path class="st5" d="M112.7,60.94c8.54,4.77,10.48,12.61,10.4,15.11c-0.01,0.13-0.05,0.26-0.06,0.39c0,0.09,0.02,0.17,0.01,0.25
			c-0.02,0.19-0.04,0.31-0.04,0.31l0.05-0.05c0.02,0.86,0.15,1.69,0.44,2.46c1.04,2.79,3.68,4.83,6.84,4.96
			c4.21,0.17,7.76-3.1,7.93-7.31c0.16-4.02-2.84-7.41-6.78-7.85l0.03-0.02c-11.82-0.61-14.88-11.51-14.88-11.51L112.7,60.94z"/>
		<path class="st4" d="M126.43,38.42c-5.32,8.21-13.27,9.63-15.76,9.38c-0.13-0.02-0.26-0.07-0.39-0.08c-0.08-0.01-0.17,0-0.25,0
			c-0.19-0.03-0.31-0.06-0.31-0.06l0.04,0.06c-0.86-0.03-1.7,0.04-2.48,0.28c-2.85,0.86-5.06,3.35-5.4,6.5
			c-0.45,4.19,2.59,7.94,6.78,8.39c4,0.43,7.58-2.34,8.28-6.25l0.02,0.03c1.38-11.75,12.46-14.1,12.46-14.1L126.43,38.42z"/>
	</g>
</g>
</svg>
