<?xml version="1.0" encoding="utf-8"?>
<!-- Generator: Adobe Illustrator 24.1.1, SVG Export Plug-In . SVG Version: 6.00 Build 0)  -->
<svg version="1.1" id="Capa_1" xmlns="http://www.w3.org/2000/svg" xmlns:xlink="http://www.w3.org/1999/xlink" x="0px" y="0px"
	 viewBox="0 0 151.2 150.5" style="enable-background:new 0 0 151.2 150.5;" xml:space="preserve">
<style type="text/css">
	.st0{fill:#951B81;}
	.st1{fill:#FFFFFF;}
</style>
<path class="st0" d="M34.2,1H117c18.3,0,33.2,14.9,33.2,33.2v82.2c0,18.3-14.9,33.2-33.2,33.2H34.2C15.9,149.5,1,134.7,1,116.4V34.2
	C1,15.9,15.9,1,34.2,1z"/>
<g>
	<path class="st1" d="M137.6,112.9c-0.2,0-0.4,0-0.4,0.1c-1.2,1.8-3,2-4.9,2c-30.1,0-60.2,0-90.4,0c-7.9,0-15.8,0-23.7,0
		c-1.7,0-3.3-0.3-4.6-1.5c0-21.1,0-42.3,0-63.4c1.9,1.9,3.8,3.9,5.8,5.7c0.9,0.8,1.2,1.7,1.2,2.9c0,15.6,0,31.1,0,46.7
		c0,2.2,0,2.2,2.1,2.2c35.1,0,70.3,0,105.4,0c2.1,0,2.1,0,2.1-2.2c0-15.6,0-31.1,0-46.7c0-1.3,0.4-2.3,1.3-3.1
		c1.7-1.6,3.3-3.3,5-4.9c0.4-0.3,0.8-0.6,1.3-0.8C137.6,70.9,137.6,91.9,137.6,112.9z"/>
	<path class="st1" d="M13.6,37.3c1.4-1.5,3.1-1.8,5.1-1.8c37.2,0,74.3,0,111.5,0c2.9,0,5.7-0.2,7.5,2.8c0,0.7,0,1.5,0,2.2
		c-0.6,0.6-1.2,1.2-1.8,1.8c-9.3,9.4-18.6,18.8-27.9,28.2c-0.3,0.3-0.7,0.6-1.2,1c-0.5-2.9-1.1-5.6-1.5-8.3c-0.1-0.4,0.6-1.1,1-1.5
		c5.6-5.7,11.2-11.4,16.8-17c0.4-0.4,0.8-0.9,1.4-1.6c-32.9,0-65.3,0-98.2,0c0.6,0.7,0.9,1.2,1.3,1.6c6,6,11.9,12.1,17.9,18.1
		c0.9,0.9,1.1,1.7,0.6,2.9c-0.8,1.9-1.3,3.8-2,5.9c-0.4-0.2-0.7-0.4-1-0.7C33.2,60.9,23.4,51,13.6,41.1
		C13.6,39.8,13.6,38.6,13.6,37.3z"/>
	<path class="st1" d="M80.3,82.8c-0.6,0.8-1,1.3-1.5,1.9c-2.8,3.3-6.3,4.9-10.7,3.9c-3.5-0.8-5.9-3.6-6.4-7.2
		C60.3,70,69.2,60.6,80.7,61.3c2,0.1,4,0.6,6,1c1.1,0.2,1.6,0.8,1.4,2.1c-0.8,4-1.5,8.1-2.1,12.1c-0.3,1.7-0.4,3.4-0.3,5.1
		c0.1,2.1,1.3,2.9,3.4,2.5c2.3-0.5,3.7-2.1,4.6-4.1c3.1-6.9,2.9-13.8-1.3-20.1c-4.2-6.3-10.8-7.8-17.9-6.8
		c-14.1,1.9-20.5,15.2-19.1,27.4c0.5,4.4,2.1,8.4,5.3,11.6c4.3,4.3,9.6,5.8,15.4,5.3c3-0.2,5.9-1.2,8.8-2c0.8-0.2,1.2-0.1,1.5,0.7
		c1,2.8,1.1,3-1.8,3.9c-9.2,2.9-18.2,2.9-26.2-3.4c-4.8-3.8-7.5-8.9-8.2-14.9c-1.1-9.8,1.5-18.5,8.7-25.5c8.6-8.4,23.4-9.9,32.9-3.4
		c5.3,3.6,8.1,8.8,8.8,15c0.6,5.3,0,10.4-3,15c-2.3,3.5-5.5,5.6-9.7,6.2C83.8,89.4,81.3,87.5,80.3,82.8z M78.6,66.4c0,0,0-0.1,0-0.1
		c-1,0.2-2.1,0.3-3,0.6c-5.2,1.8-7.9,8-7.3,12.7c0.5,3.7,3.9,5.2,6.9,3c1.4-1,2.8-2.4,3.4-3.9c1.2-3.1,1.8-6.4,2.5-9.7
		c0.5-2.4,0.3-2.5-2.1-2.5C78.9,66.4,78.7,66.4,78.6,66.4z"/>
</g>
</svg>
