<?xml version="1.0" encoding="utf-8"?>
<!-- Generator: Adobe Illustrator 24.1.1, SVG Export Plug-In . SVG Version: 6.00 Build 0)  -->
<svg version="1.1" id="Capa_1" xmlns="http://www.w3.org/2000/svg" xmlns:xlink="http://www.w3.org/1999/xlink" x="0px" y="0px"
	 viewBox="0 0 151.2 150.5" style="enable-background:new 0 0 151.2 150.5;" xml:space="preserve">
<style type="text/css">
	.st0{fill:#EFEFEF;}
	.st1{fill:url(#SVGID_1_);}
	.st2{fill:url(#SVGID_2_);}
	.st3{fill:url(#SVGID_3_);}
	.st4{fill:url(#SVGID_4_);}
	.st5{fill:url(#SVGID_5_);}
	.st6{fill:url(#SVGID_6_);}
	.st7{fill:#FFDFAB;}
</style>
<path class="st0" d="M33.8,0.8h83.5c18.5,0,33.4,14.9,33.4,33.3v82.5c0,18.4-15,33.3-33.4,33.3H33.8c-18.5,0-33.4-14.9-33.4-33.3V34
	C0.4,15.7,15.4,0.8,33.8,0.8z"/>
<linearGradient id="SVGID_1_" gradientUnits="userSpaceOnUse" x1="24.5111" y1="52.5027" x2="123.141" y2="52.5027">
	<stop  offset="5.154639e-03" style="stop-color:#F9B713"/>
	<stop  offset="1" style="stop-color:#ED983A"/>
</linearGradient>
<path class="st1" d="M24.5,42.6v-4.7c0,0-0.3-3,4.4-3c4.3,0,9,0,9,0l80.3-2.8c0,0,4.2-0.4,4.9,3.5v5.1L71,72.5c0,0-3.4,1.3-5.9-1.2
	C62.7,68.9,24.5,42.6,24.5,42.6z"/>
<linearGradient id="SVGID_2_" gradientUnits="userSpaceOnUse" x1="83.5706" y1="66.7554" x2="103.2812" y2="45.8591">
	<stop  offset="5.154639e-03" style="stop-color:#F9B713"/>
	<stop  offset="1" style="stop-color:#D14016"/>
</linearGradient>
<path class="st2" d="M118.3,32.2v8l-48.3,30c0,0-1.8,1.7-5.3,0.7c0,0,2.4,2.9,5.7,1.8s9.2-5.4,9.2-5.4l43.6-26.6v-5.1
	C123.1,35.6,123.2,32.4,118.3,32.2z"/>
<linearGradient id="SVGID_3_" gradientUnits="userSpaceOnUse" x1="120.8604" y1="44.2651" x2="120.5269" y2="31.3717">
	<stop  offset="5.154639e-03" style="stop-color:#F9B713"/>
	<stop  offset="1" style="stop-color:#D14016"/>
</linearGradient>
<path class="st3" d="M118.3,32.2v8h4.9l0-4.5c0,0-1-3.6-4.3-3.5H118.3z"/>
<linearGradient id="SVGID_4_" gradientUnits="userSpaceOnUse" x1="24.4506" y1="83.7878" x2="123.141" y2="83.7878">
	<stop  offset="5.154639e-03" style="stop-color:#F9B713"/>
	<stop  offset="1" style="stop-color:#D14016"/>
</linearGradient>
<path class="st4" d="M24.5,49.7V107c0,0-0.8,4.4,3.5,4.4s88.8,6.9,88.8,6.9s3.8,0.4,5.8-4.3l0.5-64.7h-4.3L70.7,79.2
	c0,0-3.4,0-4.9-1.2c-1.4-1.2-37.7-28.1-37.7-28.1L24.5,49.7z"/>
<linearGradient id="SVGID_5_" gradientUnits="userSpaceOnUse" x1="24.5111" y1="64.5903" x2="70.7151" y2="64.5903">
	<stop  offset="5.154639e-03" style="stop-color:#F9B713"/>
	<stop  offset="1" style="stop-color:#D14016"/>
</linearGradient>
<path class="st5" d="M24.5,49.7l39.3,29.2c0,0,3.7,1,6.9,0.2c0,0-3.7-0.3-4.9-1.2C64.6,77,28.1,49.8,28.1,49.8L24.5,49.7z"/>
<linearGradient id="SVGID_6_" gradientUnits="userSpaceOnUse" x1="116.0644" y1="83.8334" x2="123.141" y2="83.8334">
	<stop  offset="5.154639e-03" style="stop-color:#F9B713"/>
	<stop  offset="1" style="stop-color:#D14016"/>
</linearGradient>
<path class="st6" d="M118.8,49.3l-0.6,65.8c0,0,0.4,2.8-2.2,3.2c0,0,4.6,1.1,6.6-4.3l0.5-64.7H118.8z"/>
<path class="st7" d="M112.3,109.5C75.6,96.6,56.6,85,37.5,82.3c-23.3-3.3-23,9.4-23,9.4c1.2,9,9.9,6.7,9.9,6.7l0.1,4.9
	c-11.2,1.9-13.4-6.4-13.4-6.4s-5-23.4,21.5-23c26.5,0.4,65.5,27.1,81.5,32c16,4.9,26.4-4.4,26.4-4.4S137.3,118.3,112.3,109.5z"/>
<path class="st7" d="M123.1,88.5l0-5.9c0,0,8.4,2.1,14.8-7.3C138,75.3,138.3,85.9,123.1,88.5z"/>
</svg>
