<svg xmlns="http://www.w3.org/2000/svg" width="41" height="42" viewBox="0 0 41 42">
    <g fill="none" fill-rule="nonzero">
        <path fill="#DC4D41" d="M16.252 11.136l3.897-3.897 2.992 2.992-3.897 3.897z"/>
        <path fill="#EA6B65" d="M7.577 15.124L17.806 4.895l2.922 2.923L10.5 18.047zM25.6 3.921l1.46 1.461-8.28 8.28 2.922 2.923 8.281-8.28 1.461 1.46 1.462-7.305z"/>
        <path fill="#F3AF3E" d="M3.444 32.512h5.51v8.266h-5.51z"/>
        <path fill="#E7A12E" d="M3.444 32.512H6.2v8.266H3.444z"/>
        <path fill="#99D8AA" d="M13.088 27.69h5.51v13.088h-5.51z"/>
        <path fill="#85D099" d="M13.088 27.69h2.755v13.088h-2.755z"/>
        <path fill="#6CBAE5" d="M22.731 20.802h5.511v19.976h-5.51z"/>
        <path fill="#54ACDC" d="M22.731 20.802h2.756v19.976H22.73z"/>
        <path fill="#EA6B65" d="M32.375 14.602h5.511v26.176h-5.51z"/>
        <path fill="#DC4D41" d="M32.375 14.602h2.756v26.176h-2.756z"/>
        <path fill="#72A3FC" d="M39.952 41.467H.69a.689.689 0 0 1-.689-.69V1.515a.689.689 0 0 1 1.378 0V40.09h38.574a.689.689 0 0 1 0 1.378z"/>
        <path fill="#5D9AA4" d="M5.51 29.068h1.378v1.377H5.511zM15.154 24.246h1.378v1.377h-1.378zM24.798 17.357h1.378v1.378h-1.378zM34.442 11.158h1.377v1.378h-1.377z"/>
    </g>
</svg>
