<svg xmlns="http://www.w3.org/2000/svg" width="22" height="22" viewBox="0 0 22 22">
    <path fill="#F75D72" fill-rule="nonzero" d="M20.379 7.473l-5.913-.864-2.646-5.373a1.234 1.234 0 0 0-2.214 0L6.96 6.609l-5.913.864c-1 .135-1.404 1.377-.675 2.106l4.293 4.185-1 5.886c-.161.999.892 1.782 1.783 1.296l5.265-2.781 5.292 2.78c.918.487 1.97-.296 1.782-1.295l-1-5.886 4.294-4.185c.729-.73.324-1.971-.702-2.106zM17.84 9.93l-3.186 3.105.756 4.374a.511.511 0 0 1-.756.54l-3.942-2.025-3.942 2.079c-.378.189-.837-.135-.756-.54l.756-4.374-3.186-3.16c-.324-.296-.135-.836.297-.89l4.4-.621 1.972-3.996c.189-.378.756-.378.945 0l1.944 3.996 4.4.648c.433.054.622.567.298.864z" opacity=".5"/>
</svg>
