<?xml version="1.0" encoding="UTF-8"?>
<svg width="26px" height="26px" viewBox="0 0 26 26" version="1.1" xmlns="http://www.w3.org/2000/svg" xmlns:xlink="http://www.w3.org/1999/xlink">
    <!-- Generator: Sketch 52.3 (67297) - http://www.bohemiancoding.com/sketch -->
    <title>up</title>
    <desc>Created with Sketch.</desc>
    <g id="Page-1" stroke="none" stroke-width="1" fill="none" fill-rule="evenodd">
        <g id="UX-Audit-Tool---v1-Copy" transform="translate(-124.000000, -619.000000)" fill="#F75D72" fill-rule="nonzero">
            <g id="wave" transform="translate(0.000000, -0.858148)">
                <g id="Group-3" transform="translate(137.000000, 632.953959) scale(1, -1) translate(-137.000000, -632.953959) translate(124.000000, 619.953959)">
                    <path d="M12.7333383,25.8895363 C5.84076018,25.8895363 0.23333831,20.2821144 0.23333831,13.3895363 C0.23333831,6.49695814 5.84076018,0.889536262 12.7333383,0.889536262 C19.6259164,0.889536262 25.2333383,6.49695814 25.2333383,13.3895363 C25.2333383,20.2821144 19.6259164,25.8895363 12.7333383,25.8895363 Z M12.7333383,2.06141126 C6.48685393,2.06141126 1.40521331,7.14305189 1.40521331,13.3895363 C1.40521331,19.63563 6.48685393,24.7176613 12.7333383,24.7176613 C18.9794321,24.7176613 24.0614633,19.63563 24.0614633,13.3895363 C24.0614633,7.14305189 18.9794321,2.06141126 12.7333383,2.06141126 Z M9.00335981,14.4403175 C8.76391263,14.19188 8.80269315,13.8223488 9.08948865,13.6160988 C9.37628415,13.4082863 9.8028699,13.44188 10.0423171,13.6907081 L12.733505,16.4864113 L15.4251439,13.6895363 C15.6641402,13.44188 16.090275,13.4082863 16.3775214,13.6149269 C16.663866,13.8223488 16.7026465,14.1914894 16.4636503,14.4403175 L13.2768833,17.7520363 C13.2457687,17.7883644 13.2105957,17.82313 13.1686586,17.8532081 C13.0586301,17.932505 12.9287605,17.976255 12.7961852,17.9864113 C12.7754421,17.9879738 12.7542481,17.9864113 12.733505,17.9864113 C12.712762,17.9864113 12.691568,17.9879738 12.6708249,17.9864113 C12.5382496,17.9758644 12.40838,17.932505 12.2983515,17.8532081 C12.2559635,17.8223488 12.2207904,17.7871925 12.1892249,17.7504738 L9.00335981,14.4403175 Z M9.00335981,9.75281751 C8.76391263,9.50438001 8.80269315,9.13484876 9.08948865,8.92859876 C9.37628415,8.72078626 9.8028699,8.75438001 10.0423171,9.00320814 L12.733505,11.7989113 L15.4251439,9.00203626 C15.6641402,8.75438001 16.090275,8.72078626 16.3775214,8.92742689 C16.663866,9.13484876 16.7026465,9.50398939 16.4636503,9.75281751 L13.2768833,13.0645363 C13.2457687,13.1008644 13.2105957,13.13563 13.1686586,13.1657081 C13.0586301,13.245005 12.9287605,13.288755 12.7961852,13.2989113 C12.7754421,13.3004738 12.7542481,13.2989113 12.733505,13.2989113 C12.712762,13.2989113 12.691568,13.3004738 12.6708249,13.2989113 C12.5382496,13.2883644 12.40838,13.245005 12.2983515,13.1657081 C12.2559635,13.1348488 12.2207904,13.0996925 12.1892249,13.0629738 L9.00335981,9.75281751 Z" id="up"></path>
                </g>
            </g>
        </g>
    </g>
</svg>