<svg xmlns="http://www.w3.org/2000/svg" width="15" height="15" viewBox="0 0 15 15">
    <path fill="#363342" fill-rule="evenodd" d="M9.053 7.483l5.696 5.696a.935.935 0 1 1-1.323 1.323L7.73 8.806l-5.697 5.696A.935.935 0 1 1 .711 13.18l5.696-5.696-5.68-5.68A.935.935 0 1 1 2.048.48l5.68 5.68L13.41.48a.935.935 0 0 1 1.323 1.323l-5.68 5.68z"/>
</svg>
