{
    "applinks": {
        "apps": [],
        "details": [
            {
                "appID": "63T6ZX9CTR.a31244.guildion",
                "paths": ["/guild/welcome/*"]
            }
        ]
    },
    "webcredentials": {
        "apps": ["63T6ZX9CTR.a31244.guildion"]
    }
}
