<?xml version="1.0" encoding="utf-8"?>
<!-- Svg Vector Icons : http://www.onlinewebfonts.com/icon -->
<!DOCTYPE svg PUBLIC "-//W3C//DTD SVG 1.1//EN" "http://www.w3.org/Graphics/SVG/1.1/DTD/svg11.dtd">
<svg version="1.1" xmlns="http://www.w3.org/2000/svg" xmlns:xlink="http://www.w3.org/1999/xlink" x="0px" y="0px" viewBox="0 0 1000 1000" enable-background="new 0 0 1000 1000" xml:space="preserve">
<metadata> Svg Vector Icons : http://www.onlinewebfonts.com/icon </metadata>
<g><g><path d="M285.6,561.3h-61.3V990h61.3c16.8,0,30.6-13.8,30.6-30.6V591.9C316.3,575,302.5,561.3,285.6,561.3z"/><path d="M714.4,561.3c-16.8,0-30.6,13.8-30.6,30.6v367.5c0,16.8,13.8,30.6,30.6,30.6h61.3V561.3H714.4z"/><path d="M990,500c0-270.6-219.4-490-490-490C229.4,10,10,229.4,10,500c0,58.8,10.4,115.1,29.3,167.3C20.7,699.1,10,736.1,10,775.6c0,108,79.9,197.3,183.8,212.2V563.4c-30.5,4.4-59,15.2-84,31c-5.2-25.6-7.9-52-7.9-79.1c0-219.9,178.2-398.1,398.1-398.1s398.1,178.2,398.1,398.1c0,27.1-2.7,53.6-7.9,79.1c-25-15.8-53.5-26.7-84-31v424.4C910.1,973,990,883.6,990,775.6c0-39.5-10.7-76.5-29.3-108.3C979.6,615.1,990,558.8,990,500L990,500z"/></g></g>
</svg>