<?xml version="1.0" encoding="utf-8"?>
<!-- Generator: Adobe Illustrator 24.3.0, SVG Export Plug-In . SVG Version: 6.00 Build 0)  -->
<svg version="1.1" id="_2" xmlns="http://www.w3.org/2000/svg" xmlns:xlink="http://www.w3.org/1999/xlink" x="0px" y="0px"
	 viewBox="0 0 404.9 320" style="enable-background:new 0 0 404.9 320;" xml:space="preserve">
<style type="text/css">
	.st0{fill:#8FA5B5;}
</style>
<path class="st0" d="M0,117.2v85.6C0,220.6,10.6,235,23.8,235l0,0H68V85H23.8C10.7,85,0,99.5,0,117.2L0,117.2z"/>
<path class="st0" d="M245.4,1.9c-4.2-2.3-9.3-2.5-13.7-0.5L79.5,71.9v174.9l152.2,70.5c6.8,3.2,15.3,0.7,18.8-5.6
	c1-1.8,1.5-3.7,1.5-5.7V12.8C252.1,8.3,249.6,4.2,245.4,1.9z"/>
<path class="st0" d="M303,83.5c-3.2-4.2-9.2-4.9-13.3-1.7c-0.3,0.3-0.7,0.6-1,0.9c-4.2,4.3-4.5,11.1-0.7,15.8
	c14.1,17.4,21.2,39.4,21.2,61.4s-7,44.1-21.2,61.4c-3.7,4.7-3.4,11.5,0.7,15.8c3.7,3.7,9.7,3.8,13.4,0.1c0.3-0.3,0.6-0.7,0.9-1
	c17.6-21.6,26.4-49.1,26.4-76.5S320.6,105.1,303,83.5z"/>
<path class="st0" d="M351,27.3c-3.9-4.9-11.2-5.7-16.3-2c-0.4,0.3-0.9,0.7-1.2,1c-5.1,5.1-5.5,13-0.9,18.5
	c27.8,32.6,41.7,73.8,41.7,115.1s-13.9,82.6-41.7,115.2c-4.6,5.5-4.2,13.4,0.9,18.5c4.5,4.4,11.8,4.5,16.4,0.2
	c0.4-0.3,0.7-0.8,1.1-1.2c32.1-37.5,48.1-85.1,48.1-132.6S383.1,65,351,27.3z"/>
</svg>
