<?xml version="1.0" encoding="utf-8"?>
<!-- Generator: Adobe Illustrator 24.3.0, SVG Export Plug-In . SVG Version: 6.00 Build 0)  -->
<svg version="1.1" id="レイヤー_1" xmlns="http://www.w3.org/2000/svg" xmlns:xlink="http://www.w3.org/1999/xlink" x="0px"
	 y="0px" viewBox="0 0 24 24" style="enable-background:new 0 0 24 24;" xml:space="preserve">
<path d="M-89.5,232L-238,262l30-148.5L-89.5,232z M-60.1,202.6L173.9-31.3L55.3-149.9L-178.6,84L-60.1,202.6z M143.4-238l-58.7,58.7
	L203.3-60.8l58.7-58.7C262-119.5,143.4-238,143.4-238z"/>
</svg>
