module github.com/guildion/webrtc-sfu

go 1.13

require (
	github.com/bep/debounce v1.2.0
	github.com/desertbit/timer v0.0.0-20180107155436-c41aec40b27f // indirect
	github.com/gammazero/deque v0.1.0
	github.com/gammazero/workerpool v1.1.2
	github.com/go-logr/logr v1.2.0
	github.com/go-logr/zerologr v1.2.0
	github.com/google/uuid v1.3.0 // indirect
	github.com/gorilla/websocket v1.4.2
	github.com/grpc-ecosystem/go-grpc-prometheus v1.2.0
	github.com/improbable-eng/grpc-web v0.13.0
	github.com/lucsky/cuid v1.0.2
	github.com/pion/dtls/v2 v2.0.9
	github.com/pion/ice/v2 v2.1.10
	github.com/pion/logging v0.2.2
	github.com/pion/rtcp v1.2.6
	github.com/pion/rtp v1.7.1
	github.com/pion/sdp/v3 v3.0.4
	github.com/pion/transport v0.12.3
	github.com/pion/turn/v2 v2.0.5
	github.com/pion/webrtc/v3 v3.1.0-beta.2.0.20210808020610-5253475ec730
	github.com/prometheus/client_golang v1.9.0
	github.com/rs/cors v1.7.0 // indirect
	github.com/rs/zerolog v1.25.0
	github.com/soheilhy/cmux v0.1.4
	github.com/sourcegraph/jsonrpc2 v0.0.0-20210201082850-366fbb520750
	github.com/spf13/viper v1.7.1
	github.com/stretchr/testify v1.7.0
	golang.org/x/crypto v0.0.0-20210711020723-a769d52b0f97 // indirect
	golang.org/x/net v0.0.0-20210805182204-aaa1db679c0d // indirect
	golang.org/x/sync v0.0.0-20210220032951-036812b2e83c
	golang.org/x/sys v0.0.0-20210806184541-e5e7981a1069 // indirect
	google.golang.org/grpc v1.35.0
	google.golang.org/grpc/examples v0.0.0-20201209011439-fd32f6a4fefe // indirect
	google.golang.org/protobuf v1.25.0
	gopkg.in/ini.v1 v1.51.1 // indirect
)
