{
	"name": "Go",
	"dockerComposeFile": ["docker-compose.yml"],
	"service": "devenv",
	"workspaceFolder": "/workspace",
	"settings": {
		"go.gopath": "/home/dev/go",
		"go.toolsManagement.checkForUpdates": "local",
		"files.autoSave": "afterDelay",
		"files.autoSaveDelay": 5000,
		"terminal.integrated.profiles.linux": {
			"bash": {"path": "bash", "args": ["-l"]},
			"zsh": {"path": "zsh", "args": ["-l"]}
		},
		"terminal.integrated.defaultProfile.linux": "bash"
	},
	"extensions": [
		"ms-vscode.go",
		"premparihar.gotestexplorer",
		"fcrespo82.markdown-table-formatter",
		"mervin.markdown-formatter",
		"gitlab.gitlab-workflow",
		"golang.go"
	],
	"remoteUser": "dev"
}
