{
	"name": "gs-tpl-go",
	"dockerComposeFile": ["docker-compose.yml"],
	"service": "devenv",
	"workspaceFolder": "/workspace",
	"extensions": [
        "EthanSK.restore-terminals",
        "gitlab.gitlab-workflow",
        "mikestead.dotenv",
        "streetsidesoftware.code-spell-checker",
        "yzhang.markdown-all-in-one"
	],
	"remoteUser": "dev",
	"settings": {
		"cSpell.ignorePaths": [
            "*.json",
            ".vscode",
            "*.yaml",
            "*.yml"
        ],
        "cSpell.words": [
        ],
        "files.associations": {
			"*.env.dist": "dotenv",
            "*.env": "dotenv",
			".envrc": "dotenv"
        },
        "files.autoSave": "afterDelay",
        "files.autoSaveDelay": 5000,
        "files.eol": "\n",
        "terminal.integrated.profiles.linux": {
            "bash": {"path": "bash", "args": ["-l"]},
            "zsh": {"path": "zsh", "args": ["-l"]}
        },
        "terminal.integrated.defaultProfile.linux": "bash",
        "terminal.integrated.enablePersistentSessions": false,
        "terminal.integrated.persistentSessionReviveProcess": "never"
	}
}
