{
	"name": "Basic project",
	"dockerComposeFile": ["docker-compose.yml"],
	"service": "dev",
	"workspaceFolder": "/workspace",
    "remoteUser": "dev",
    "customizations": {
        "vscode": {
            "extensions": [
                "EthanSK.restore-terminals@1.1.8",
                "gitlab.gitlab-workflow@3.57.2",
                "mikestead.dotenv@1.0.1",
                "mhutchie.git-graph@1.30.0",
                "streetsidesoftware.code-spell-checker@2.12.0",
                "yzhang.markdown-all-in-one@3.5.0"
            ],
            "settings": {
                "cSpell.ignorePaths": [
                    "*.go",
                    "*.json",
                    "*.vscode",
                    "*.yaml",
                    "*.yml"
                ],
                "files.associations": {
                    "*.env.dist": "dotenv",
                    "*.env": "dotenv",
                    ".envrc": "dotenv"
                },
                "files.autoSave": "afterDelay",
                "files.autoSaveDelay": 5000,
                "files.eol": "\n",
                "restoreTerminals.artificialDelayMilliseconds": 150,
                "restoreTerminals.keepExistingTerminalsOpen": false,
                "restoreTerminals.runOnStartup": true,
                "restoreTerminals.terminals": [{
                    "splitTerminals": [{
                        "commands": [],
                        "name": "dev"
                    }]
                }],
                "terminal.integrated.profiles.linux": {
                    "bash": {"path": "bash", "args": ["-l"]}
                },
                "terminal.integrated.defaultProfile.linux": "bash",
                "terminal.integrated.enablePersistentSessions": true,
                "terminal.integrated.persistentSessionReviveProcess": "never"
            }
        }
    }
}
