{
	"name": "Terraform GCP",
	"image": "registry.gitlab.com/geekstuff.dev/devcontainers/templates/gcloud-cli/alpine/3.20:v0.4",
	"features": {
		// https://gitlab.com/geekstuff.dev/devcontainers/features
		"ghcr.io/geekstuff-dev/devcontainers-features/terraform:0.2": {},
		"./components": {}
	}
}
