{
	"name": "mkdocs-material",
	"build": {
		"dockerfile": "Dockerfile"
	},
	"overrideCommand": false,
	"containerUser": "dev",
	"remoteUser": "dev",
	"features": {
		// https://gitlab.com/geekstuff.dev/devcontainers/features/basics
        "ghcr.io/geekstuff-dev/devcontainers-features/basics": {},
		// https://gitlab.com/geekstuff.dev/devcontainers/features/starship
        "ghcr.io/geekstuff-dev/devcontainers-features/starship": {}
    },
	"customizations": {
		"vscode": {
			"extensions": [
				"davidanson.vscode-markdownlint",
				"EthanSK.restore-terminals",
				"fcrespo82.markdown-table-formatter",
				"ms-python.python",
				"ms-python.vscode-pylance"
			],
			"settings": {
				"cSpell.ignorePaths": [
					"*.json",
					"*.txt",
					"*.yml"
				],
				"editor.rulers": [
					{"column": 80, "color": "#d8db1f32"},
					{"column": 100, "color": "#ff00003b"}
				],
				"files.autoSave": "afterDelay",
				"files.autoSaveDelay": 5000,
				"files.associations": {
					".pages": "yaml"
				},
				"restoreTerminals.artificialDelayMilliseconds": 300,
				"restoreTerminals.keepExistingTerminalsOpen": false,
				"restoreTerminals.runOnStartup": true,
				"restoreTerminals.terminals": [{
					"splitTerminals": [{
						"name": "mkdocs",
						"commands": ["mkdocs-serve-devcontainer"]
					}]
				}],
				"yaml.schemas": {
					"https://squidfunk.github.io/mkdocs-material/schema.json": "mkdocs.yml"
				},
				"yaml.customTags": [
					"!ENV scalar",
					"!ENV sequence",
					"tag:yaml.org,2002:python/name:materialx.emoji.to_svg",
					"tag:yaml.org,2002:python/name:materialx.emoji.twemoji",
					"tag:yaml.org,2002:python/name:pymdownx.superfences.fence_code_format"
				]
			}
		}
	},
    // "mounts": [
    //     "source=vscode-ext,target=${localEnv:HOME}/.vscode-server/extensions,type=volume",
    //     "source=vscode-ext-insiders,target=${localEnv:HOME}/.vscode-server-insiders/extensions,type=volume"
    // ],
	"containerEnv": {
	 	// "PYTHONPATH": "${containerWorkspaceFolder}:${containerWorkspaceFolder}/src"
		"CONTAINER_WORKSPACE_FOLDER": "${containerWorkspaceFolder}",
	}
}
