{
    "name": "Starship",
    "id": "starship",
    "version": "0.0.0",
    "description": "Install and setup Starship.rs",
    "documentationURL": "https://gitlab.com/geekstuff.dev/devcontainers/features/starship/-/blob/v0.0.0/README.md",
    "licenseURL": "https://gitlab.com/geekstuff.dev/devcontainers/features/starship/-/blob/v0.0.0/LICENSE",
    "installsAfter": ["ghcr.io/geekstuff-dev/devcontainers-features/basics"]
}
