[gd_scene load_steps=2 format=2]

[ext_resource path="res://HUD/HUD.gd" type="Script" id=1]

[node name="Node2D" type="Node2D"]
script = ExtResource( 1 )

[node name="Polygon2D" type="Polygon2D" parent="."]
position = Vector2( 80, 80 )
scale = Vector2( 0.8, 1 )
color = Color( 0.945098, 0.878431, 0.188235, 1 )
polygon = PoolVector2Array( 0, 0, 100, 0, 100, 20, 0, 20 )

[node name="Line2D" type="Line2D" parent="."]
position = Vector2( 80, 80 )
points = PoolVector2Array( 0, 0, 100, 0, 100, 20, 0, 20, 0, 0 )
width = 5.0
texture_mode = -1130584539
joint_mode = 2
begin_cap_mode = 2
end_cap_mode = 2

