English,German
Every day is the same...,Jeden Tag das Gleiche…
Every minute feels like an hour,Jede Minute fühlt sich an wie eine Stunde
Every second feels like an eternity.,Jede Sekunde fühlt sich an wie eine Ewigkeit.
When is it my turn?,Bin ich bald draaaaaaan?
This world just isn't interesting.,Nichts interessantes auf dieser Welt...
It's all the same. Again and again and again and again,"Immer dasselbe. Immer wieder und wieder
und wieder und wieder..."
Every day is like every other day,"Jeder Tag ist genauso, wie jeder andere"
Wasn't this also here last week?,War das nicht letzte Woche auch schon da?
I'm bored,Mir ist langweilig
Everything is on repeat. There's nothing new.,"Alles wiederholt sich nur, wann kommt mal was Neues?"