%YAML 1.1
%TAG !u! tag:unity3d.com,2011:
--- !u!1001 &6140565881379242581
PrefabInstance:
  m_ObjectHideFlags: 0
  serializedVersion: 2
  m_Modification:
    m_TransformParent: {fileID: 0}
    m_Modifications:
    - target: {fileID: 2762312290090151805, guid: 73ef329c7fa590d459a265d255c2489b, type: 3}
      propertyPath: m_SortingLayer
      value: 1
      objectReference: {fileID: 0}
    - target: {fileID: 2762312290090151805, guid: 73ef329c7fa590d459a265d255c2489b, type: 3}
      propertyPath: m_SortingLayerID
      value: -929646459
      objectReference: {fileID: 0}
    - target: {fileID: 4833541338863061749, guid: 73ef329c7fa590d459a265d255c2489b, type: 3}
      propertyPath: m_RootOrder
      value: 0
      objectReference: {fileID: 0}
    - target: {fileID: 4833541338863061749, guid: 73ef329c7fa590d459a265d255c2489b, type: 3}
      propertyPath: m_LocalScale.x
      value: 0.2796609
      objectReference: {fileID: 0}
    - target: {fileID: 4833541338863061749, guid: 73ef329c7fa590d459a265d255c2489b, type: 3}
      propertyPath: m_LocalPosition.x
      value: -0.3606
      objectReference: {fileID: 0}
    - target: {fileID: 4833541338863061749, guid: 73ef329c7fa590d459a265d255c2489b, type: 3}
      propertyPath: m_LocalPosition.y
      value: -1.13
      objectReference: {fileID: 0}
    - target: {fileID: 4833541338863061749, guid: 73ef329c7fa590d459a265d255c2489b, type: 3}
      propertyPath: m_LocalPosition.z
      value: 0
      objectReference: {fileID: 0}
    - target: {fileID: 4833541338863061749, guid: 73ef329c7fa590d459a265d255c2489b, type: 3}
      propertyPath: m_LocalRotation.w
      value: 1
      objectReference: {fileID: 0}
    - target: {fileID: 4833541338863061749, guid: 73ef329c7fa590d459a265d255c2489b, type: 3}
      propertyPath: m_LocalRotation.x
      value: 0
      objectReference: {fileID: 0}
    - target: {fileID: 4833541338863061749, guid: 73ef329c7fa590d459a265d255c2489b, type: 3}
      propertyPath: m_LocalRotation.y
      value: 0
      objectReference: {fileID: 0}
    - target: {fileID: 4833541338863061749, guid: 73ef329c7fa590d459a265d255c2489b, type: 3}
      propertyPath: m_LocalRotation.z
      value: 0
      objectReference: {fileID: 0}
    - target: {fileID: 4833541338863061749, guid: 73ef329c7fa590d459a265d255c2489b, type: 3}
      propertyPath: m_LocalEulerAnglesHint.x
      value: 0
      objectReference: {fileID: 0}
    - target: {fileID: 4833541338863061749, guid: 73ef329c7fa590d459a265d255c2489b, type: 3}
      propertyPath: m_LocalEulerAnglesHint.y
      value: 0
      objectReference: {fileID: 0}
    - target: {fileID: 4833541338863061749, guid: 73ef329c7fa590d459a265d255c2489b, type: 3}
      propertyPath: m_LocalEulerAnglesHint.z
      value: 0
      objectReference: {fileID: 0}
    - target: {fileID: 6520740886857568658, guid: 73ef329c7fa590d459a265d255c2489b, type: 3}
      propertyPath: m_Name
      value: Slot_WR
      objectReference: {fileID: 0}
    m_RemovedComponents: []
  m_SourcePrefab: {fileID: 100100000, guid: 73ef329c7fa590d459a265d255c2489b, type: 3}
