%YAML 1.1
%TAG !u! tag:unity3d.com,2011:
--- !u!1 &3909871392571571515
GameObject:
  m_ObjectHideFlags: 0
  m_CorrespondingSourceObject: {fileID: 0}
  m_PrefabInstance: {fileID: 0}
  m_PrefabAsset: {fileID: 0}
  serializedVersion: 6
  m_Component:
  - component: {fileID: 3909871392571571512}
  - component: {fileID: 3909871392571571516}
  - component: {fileID: 3909871392571571519}
  - component: {fileID: 3909871392571571518}
  - component: {fileID: 3909871392571571513}
  m_Layer: 7
  m_Name: Double_3
  m_TagString: Room
  m_Icon: {fileID: 0}
  m_NavMeshLayer: 0
  m_StaticEditorFlags: 0
  m_IsActive: 1
--- !u!4 &3909871392571571512
Transform:
  m_ObjectHideFlags: 0
  m_CorrespondingSourceObject: {fileID: 0}
  m_PrefabInstance: {fileID: 0}
  m_PrefabAsset: {fileID: 0}
  m_GameObject: {fileID: 3909871392571571515}
  m_LocalRotation: {x: -0, y: -0, z: -0, w: 1}
  m_LocalPosition: {x: -0.22, y: -0.2842, z: 0}
  m_LocalScale: {x: 0.01096817, y: 0.003076223, z: 0.0409872}
  m_Children:
  - {fileID: 8455111847955064404}
  - {fileID: 8455111848341519233}
  m_Father: {fileID: 0}
  m_RootOrder: 0
  m_LocalEulerAnglesHint: {x: 0, y: 0, z: 0}
--- !u!212 &3909871392571571516
SpriteRenderer:
  m_ObjectHideFlags: 0
  m_CorrespondingSourceObject: {fileID: 0}
  m_PrefabInstance: {fileID: 0}
  m_PrefabAsset: {fileID: 0}
  m_GameObject: {fileID: 3909871392571571515}
  m_Enabled: 1
  m_CastShadows: 0
  m_ReceiveShadows: 0
  m_DynamicOccludee: 1
  m_MotionVectors: 1
  m_LightProbeUsage: 1
  m_ReflectionProbeUsage: 1
  m_RayTracingMode: 0
  m_RayTraceProcedural: 0
  m_RenderingLayerMask: 1
  m_RendererPriority: 0
  m_Materials:
  - {fileID: 10754, guid: 0000000000000000f000000000000000, type: 0}
  m_StaticBatchInfo:
    firstSubMesh: 0
    subMeshCount: 0
  m_StaticBatchRoot: {fileID: 0}
  m_ProbeAnchor: {fileID: 0}
  m_LightProbeVolumeOverride: {fileID: 0}
  m_ScaleInLightmap: 1
  m_ReceiveGI: 1
  m_PreserveUVs: 0
  m_IgnoreNormalsForChartDetection: 0
  m_ImportantGI: 0
  m_StitchLightmapSeams: 1
  m_SelectedEditorRenderState: 0
  m_MinimumChartSize: 4
  m_AutoUVMaxDistance: 0.5
  m_AutoUVMaxAngle: 89
  m_LightmapParameters: {fileID: 0}
  m_SortingLayerID: 1510830433
  m_SortingLayer: 2
  m_SortingOrder: 0
  m_Sprite: {fileID: 21300000, guid: d57593c8c077cc54692363d7bd4601d2, type: 3}
  m_Color: {r: 1, g: 1, b: 1, a: 1}
  m_FlipX: 0
  m_FlipY: 0
  m_DrawMode: 0
  m_Size: {x: 1, y: 1}
  m_AdaptiveModeThreshold: 0.5
  m_SpriteTileMode: 0
  m_WasSpriteAssigned: 1
  m_MaskInteraction: 0
  m_SpriteSortPoint: 0
--- !u!114 &3909871392571571519
MonoBehaviour:
  m_ObjectHideFlags: 0
  m_CorrespondingSourceObject: {fileID: 0}
  m_PrefabInstance: {fileID: 0}
  m_PrefabAsset: {fileID: 0}
  m_GameObject: {fileID: 3909871392571571515}
  m_Enabled: 1
  m_EditorHideFlags: 0
  m_Script: {fileID: 11500000, guid: f940ebc447d6c7943b14ab5034012d12, type: 3}
  m_Name: 
  m_EditorClassIdentifier: 
  ACTIVE: 1
  CAPACITY: 2
  SLOTS:
  - {fileID: 7799377045025553715}
  - {fileID: 7799377043296887014}
  EFFECT_ACTIVITY: 0
  EFFECT_AWARENESS: 0
  EFFECT_EMOTION: 0
--- !u!114 &3909871392571571518
MonoBehaviour:
  m_ObjectHideFlags: 0
  m_CorrespondingSourceObject: {fileID: 0}
  m_PrefabInstance: {fileID: 0}
  m_PrefabAsset: {fileID: 0}
  m_GameObject: {fileID: 3909871392571571515}
  m_Enabled: 1
  m_EditorHideFlags: 0
  m_Script: {fileID: 11500000, guid: 62899f850307741f2a39c98a8b639597, type: 3}
  m_Name: 
  m_EditorClassIdentifier: 
  m_Actions: {fileID: -944628639613478452, guid: 20ba93a8578586f4b8b2fa6efc1fafcd, type: 3}
  m_NotificationBehavior: 0
  m_UIInputModule: {fileID: 0}
  m_DeviceLostEvent:
    m_PersistentCalls:
      m_Calls: []
  m_DeviceRegainedEvent:
    m_PersistentCalls:
      m_Calls: []
  m_ControlsChangedEvent:
    m_PersistentCalls:
      m_Calls: []
  m_ActionEvents: []
  m_NeverAutoSwitchControlSchemes: 0
  m_DefaultControlScheme: 
  m_DefaultActionMap: Touch
  m_SplitScreenIndex: -1
  m_Camera: {fileID: 0}
--- !u!61 &3909871392571571513
BoxCollider2D:
  m_ObjectHideFlags: 0
  m_CorrespondingSourceObject: {fileID: 0}
  m_PrefabInstance: {fileID: 0}
  m_PrefabAsset: {fileID: 0}
  m_GameObject: {fileID: 3909871392571571515}
  m_Enabled: 1
  m_Density: 1
  m_Material: {fileID: 0}
  m_IsTrigger: 0
  m_UsedByEffector: 0
  m_UsedByComposite: 0
  m_Offset: {x: -0.01741314, y: -0.036514282}
  m_SpriteTilingProperty:
    border: {x: 0, y: 0, z: 0, w: 0}
    pivot: {x: 0.5, y: 0.5}
    oldSize: {x: 39.06215, y: 40.12}
    newSize: {x: 1, y: 1}
    adaptiveTilingThreshold: 0.5
    drawMode: 0
    adaptiveTiling: 0
  m_AutoTiling: 0
  serializedVersion: 2
  m_Size: {x: 38.833153, y: 39.77877}
  m_EdgeRadius: 0
--- !u!1001 &3909871391630404769
PrefabInstance:
  m_ObjectHideFlags: 0
  serializedVersion: 2
  m_Modification:
    m_TransformParent: {fileID: 3909871392571571512}
    m_Modifications:
    - target: {fileID: 4833541338863061749, guid: 73ef329c7fa590d459a265d255c2489b, type: 3}
      propertyPath: m_RootOrder
      value: 0
      objectReference: {fileID: 0}
    - target: {fileID: 4833541338863061749, guid: 73ef329c7fa590d459a265d255c2489b, type: 3}
      propertyPath: m_LocalScale.x
      value: 19.107492
      objectReference: {fileID: 0}
    - target: {fileID: 4833541338863061749, guid: 73ef329c7fa590d459a265d255c2489b, type: 3}
      propertyPath: m_LocalScale.y
      value: 38.38523
      objectReference: {fileID: 0}
    - target: {fileID: 4833541338863061749, guid: 73ef329c7fa590d459a265d255c2489b, type: 3}
      propertyPath: m_LocalPosition.x
      value: -9.56
      objectReference: {fileID: 0}
    - target: {fileID: 4833541338863061749, guid: 73ef329c7fa590d459a265d255c2489b, type: 3}
      propertyPath: m_LocalPosition.y
      value: 0.39
      objectReference: {fileID: 0}
    - target: {fileID: 4833541338863061749, guid: 73ef329c7fa590d459a265d255c2489b, type: 3}
      propertyPath: m_LocalPosition.z
      value: -3
      objectReference: {fileID: 0}
    - target: {fileID: 4833541338863061749, guid: 73ef329c7fa590d459a265d255c2489b, type: 3}
      propertyPath: m_LocalRotation.w
      value: 1
      objectReference: {fileID: 0}
    - target: {fileID: 4833541338863061749, guid: 73ef329c7fa590d459a265d255c2489b, type: 3}
      propertyPath: m_LocalRotation.x
      value: 0
      objectReference: {fileID: 0}
    - target: {fileID: 4833541338863061749, guid: 73ef329c7fa590d459a265d255c2489b, type: 3}
      propertyPath: m_LocalRotation.y
      value: 0
      objectReference: {fileID: 0}
    - target: {fileID: 4833541338863061749, guid: 73ef329c7fa590d459a265d255c2489b, type: 3}
      propertyPath: m_LocalRotation.z
      value: 0
      objectReference: {fileID: 0}
    - target: {fileID: 4833541338863061749, guid: 73ef329c7fa590d459a265d255c2489b, type: 3}
      propertyPath: m_LocalEulerAnglesHint.x
      value: 0
      objectReference: {fileID: 0}
    - target: {fileID: 4833541338863061749, guid: 73ef329c7fa590d459a265d255c2489b, type: 3}
      propertyPath: m_LocalEulerAnglesHint.y
      value: 0
      objectReference: {fileID: 0}
    - target: {fileID: 4833541338863061749, guid: 73ef329c7fa590d459a265d255c2489b, type: 3}
      propertyPath: m_LocalEulerAnglesHint.z
      value: 0
      objectReference: {fileID: 0}
    - target: {fileID: 6520740886857568658, guid: 73ef329c7fa590d459a265d255c2489b, type: 3}
      propertyPath: m_Name
      value: 1.1.1
      objectReference: {fileID: 0}
    m_RemovedComponents: []
  m_SourcePrefab: {fileID: 100100000, guid: 73ef329c7fa590d459a265d255c2489b, type: 3}
--- !u!1 &7799377045025553715 stripped
GameObject:
  m_CorrespondingSourceObject: {fileID: 6520740886857568658, guid: 73ef329c7fa590d459a265d255c2489b, type: 3}
  m_PrefabInstance: {fileID: 3909871391630404769}
  m_PrefabAsset: {fileID: 0}
--- !u!4 &8455111847955064404 stripped
Transform:
  m_CorrespondingSourceObject: {fileID: 4833541338863061749, guid: 73ef329c7fa590d459a265d255c2489b, type: 3}
  m_PrefabInstance: {fileID: 3909871391630404769}
  m_PrefabAsset: {fileID: 0}
--- !u!1001 &3909871392284143988
PrefabInstance:
  m_ObjectHideFlags: 0
  serializedVersion: 2
  m_Modification:
    m_TransformParent: {fileID: 3909871392571571512}
    m_Modifications:
    - target: {fileID: 4833541338863061749, guid: 73ef329c7fa590d459a265d255c2489b, type: 3}
      propertyPath: m_RootOrder
      value: 1
      objectReference: {fileID: 0}
    - target: {fileID: 4833541338863061749, guid: 73ef329c7fa590d459a265d255c2489b, type: 3}
      propertyPath: m_LocalScale.x
      value: 19.136866
      objectReference: {fileID: 0}
    - target: {fileID: 4833541338863061749, guid: 73ef329c7fa590d459a265d255c2489b, type: 3}
      propertyPath: m_LocalScale.y
      value: 38.412434
      objectReference: {fileID: 0}
    - target: {fileID: 4833541338863061749, guid: 73ef329c7fa590d459a265d255c2489b, type: 3}
      propertyPath: m_LocalPosition.x
      value: 9.581
      objectReference: {fileID: 0}
    - target: {fileID: 4833541338863061749, guid: 73ef329c7fa590d459a265d255c2489b, type: 3}
      propertyPath: m_LocalPosition.y
      value: 0.73
      objectReference: {fileID: 0}
    - target: {fileID: 4833541338863061749, guid: 73ef329c7fa590d459a265d255c2489b, type: 3}
      propertyPath: m_LocalPosition.z
      value: -3
      objectReference: {fileID: 0}
    - target: {fileID: 4833541338863061749, guid: 73ef329c7fa590d459a265d255c2489b, type: 3}
      propertyPath: m_LocalRotation.w
      value: 1
      objectReference: {fileID: 0}
    - target: {fileID: 4833541338863061749, guid: 73ef329c7fa590d459a265d255c2489b, type: 3}
      propertyPath: m_LocalRotation.x
      value: 0
      objectReference: {fileID: 0}
    - target: {fileID: 4833541338863061749, guid: 73ef329c7fa590d459a265d255c2489b, type: 3}
      propertyPath: m_LocalRotation.y
      value: 0
      objectReference: {fileID: 0}
    - target: {fileID: 4833541338863061749, guid: 73ef329c7fa590d459a265d255c2489b, type: 3}
      propertyPath: m_LocalRotation.z
      value: 0
      objectReference: {fileID: 0}
    - target: {fileID: 4833541338863061749, guid: 73ef329c7fa590d459a265d255c2489b, type: 3}
      propertyPath: m_LocalEulerAnglesHint.x
      value: 0
      objectReference: {fileID: 0}
    - target: {fileID: 4833541338863061749, guid: 73ef329c7fa590d459a265d255c2489b, type: 3}
      propertyPath: m_LocalEulerAnglesHint.y
      value: 0
      objectReference: {fileID: 0}
    - target: {fileID: 4833541338863061749, guid: 73ef329c7fa590d459a265d255c2489b, type: 3}
      propertyPath: m_LocalEulerAnglesHint.z
      value: 0
      objectReference: {fileID: 0}
    - target: {fileID: 6520740886857568658, guid: 73ef329c7fa590d459a265d255c2489b, type: 3}
      propertyPath: m_Name
      value: 1.1.2
      objectReference: {fileID: 0}
    m_RemovedComponents: []
  m_SourcePrefab: {fileID: 100100000, guid: 73ef329c7fa590d459a265d255c2489b, type: 3}
--- !u!1 &7799377043296887014 stripped
GameObject:
  m_CorrespondingSourceObject: {fileID: 6520740886857568658, guid: 73ef329c7fa590d459a265d255c2489b, type: 3}
  m_PrefabInstance: {fileID: 3909871392284143988}
  m_PrefabAsset: {fileID: 0}
--- !u!4 &8455111848341519233 stripped
Transform:
  m_CorrespondingSourceObject: {fileID: 4833541338863061749, guid: 73ef329c7fa590d459a265d255c2489b, type: 3}
  m_PrefabInstance: {fileID: 3909871392284143988}
  m_PrefabAsset: {fileID: 0}
