%YAML 1.1
%TAG !u! tag:unity3d.com,2011:
--- !u!114 &11400000
MonoBehaviour:
  m_ObjectHideFlags: 0
  m_CorrespondingSourceObject: {fileID: 0}
  m_PrefabInstance: {fileID: 0}
  m_PrefabAsset: {fileID: 0}
  m_GameObject: {fileID: 0}
  m_Enabled: 1
  m_EditorHideFlags: 0
  m_Script: {fileID: 11500000, guid: 58764fe07e18cfe459d04ba563c4bc40, type: 3}
  m_Name: TrapVent
  m_EditorClassIdentifier: 
  parts:
  - {fileID: 11400000, guid: c6d56c29c14ce324cbbe854b5b502ac4, type: 2}
