%YAML 1.1
%TAG !u! tag:unity3d.com,2011:
--- !u!114 &11400000
MonoBehaviour:
  m_ObjectHideFlags: 0
  m_CorrespondingSourceObject: {fileID: 0}
  m_PrefabInstance: {fileID: 0}
  m_PrefabAsset: {fileID: 0}
  m_GameObject: {fileID: 0}
  m_Enabled: 1
  m_EditorHideFlags: 0
  m_Script: {fileID: 11500000, guid: 2312e900e84c769409a6d171b68932c4, type: 3}
  m_Name: Level02QuestChain
  m_EditorClassIdentifier: 
  objectives:
  - {fileID: 11400000, guid: b7424ebe269146e4ba1df14b80e93363, type: 2}
  - {fileID: 11400000, guid: df6fe4f0a964b0848b6e46dbf2503c4e, type: 2}
  - {fileID: 11400000, guid: 4dd66e3f318f43848a8a619eb5a427a2, type: 2}
  - {fileID: 11400000, guid: 7ae1dcb4f5586eb4980985762fbe2fb4, type: 2}
  - {fileID: 11400000, guid: b41f61622b5361e46a765a2ca63edc05, type: 2}
  - {fileID: 11400000, guid: e742102d026263946b3831b3404ca696, type: 2}
  - {fileID: 11400000, guid: a0a5effd206eba14888ac60413642551, type: 2}
  - {fileID: 11400000, guid: 5f6088d27c047f04d87bbc644479bc86, type: 2}
  currentObejtiveIndex: 0
