%YAML 1.1
%TAG !u! tag:unity3d.com,2011:
--- !u!114 &11400000
MonoBehaviour:
  m_ObjectHideFlags: 0
  m_CorrespondingSourceObject: {fileID: 0}
  m_PrefabInstance: {fileID: 0}
  m_PrefabAsset: {fileID: 0}
  m_GameObject: {fileID: 0}
  m_Enabled: 1
  m_EditorHideFlags: 0
  m_Script: {fileID: 11500000, guid: 58764fe07e18cfe459d04ba563c4bc40, type: 3}
  m_Name: MazeKeyCard02
  m_EditorClassIdentifier: 
  parts:
  - {fileID: 11400000, guid: d311e1517ce15f4459a2742bdd3e95cb, type: 2}
  - {fileID: 11400000, guid: b50d44a835a04a2439b9945eb21444cf, type: 2}
  - {fileID: 11400000, guid: e37c7aadeaed4554bb265fa4c9267067, type: 2}
