%YAML 1.1
%TAG !u! tag:unity3d.com,2011:
--- !u!1001 &7057282588307857519
PrefabInstance:
  m_ObjectHideFlags: 0
  serializedVersion: 2
  m_Modification:
    m_TransformParent: {fileID: 0}
    m_Modifications:
    - target: {fileID: -9167567391013820921, guid: 3f34df7a3a690434c88232778351fdef, type: 3}
      propertyPath: m_Layer
      value: 16
      objectReference: {fileID: 0}
    - target: {fileID: -9070493210130169274, guid: 3f34df7a3a690434c88232778351fdef, type: 3}
      propertyPath: m_Layer
      value: 16
      objectReference: {fileID: 0}
    - target: {fileID: -8679921383154817045, guid: 3f34df7a3a690434c88232778351fdef, type: 3}
      propertyPath: m_RootOrder
      value: 0
      objectReference: {fileID: 0}
    - target: {fileID: -8679921383154817045, guid: 3f34df7a3a690434c88232778351fdef, type: 3}
      propertyPath: m_LocalPosition.x
      value: 0
      objectReference: {fileID: 0}
    - target: {fileID: -8679921383154817045, guid: 3f34df7a3a690434c88232778351fdef, type: 3}
      propertyPath: m_LocalPosition.y
      value: 0
      objectReference: {fileID: 0}
    - target: {fileID: -8679921383154817045, guid: 3f34df7a3a690434c88232778351fdef, type: 3}
      propertyPath: m_LocalPosition.z
      value: 0
      objectReference: {fileID: 0}
    - target: {fileID: -8679921383154817045, guid: 3f34df7a3a690434c88232778351fdef, type: 3}
      propertyPath: m_LocalRotation.w
      value: 1
      objectReference: {fileID: 0}
    - target: {fileID: -8679921383154817045, guid: 3f34df7a3a690434c88232778351fdef, type: 3}
      propertyPath: m_LocalRotation.x
      value: -0
      objectReference: {fileID: 0}
    - target: {fileID: -8679921383154817045, guid: 3f34df7a3a690434c88232778351fdef, type: 3}
      propertyPath: m_LocalRotation.y
      value: -0
      objectReference: {fileID: 0}
    - target: {fileID: -8679921383154817045, guid: 3f34df7a3a690434c88232778351fdef, type: 3}
      propertyPath: m_LocalRotation.z
      value: -0
      objectReference: {fileID: 0}
    - target: {fileID: -8679921383154817045, guid: 3f34df7a3a690434c88232778351fdef, type: 3}
      propertyPath: m_LocalEulerAnglesHint.x
      value: 0
      objectReference: {fileID: 0}
    - target: {fileID: -8679921383154817045, guid: 3f34df7a3a690434c88232778351fdef, type: 3}
      propertyPath: m_LocalEulerAnglesHint.y
      value: 0
      objectReference: {fileID: 0}
    - target: {fileID: -8679921383154817045, guid: 3f34df7a3a690434c88232778351fdef, type: 3}
      propertyPath: m_LocalEulerAnglesHint.z
      value: 0
      objectReference: {fileID: 0}
    - target: {fileID: -8183481454299698827, guid: 3f34df7a3a690434c88232778351fdef, type: 3}
      propertyPath: m_Layer
      value: 16
      objectReference: {fileID: 0}
    - target: {fileID: -8006009767450596044, guid: 3f34df7a3a690434c88232778351fdef, type: 3}
      propertyPath: m_Layer
      value: 16
      objectReference: {fileID: 0}
    - target: {fileID: -7657966619581158213, guid: 3f34df7a3a690434c88232778351fdef, type: 3}
      propertyPath: m_Layer
      value: 16
      objectReference: {fileID: 0}
    - target: {fileID: -7360747449169001873, guid: 3f34df7a3a690434c88232778351fdef, type: 3}
      propertyPath: m_Layer
      value: 16
      objectReference: {fileID: 0}
    - target: {fileID: -7121769801107515815, guid: 3f34df7a3a690434c88232778351fdef, type: 3}
      propertyPath: m_Layer
      value: 16
      objectReference: {fileID: 0}
    - target: {fileID: -6621945745981909287, guid: 3f34df7a3a690434c88232778351fdef, type: 3}
      propertyPath: m_Layer
      value: 16
      objectReference: {fileID: 0}
    - target: {fileID: -6370085079684087283, guid: 3f34df7a3a690434c88232778351fdef, type: 3}
      propertyPath: m_Layer
      value: 16
      objectReference: {fileID: 0}
    - target: {fileID: -6234591296559379751, guid: 3f34df7a3a690434c88232778351fdef, type: 3}
      propertyPath: m_Layer
      value: 16
      objectReference: {fileID: 0}
    - target: {fileID: -6170625038081293824, guid: 3f34df7a3a690434c88232778351fdef, type: 3}
      propertyPath: m_Layer
      value: 16
      objectReference: {fileID: 0}
    - target: {fileID: -6072391574331347817, guid: 3f34df7a3a690434c88232778351fdef, type: 3}
      propertyPath: m_Layer
      value: 16
      objectReference: {fileID: 0}
    - target: {fileID: -6056541330796499132, guid: 3f34df7a3a690434c88232778351fdef, type: 3}
      propertyPath: m_Layer
      value: 16
      objectReference: {fileID: 0}
    - target: {fileID: -5857696854640597626, guid: 3f34df7a3a690434c88232778351fdef, type: 3}
      propertyPath: m_Layer
      value: 16
      objectReference: {fileID: 0}
    - target: {fileID: -5561550452697079657, guid: 3f34df7a3a690434c88232778351fdef, type: 3}
      propertyPath: m_Layer
      value: 16
      objectReference: {fileID: 0}
    - target: {fileID: -5195048882033904264, guid: 3f34df7a3a690434c88232778351fdef, type: 3}
      propertyPath: m_Layer
      value: 16
      objectReference: {fileID: 0}
    - target: {fileID: -4999088201633142198, guid: 3f34df7a3a690434c88232778351fdef, type: 3}
      propertyPath: m_Layer
      value: 16
      objectReference: {fileID: 0}
    - target: {fileID: -4728426434207774260, guid: 3f34df7a3a690434c88232778351fdef, type: 3}
      propertyPath: m_Layer
      value: 16
      objectReference: {fileID: 0}
    - target: {fileID: -4501530691011011137, guid: 3f34df7a3a690434c88232778351fdef, type: 3}
      propertyPath: m_Layer
      value: 16
      objectReference: {fileID: 0}
    - target: {fileID: -4332706925441422008, guid: 3f34df7a3a690434c88232778351fdef, type: 3}
      propertyPath: m_Layer
      value: 16
      objectReference: {fileID: 0}
    - target: {fileID: -4278032810995721380, guid: 3f34df7a3a690434c88232778351fdef, type: 3}
      propertyPath: m_Layer
      value: 16
      objectReference: {fileID: 0}
    - target: {fileID: -3799395697873186154, guid: 3f34df7a3a690434c88232778351fdef, type: 3}
      propertyPath: m_Layer
      value: 16
      objectReference: {fileID: 0}
    - target: {fileID: -3542885339558904099, guid: 3f34df7a3a690434c88232778351fdef, type: 3}
      propertyPath: m_Layer
      value: 16
      objectReference: {fileID: 0}
    - target: {fileID: -3478013746326755454, guid: 3f34df7a3a690434c88232778351fdef, type: 3}
      propertyPath: m_Layer
      value: 16
      objectReference: {fileID: 0}
    - target: {fileID: -3214267034143217929, guid: 3f34df7a3a690434c88232778351fdef, type: 3}
      propertyPath: m_Layer
      value: 16
      objectReference: {fileID: 0}
    - target: {fileID: -3086436065929644917, guid: 3f34df7a3a690434c88232778351fdef, type: 3}
      propertyPath: m_Layer
      value: 16
      objectReference: {fileID: 0}
    - target: {fileID: -2084811680363313996, guid: 3f34df7a3a690434c88232778351fdef, type: 3}
      propertyPath: m_Layer
      value: 16
      objectReference: {fileID: 0}
    - target: {fileID: -1781356600409242780, guid: 3f34df7a3a690434c88232778351fdef, type: 3}
      propertyPath: m_Layer
      value: 16
      objectReference: {fileID: 0}
    - target: {fileID: -1703473491307067327, guid: 3f34df7a3a690434c88232778351fdef, type: 3}
      propertyPath: m_Layer
      value: 16
      objectReference: {fileID: 0}
    - target: {fileID: -1425791611860619382, guid: 3f34df7a3a690434c88232778351fdef, type: 3}
      propertyPath: m_Layer
      value: 16
      objectReference: {fileID: 0}
    - target: {fileID: -1268151995469589007, guid: 3f34df7a3a690434c88232778351fdef, type: 3}
      propertyPath: m_Layer
      value: 16
      objectReference: {fileID: 0}
    - target: {fileID: -1200856079203341021, guid: 3f34df7a3a690434c88232778351fdef, type: 3}
      propertyPath: m_Layer
      value: 16
      objectReference: {fileID: 0}
    - target: {fileID: -751476226918971245, guid: 3f34df7a3a690434c88232778351fdef, type: 3}
      propertyPath: m_Layer
      value: 16
      objectReference: {fileID: 0}
    - target: {fileID: -552831747908440785, guid: 3f34df7a3a690434c88232778351fdef, type: 3}
      propertyPath: m_Layer
      value: 16
      objectReference: {fileID: 0}
    - target: {fileID: -290750445479886849, guid: 3f34df7a3a690434c88232778351fdef, type: 3}
      propertyPath: m_Layer
      value: 16
      objectReference: {fileID: 0}
    - target: {fileID: -203856693384778745, guid: 3f34df7a3a690434c88232778351fdef, type: 3}
      propertyPath: m_Layer
      value: 16
      objectReference: {fileID: 0}
    - target: {fileID: -76546954072915012, guid: 3f34df7a3a690434c88232778351fdef, type: 3}
      propertyPath: m_Layer
      value: 16
      objectReference: {fileID: 0}
    - target: {fileID: 9171100556185337, guid: 3f34df7a3a690434c88232778351fdef, type: 3}
      propertyPath: m_Layer
      value: 16
      objectReference: {fileID: 0}
    - target: {fileID: 154846308390679381, guid: 3f34df7a3a690434c88232778351fdef, type: 3}
      propertyPath: m_Layer
      value: 16
      objectReference: {fileID: 0}
    - target: {fileID: 414117464747255840, guid: 3f34df7a3a690434c88232778351fdef, type: 3}
      propertyPath: m_Layer
      value: 16
      objectReference: {fileID: 0}
    - target: {fileID: 919132149155446097, guid: 3f34df7a3a690434c88232778351fdef, type: 3}
      propertyPath: m_Name
      value: Chicken Portrait
      objectReference: {fileID: 0}
    - target: {fileID: 919132149155446097, guid: 3f34df7a3a690434c88232778351fdef, type: 3}
      propertyPath: m_Layer
      value: 16
      objectReference: {fileID: 0}
    - target: {fileID: 1082271958561512970, guid: 3f34df7a3a690434c88232778351fdef, type: 3}
      propertyPath: m_Layer
      value: 16
      objectReference: {fileID: 0}
    - target: {fileID: 1339101018200438765, guid: 3f34df7a3a690434c88232778351fdef, type: 3}
      propertyPath: m_Layer
      value: 16
      objectReference: {fileID: 0}
    - target: {fileID: 1585326124852045275, guid: 3f34df7a3a690434c88232778351fdef, type: 3}
      propertyPath: m_Layer
      value: 16
      objectReference: {fileID: 0}
    - target: {fileID: 1711505207429034123, guid: 3f34df7a3a690434c88232778351fdef, type: 3}
      propertyPath: m_Layer
      value: 16
      objectReference: {fileID: 0}
    - target: {fileID: 2158975759703390516, guid: 3f34df7a3a690434c88232778351fdef, type: 3}
      propertyPath: m_Layer
      value: 16
      objectReference: {fileID: 0}
    - target: {fileID: 2586065998465600510, guid: 3f34df7a3a690434c88232778351fdef, type: 3}
      propertyPath: m_Layer
      value: 16
      objectReference: {fileID: 0}
    - target: {fileID: 2715566404302941441, guid: 3f34df7a3a690434c88232778351fdef, type: 3}
      propertyPath: m_Layer
      value: 16
      objectReference: {fileID: 0}
    - target: {fileID: 2898355158428612036, guid: 3f34df7a3a690434c88232778351fdef, type: 3}
      propertyPath: m_Layer
      value: 16
      objectReference: {fileID: 0}
    - target: {fileID: 3047284246813455858, guid: 3f34df7a3a690434c88232778351fdef, type: 3}
      propertyPath: m_Layer
      value: 16
      objectReference: {fileID: 0}
    - target: {fileID: 3135921509060577837, guid: 3f34df7a3a690434c88232778351fdef, type: 3}
      propertyPath: m_Layer
      value: 16
      objectReference: {fileID: 0}
    - target: {fileID: 3588849560313704984, guid: 3f34df7a3a690434c88232778351fdef, type: 3}
      propertyPath: m_Layer
      value: 16
      objectReference: {fileID: 0}
    - target: {fileID: 3614653200513675785, guid: 3f34df7a3a690434c88232778351fdef, type: 3}
      propertyPath: m_Layer
      value: 16
      objectReference: {fileID: 0}
    - target: {fileID: 3882815353823017779, guid: 3f34df7a3a690434c88232778351fdef, type: 3}
      propertyPath: m_Layer
      value: 16
      objectReference: {fileID: 0}
    - target: {fileID: 3948933247560734027, guid: 3f34df7a3a690434c88232778351fdef, type: 3}
      propertyPath: m_Layer
      value: 16
      objectReference: {fileID: 0}
    - target: {fileID: 3974016661214395164, guid: 3f34df7a3a690434c88232778351fdef, type: 3}
      propertyPath: m_Layer
      value: 16
      objectReference: {fileID: 0}
    - target: {fileID: 4114030615378554161, guid: 3f34df7a3a690434c88232778351fdef, type: 3}
      propertyPath: m_Layer
      value: 16
      objectReference: {fileID: 0}
    - target: {fileID: 4237274458221626025, guid: 3f34df7a3a690434c88232778351fdef, type: 3}
      propertyPath: m_Layer
      value: 16
      objectReference: {fileID: 0}
    - target: {fileID: 4441848305933595309, guid: 3f34df7a3a690434c88232778351fdef, type: 3}
      propertyPath: m_Layer
      value: 16
      objectReference: {fileID: 0}
    - target: {fileID: 4549111882529890269, guid: 3f34df7a3a690434c88232778351fdef, type: 3}
      propertyPath: m_Layer
      value: 16
      objectReference: {fileID: 0}
    - target: {fileID: 4679591871348809919, guid: 3f34df7a3a690434c88232778351fdef, type: 3}
      propertyPath: m_Layer
      value: 16
      objectReference: {fileID: 0}
    - target: {fileID: 5120724536234783804, guid: 3f34df7a3a690434c88232778351fdef, type: 3}
      propertyPath: m_Layer
      value: 16
      objectReference: {fileID: 0}
    - target: {fileID: 5356709641661982207, guid: 3f34df7a3a690434c88232778351fdef, type: 3}
      propertyPath: m_Layer
      value: 16
      objectReference: {fileID: 0}
    - target: {fileID: 5866666021909216657, guid: 3f34df7a3a690434c88232778351fdef, type: 3}
      propertyPath: m_Controller
      value: 
      objectReference: {fileID: 9100000, guid: 7a0132ad957eba645be12082c73a7950, type: 2}
    - target: {fileID: 6090423597008602507, guid: 3f34df7a3a690434c88232778351fdef, type: 3}
      propertyPath: m_Layer
      value: 16
      objectReference: {fileID: 0}
    - target: {fileID: 6240733294840144465, guid: 3f34df7a3a690434c88232778351fdef, type: 3}
      propertyPath: m_Layer
      value: 16
      objectReference: {fileID: 0}
    - target: {fileID: 6514210125699187276, guid: 3f34df7a3a690434c88232778351fdef, type: 3}
      propertyPath: m_Layer
      value: 16
      objectReference: {fileID: 0}
    - target: {fileID: 7363479242261063072, guid: 3f34df7a3a690434c88232778351fdef, type: 3}
      propertyPath: m_Layer
      value: 16
      objectReference: {fileID: 0}
    - target: {fileID: 7542137907003004905, guid: 3f34df7a3a690434c88232778351fdef, type: 3}
      propertyPath: m_Layer
      value: 16
      objectReference: {fileID: 0}
    - target: {fileID: 7732535366517880319, guid: 3f34df7a3a690434c88232778351fdef, type: 3}
      propertyPath: m_Layer
      value: 16
      objectReference: {fileID: 0}
    - target: {fileID: 7776229726456038893, guid: 3f34df7a3a690434c88232778351fdef, type: 3}
      propertyPath: m_Layer
      value: 16
      objectReference: {fileID: 0}
    - target: {fileID: 7929695318553348869, guid: 3f34df7a3a690434c88232778351fdef, type: 3}
      propertyPath: m_Layer
      value: 16
      objectReference: {fileID: 0}
    - target: {fileID: 8817898888258712963, guid: 3f34df7a3a690434c88232778351fdef, type: 3}
      propertyPath: m_Layer
      value: 16
      objectReference: {fileID: 0}
    - target: {fileID: 8823674082079524542, guid: 3f34df7a3a690434c88232778351fdef, type: 3}
      propertyPath: m_Layer
      value: 16
      objectReference: {fileID: 0}
    - target: {fileID: 8953972740105248388, guid: 3f34df7a3a690434c88232778351fdef, type: 3}
      propertyPath: m_Layer
      value: 16
      objectReference: {fileID: 0}
    - target: {fileID: 9037727976738196030, guid: 3f34df7a3a690434c88232778351fdef, type: 3}
      propertyPath: m_Layer
      value: 16
      objectReference: {fileID: 0}
    m_RemovedComponents: []
  m_SourcePrefab: {fileID: 100100000, guid: 3f34df7a3a690434c88232778351fdef, type: 3}
