%YAML 1.1
%TAG !u! tag:unity3d.com,2011:
--- !u!114 &11400000
MonoBehaviour:
  m_ObjectHideFlags: 0
  m_CorrespondingSourceObject: {fileID: 0}
  m_PrefabInstance: {fileID: 0}
  m_PrefabAsset: {fileID: 0}
  m_GameObject: {fileID: 0}
  m_Enabled: 1
  m_EditorHideFlags: 0
  m_Script: {fileID: 11500000, guid: 987f16407c320a54c8e57762a28b12cf, type: 3}
  m_Name: HealthDropData
  m_EditorClassIdentifier: 
  dropChance: 12
  healValue: 15
  healthDropPrefab: {fileID: 5870277662204440953, guid: 71c7bb69aa0377d459b9165aac82e1b7, type: 3}
  dropCooldown: 0.2
  followStartRange: 15
  pickUpRange: 1.5
  maxSpeed: 150
  acceleration: 1000
