%YAML 1.1
%TAG !u! tag:unity3d.com,2011:
--- !u!114 &11400000
MonoBehaviour:
  m_ObjectHideFlags: 0
  m_CorrespondingSourceObject: {fileID: 0}
  m_PrefabInstance: {fileID: 0}
  m_PrefabAsset: {fileID: 0}
  m_GameObject: {fileID: 0}
  m_Enabled: 1
  m_EditorHideFlags: 0
  m_Script: {fileID: 11500000, guid: 58764fe07e18cfe459d04ba563c4bc40, type: 3}
  m_Name: EntranceEncounter01
  m_EditorClassIdentifier: 
  parts:
  - {fileID: 11400000, guid: bb9ab8e9fdf70374b8382be4772b30a2, type: 2}
  - {fileID: 11400000, guid: 28c92d261b649b24ab6b81af117c8c12, type: 2}
  - {fileID: 11400000, guid: f7554099cfe045e4dbdb9ef8fd9161ad, type: 2}
