%YAML 1.1
%TAG !u! tag:unity3d.com,2011:
--- !u!114 &11400000
MonoBehaviour:
  m_ObjectHideFlags: 0
  m_CorrespondingSourceObject: {fileID: 0}
  m_PrefabInstance: {fileID: 0}
  m_PrefabAsset: {fileID: 0}
  m_GameObject: {fileID: 0}
  m_Enabled: 1
  m_EditorHideFlags: 0
  m_Script: {fileID: 11500000, guid: bd4d6b34857b4cd45aa59c2a7b690600, type: 3}
  m_Name: BattleEnemyList(Don't touch!)
  m_EditorClassIdentifier: 
  itemList:
  - enemyName: Zahnstocher
    image: {fileID: 5387058964446725951, guid: 46db1a1e497112b4aa6f22ab8c46dc15, type: 3}
    rig: {fileID: 0}
    health: 60
    strenght: 5
    initiative: 12
    type: 0
    numberAttackStrengths: 05000000
    canHeal: 0
    xPosition: 0
    yPosition: 0
