%YAML 1.1
%TAG !u! tag:unity3d.com,2011:
--- !u!1 &5086163562075321153
GameObject:
  m_ObjectHideFlags: 0
  m_CorrespondingSourceObject: {fileID: 0}
  m_PrefabInstance: {fileID: 0}
  m_PrefabAsset: {fileID: 0}
  serializedVersion: 6
  m_Component:
  - component: {fileID: 5086163562075321155}
  - component: {fileID: 5086163562075321154}
  m_Layer: 0
  m_Name: SOHolder
  m_TagString: Untagged
  m_Icon: {fileID: 0}
  m_NavMeshLayer: 0
  m_StaticEditorFlags: 0
  m_IsActive: 1
--- !u!4 &5086163562075321155
Transform:
  m_ObjectHideFlags: 0
  m_CorrespondingSourceObject: {fileID: 0}
  m_PrefabInstance: {fileID: 0}
  m_PrefabAsset: {fileID: 0}
  m_GameObject: {fileID: 5086163562075321153}
  m_LocalRotation: {x: 0, y: 0, z: 0, w: 1}
  m_LocalPosition: {x: 0, y: 0, z: 0}
  m_LocalScale: {x: 1, y: 1, z: 1}
  m_Children: []
  m_Father: {fileID: 0}
  m_RootOrder: 0
  m_LocalEulerAnglesHint: {x: 0, y: 0, z: 0}
--- !u!114 &5086163562075321154
MonoBehaviour:
  m_ObjectHideFlags: 0
  m_CorrespondingSourceObject: {fileID: 0}
  m_PrefabInstance: {fileID: 0}
  m_PrefabAsset: {fileID: 0}
  m_GameObject: {fileID: 5086163562075321153}
  m_Enabled: 1
  m_EditorHideFlags: 0
  m_Script: {fileID: 11500000, guid: 178daa610f96a504eb417986d3678cdd, type: 3}
  m_Name: 
  m_EditorClassIdentifier: 
  holder:
  - {fileID: 11400000, guid: 607f207ac5237574e85e47bb5a8155b5, type: 2}
  - {fileID: 11400000, guid: aa8dc254c43114747a551448af14dcee, type: 2}
  - {fileID: 11400000, guid: c6816845c8c4d694d80bf46f6c243564, type: 2}
  - {fileID: 11400000, guid: 4cab74f2c3490e14bab2aeb853ce6ee2, type: 2}
