%YAML 1.1
%TAG !u! tag:unity3d.com,2011:
--- !u!114 &11400000
MonoBehaviour:
  m_ObjectHideFlags: 0
  m_CorrespondingSourceObject: {fileID: 0}
  m_PrefabInstance: {fileID: 0}
  m_PrefabAsset: {fileID: 0}
  m_GameObject: {fileID: 0}
  m_Enabled: 1
  m_EditorHideFlags: 0
  m_Script: {fileID: 11500000, guid: d7d7bbc8ec40a7b4498f3ba6f3d68a79, type: 3}
  m_Name: RutschCrime
  m_EditorClassIdentifier: 
  crimeColor: {r: 0.754717, g: 0.08187969, b: 0.14436592, a: 1}
  crimeName: Animal Liberation PETER
  crimeArticleDescription: Cats belong into the wild and are no pets. We plan to
    burn down the Cat Inc. building to free the tortured creatures from this prison
    cell! Support us at http://www.peter.org/donate/ways-to-support-peter/
  miniGameSceneName: LeRutsch
  moneyOnSuccess: 200
  fameOnSuccess: 2
  fameOnFailure: 10
  purchaseCost: 100
  crimeArticleOnSuccess: He is back. But what the fuck is wrong with the man we once
    used to know as a hero? He sabotaged an action of the "People for the ethical
    treatment of earthling races" and rescued the kittens from the burning building.
  crimeArticleOnFailure: A big protest action now comes to an end and it's been a
    huge success for the rights of poor kittens! The symbol of their surpression
    was torn down by the flames of justice!
  crimeHeadlineOnSuccess: Cape Man hates kittens
  crimeHeadlineOnFailure: Success for PETER
