%YAML 1.1
%TAG !u! tag:unity3d.com,2011:
--- !u!114 &11400000
MonoBehaviour:
  m_ObjectHideFlags: 0
  m_CorrespondingSourceObject: {fileID: 0}
  m_PrefabInstance: {fileID: 0}
  m_PrefabAsset: {fileID: 0}
  m_GameObject: {fileID: 0}
  m_Enabled: 1
  m_EditorHideFlags: 0
  m_Script: {fileID: 11500000, guid: 218baaf23140433ab8e038ff0f3e6fe9, type: 3}
  m_Name: Closet_Big_Door_Sound_Preset
  m_EditorClassIdentifier: 
  magnitude: {x: 0.5, y: 5}
  volume: {x: 0, y: 0.3}
  pitch: {x: 0.5372918, y: 1.0501344}
  clips:
  - {fileID: 8300000, guid: fed20da085f4ab649b22932df52334b7, type: 3}
