%YAML 1.1
%TAG !u! tag:unity3d.com,2011:
--- !u!162 &1
EditorUserSettings:
  m_ObjectHideFlags: 0
  serializedVersion: 4
  m_ConfigSettings:
    RecentlyUsedScenePath-0:
      value: 22424703114646642a0f01275f105c1518120b65082d2b3f12081031ebe53a2cacf238e0f323
      flags: 0
    RecentlyUsedScenePath-1:
      value: 22424703114646642a0f01275f105c1518120b65082d2b3f633c133af6f9
      flags: 0
    RecentlyUsedScenePath-2:
      value: 22424703114646642a0f01275f105c1518120b6502212d3f1e2a183de7ae2136ebf32f
      flags: 0
    RecentlyUsedScenePath-3:
      value: 22424703114646642a0f01275f105c1518120b65092622032e3b1836ecae2136ebf32f
      flags: 0
    RecentlyUsedScenePath-4:
      value: 22424703114646642a0f01275f105c1518120b650d2628356d1d1820f6ae2136ebf32f
      flags: 0
    RecentlyUsedScenePath-5:
      value: 22424703114646642a0f01275f105c1518120b6521292f3e002c1326acf53a31f6fe
      flags: 0
    RecentlyUsedScenePath-6:
      value: 22424703114646642a0f01275f105c1518120b650229301d283a1509edef7a2decee22f0
      flags: 0
    RecentlyUsedScenePath-7:
      value: 22424703114646642a0f01275f105c1518120b650b3a23292f260573eef63878b3a923e7ee2e26
      flags: 0
    RecentlyUsedScenePath-8:
      value: 22424703114646642a0f01275f105c1518120b65003e2a707f693a21e7f93637faa923e7ee2e26
      flags: 0
    RecentlyUsedScenePath-9:
      value: 22424703114646642a0f01275f105c1518120b6521292f3e1e2a183de7ae2136ebf32f
      flags: 0
    vcSharedLogLevel:
      value: 0d5e400f0650
      flags: 0
  m_VCAutomaticAdd: 1
  m_VCDebugCom: 0
  m_VCDebugCmd: 0
  m_VCDebugOut: 0
  m_SemanticMergeMode: 2
  m_VCShowFailedCheckout: 1
  m_VCOverwriteFailedCheckoutAssets: 1
  m_VCProjectOverlayIcons: 1
  m_VCHierarchyOverlayIcons: 1
  m_VCOtherOverlayIcons: 1
  m_VCAllowAsyncUpdate: 1
