%YAML 1.1
%TAG !u! tag:unity3d.com,2011:
--- !u!114 &11400000
MonoBehaviour:
  m_ObjectHideFlags: 0
  m_CorrespondingSourceObject: {fileID: 0}
  m_PrefabInstance: {fileID: 0}
  m_PrefabAsset: {fileID: 0}
  m_GameObject: {fileID: 0}
  m_Enabled: 1
  m_EditorHideFlags: 0
  m_Script: {fileID: 11500000, guid: 5577c27c988db89458e7fafe4a01f926, type: 3}
  m_Name: Zone08
  m_EditorClassIdentifier: 
  startingDistance: 1750
  minEnemyCount: 1
  maxEnemyCount: 2
  spawnedEnemies:
  - {fileID: 11400000, guid: 6ccb3462a7a659440a82179542651384, type: 2}
