%YAML 1.1
%TAG !u! tag:unity3d.com,2011:
--- !u!114 &11400000
MonoBehaviour:
  m_ObjectHideFlags: 0
  m_CorrespondingSourceObject: {fileID: 0}
  m_PrefabInstance: {fileID: 0}
  m_PrefabAsset: {fileID: 0}
  m_GameObject: {fileID: 0}
  m_Enabled: 1
  m_EditorHideFlags: 0
  m_Script: {fileID: 11500000, guid: f8a4b84b22e32cf4a8f90a46eddd2ab1, type: 3}
  m_Name: Dune_Ambient
  m_EditorClassIdentifier: 
  offset: -15
  amplitude: 32.3
  periode: 200
  roughness: 0
