%YAML 1.1
%TAG !u! tag:unity3d.com,2011:
--- !u!114 &11400000
MonoBehaviour:
  m_ObjectHideFlags: 0
  m_CorrespondingSourceObject: {fileID: 0}
  m_PrefabInstance: {fileID: 0}
  m_PrefabAsset: {fileID: 0}
  m_GameObject: {fileID: 0}
  m_Enabled: 1
  m_EditorHideFlags: 0
  m_Script: {fileID: 11500000, guid: 2f03e2cdaeab8024aa77640aa8db2f14, type: 3}
  m_Name: Rock_Spikes
  m_EditorClassIdentifier: 
  periode: 200
  roughness: 0
  value_map_0: 0.6
  value_map_1: 0.8
