%YAML 1.1
%TAG !u! tag:unity3d.com,2011:
--- !u!114 &11400000
MonoBehaviour:
  m_ObjectHideFlags: 0
  m_CorrespondingSourceObject: {fileID: 0}
  m_PrefabInstance: {fileID: 0}
  m_PrefabAsset: {fileID: 0}
  m_GameObject: {fileID: 0}
  m_Enabled: 1
  m_EditorHideFlags: 0
  m_Script: {fileID: 11500000, guid: da6f286778fed69499a1a5f6b2385bc1, type: 3}
  m_Name: HoleLand
  m_EditorClassIdentifier: 
  probFunctions:
  - name: Trees
    prefab: {fileID: 3083527586188203494, guid: 756df44a724bf8d4eb11f8d010be934d, type: 3}
    applyCondition: {fileID: 11400000, guid: 6c7c6fce14e445b40a96152000bc5ddd, type: 2}
    averageAmmountPerChunk: 10
  - name: Rocks
    prefab: {fileID: 3651740803076133146, guid: fcdfaf340178ab74ebac9d9b0abd632e, type: 3}
    applyCondition: {fileID: 11400000, guid: f48c8bcbe2709df43bbc2e75a97a41ce, type: 2}
    averageAmmountPerChunk: 15
  - name: Cubespots
    prefab: {fileID: 4253425105785468842, guid: da4e8a1389366a9439947b2d57526991, type: 3}
    applyCondition: {fileID: 11400000, guid: a7f8b7a011ad6d147996a1ff32b1750b, type: 2}
    averageAmmountPerChunk: 2
  - name: Ambient Cubes
    prefab: {fileID: 4253425105785468842, guid: 80aa3668f7646484c92f1722a3989df7, type: 3}
    applyCondition: {fileID: 11400000, guid: a7f8b7a011ad6d147996a1ff32b1750b, type: 2}
    averageAmmountPerChunk: 2
  - name: Cube_Particles
    prefab: {fileID: 7932638323912886263, guid: c965422b7314c864d9f567e5942d7fbe, type: 3}
    applyCondition: {fileID: 11400000, guid: a7f8b7a011ad6d147996a1ff32b1750b, type: 2}
    averageAmmountPerChunk: 10
  heightFunctions:
  - name: Base
    baseFunction: {fileID: 11400000, guid: 8018f89600cc87c4a9f9fee6b0bd1e02, type: 2}
    applyCondition: {fileID: 11400000, guid: a7f8b7a011ad6d147996a1ff32b1750b, type: 2}
    usedApplyType: 0
  - name: Hills
    baseFunction: {fileID: 11400000, guid: c114e1d1956d7fa4894392bf223a6b9b, type: 2}
    applyCondition: {fileID: 11400000, guid: a7f8b7a011ad6d147996a1ff32b1750b, type: 2}
    usedApplyType: 0
  - name: Holes
    baseFunction: {fileID: 11400000, guid: d4010c5ccaac1204eafed6f6a68db6a3, type: 2}
    applyCondition: {fileID: 11400000, guid: 854594bd3dfc6114784a9552d525cc19, type: 2}
    usedApplyType: 1
  materialFunctions:
  - name: Snow
    materialIndex: 5
    applyCondition: {fileID: 11400000, guid: 0b99042e668dd1f49971bf660dac0f49, type: 2}
  - name: Grassy
    materialIndex: 3
    applyCondition: {fileID: 11400000, guid: 6abbf53484b634c40a3a018038c52937, type: 2}
  - name: Grassy_Low
    materialIndex: 3
    applyCondition: {fileID: 11400000, guid: 0e85fad186118494b929eb297419f7cb, type: 2}
  - name: Hole
    materialIndex: 6
    applyCondition: {fileID: 11400000, guid: a7f8b7a011ad6d147996a1ff32b1750b, type: 2}
  biomMinRangeFromCenter: 800
  biomMaxRangeFromCenter: 2000
  transitionRange: 100
