%YAML 1.1
%TAG !u! tag:unity3d.com,2011:
--- !u!114 &11400000
MonoBehaviour:
  m_ObjectHideFlags: 0
  m_CorrespondingSourceObject: {fileID: 0}
  m_PrefabInstance: {fileID: 0}
  m_PrefabAsset: {fileID: 0}
  m_GameObject: {fileID: 0}
  m_Enabled: 1
  m_EditorHideFlags: 0
  m_Script: {fileID: 11500000, guid: 7345e1b1c91a4fd4bb25bf1f56215591, type: 3}
  m_Name: TeamPlayer
  m_EditorClassIdentifier: 
  teamLayer:
    serializedVersion: 2
    m_Bits: 8
  enemyLayer:
    serializedVersion: 2
    m_Bits: 1024
  team: 1
