%YAML 1.1
%TAG !u! tag:unity3d.com,2011:
--- !u!1 &51046115513023345
GameObject:
  m_ObjectHideFlags: 0
  m_CorrespondingSourceObject: {fileID: 0}
  m_PrefabInstance: {fileID: 0}
  m_PrefabAsset: {fileID: 0}
  serializedVersion: 6
  m_Component:
  - component: {fileID: 7241911698706493939}
  - component: {fileID: 3669049268712651585}
  m_Layer: 0
  m_Name: RockVariation
  m_TagString: Untagged
  m_Icon: {fileID: 0}
  m_NavMeshLayer: 0
  m_StaticEditorFlags: 0
  m_IsActive: 1
--- !u!4 &7241911698706493939
Transform:
  m_ObjectHideFlags: 0
  m_CorrespondingSourceObject: {fileID: 0}
  m_PrefabInstance: {fileID: 0}
  m_PrefabAsset: {fileID: 0}
  m_GameObject: {fileID: 51046115513023345}
  m_LocalRotation: {x: 0, y: 0, z: 0, w: 1}
  m_LocalPosition: {x: 0, y: 0, z: 0}
  m_LocalScale: {x: 1, y: 1, z: 1}
  m_Children: []
  m_Father: {fileID: 0}
  m_RootOrder: 0
  m_LocalEulerAnglesHint: {x: 0, y: 0, z: 0}
--- !u!114 &3669049268712651585
MonoBehaviour:
  m_ObjectHideFlags: 0
  m_CorrespondingSourceObject: {fileID: 0}
  m_PrefabInstance: {fileID: 0}
  m_PrefabAsset: {fileID: 0}
  m_GameObject: {fileID: 51046115513023345}
  m_Enabled: 1
  m_EditorHideFlags: 0
  m_Script: {fileID: 11500000, guid: d8456e05460488f428dfa460a743c4f6, type: 3}
  m_Name: 
  m_EditorClassIdentifier: 
  prefabs:
  - {fileID: 6512686509209157626, guid: 856d398f8ba3f8f438c2c6b8fe680c3b, type: 3}
  - {fileID: 1640758586131076576, guid: 0f8fd9306eb5aaf4681d4682014613ae, type: 3}
  - {fileID: 6757723729629155853, guid: 8bd4d94d3ad84af48bdd0e2ff1eda027, type: 3}
  - {fileID: 3059704391251287361, guid: 2dac4517ec32d6442af078e15b718203, type: 3}
  - {fileID: 5949685844089004359, guid: 05fd28ff5a8158340a32e3129d0fe342, type: 3}
  - {fileID: 3990638827467443467, guid: e66d0436221f9e443be9be855cf3d9b5, type: 3}
  - {fileID: 3391637455438022702, guid: 8337fdcc5d918704b8de4f2cb632ce48, type: 3}
  - {fileID: 8059373251462009890, guid: cd7f28c41d518ef47b402e34ad7cee22, type: 3}
  - {fileID: 6998606519845032917, guid: 7574235999d72c34b8121259c0b327fe, type: 3}
  - {fileID: 5109227140920069147, guid: 3d67f325a1c24534a902afb07f40274f, type: 3}
  - {fileID: 4785735022348201450, guid: 5f775956bee1e4041a3d9a1f95ee92bf, type: 3}
  - {fileID: 3871616917429310284, guid: 8a9f044d61403ac499b191c4be82e41d, type: 3}
  - {fileID: 7870538333993067689, guid: 7d71f2413a774a94e9b5052c19287a32, type: 3}
  - {fileID: 6331825477851501815, guid: 8f022213c12b3db4b8671e2fe436a6b1, type: 3}
  - {fileID: 1491743808621947790, guid: 4a4cf6679a85779489c1f2e174c8d128, type: 3}
