%YAML 1.1
%TAG !u! tag:unity3d.com,2011:
--- !u!1001 &1972570375186671324
PrefabInstance:
  m_ObjectHideFlags: 0
  serializedVersion: 2
  m_Modification:
    m_TransformParent: {fileID: 0}
    m_Modifications:
    - target: {fileID: 4411747156329656760, guid: deee692cce4cbe04ab2cc431daf76a03, type: 3}
      propertyPath: m_RootOrder
      value: 0
      objectReference: {fileID: 0}
    - target: {fileID: 4411747156329656760, guid: deee692cce4cbe04ab2cc431daf76a03, type: 3}
      propertyPath: m_LocalPosition.x
      value: 0
      objectReference: {fileID: 0}
    - target: {fileID: 4411747156329656760, guid: deee692cce4cbe04ab2cc431daf76a03, type: 3}
      propertyPath: m_LocalPosition.y
      value: 0
      objectReference: {fileID: 0}
    - target: {fileID: 4411747156329656760, guid: deee692cce4cbe04ab2cc431daf76a03, type: 3}
      propertyPath: m_LocalPosition.z
      value: 0
      objectReference: {fileID: 0}
    - target: {fileID: 4411747156329656760, guid: deee692cce4cbe04ab2cc431daf76a03, type: 3}
      propertyPath: m_LocalRotation.w
      value: 1
      objectReference: {fileID: 0}
    - target: {fileID: 4411747156329656760, guid: deee692cce4cbe04ab2cc431daf76a03, type: 3}
      propertyPath: m_LocalRotation.x
      value: 0
      objectReference: {fileID: 0}
    - target: {fileID: 4411747156329656760, guid: deee692cce4cbe04ab2cc431daf76a03, type: 3}
      propertyPath: m_LocalRotation.y
      value: 0
      objectReference: {fileID: 0}
    - target: {fileID: 4411747156329656760, guid: deee692cce4cbe04ab2cc431daf76a03, type: 3}
      propertyPath: m_LocalRotation.z
      value: 0
      objectReference: {fileID: 0}
    - target: {fileID: 4411747156329656760, guid: deee692cce4cbe04ab2cc431daf76a03, type: 3}
      propertyPath: m_LocalEulerAnglesHint.x
      value: 0
      objectReference: {fileID: 0}
    - target: {fileID: 4411747156329656760, guid: deee692cce4cbe04ab2cc431daf76a03, type: 3}
      propertyPath: m_LocalEulerAnglesHint.y
      value: 0
      objectReference: {fileID: 0}
    - target: {fileID: 4411747156329656760, guid: deee692cce4cbe04ab2cc431daf76a03, type: 3}
      propertyPath: m_LocalEulerAnglesHint.z
      value: 0
      objectReference: {fileID: 0}
    - target: {fileID: 4411747156329656764, guid: deee692cce4cbe04ab2cc431daf76a03, type: 3}
      propertyPath: damage
      value: 300
      objectReference: {fileID: 0}
    - target: {fileID: 4411747156329656764, guid: deee692cce4cbe04ab2cc431daf76a03, type: 3}
      propertyPath: seekingRadius
      value: 50
      objectReference: {fileID: 0}
    - target: {fileID: 4411747156329656766, guid: deee692cce4cbe04ab2cc431daf76a03, type: 3}
      propertyPath: m_Name
      value: 2Rocket
      objectReference: {fileID: 0}
    - target: {fileID: 4549430525724413840, guid: deee692cce4cbe04ab2cc431daf76a03, type: 3}
      propertyPath: m_Parameters.colorGradient.key0.b
      value: 0.27429688
      objectReference: {fileID: 0}
    - target: {fileID: 4549430525724413840, guid: deee692cce4cbe04ab2cc431daf76a03, type: 3}
      propertyPath: m_Parameters.colorGradient.key0.g
      value: 0.27429688
      objectReference: {fileID: 0}
    - target: {fileID: 4549430525724413840, guid: deee692cce4cbe04ab2cc431daf76a03, type: 3}
      propertyPath: m_Parameters.colorGradient.key0.r
      value: 0.8679245
      objectReference: {fileID: 0}
    m_RemovedComponents: []
  m_SourcePrefab: {fileID: 100100000, guid: deee692cce4cbe04ab2cc431daf76a03, type: 3}
