%YAML 1.1
%TAG !u! tag:unity3d.com,2011:
--- !u!114 &11400000
MonoBehaviour:
  m_ObjectHideFlags: 0
  m_CorrespondingSourceObject: {fileID: 0}
  m_PrefabInstance: {fileID: 0}
  m_PrefabAsset: {fileID: 0}
  m_GameObject: {fileID: 0}
  m_Enabled: 1
  m_EditorHideFlags: 0
  m_Script: {fileID: 11500000, guid: 21a1993c831acd74087dc6b5b9524705, type: 3}
  m_Name: 15
  m_EditorClassIdentifier: 
  modules:
  - {fileID: 8868934788433129152, guid: b8b69623b23221d489344996c3d220b4, type: 3}
  - {fileID: 8868934788433129152, guid: f3575d6c65e8e6f4ea97852faba37d7b, type: 3}
  - {fileID: 6006467617465552631, guid: b49eb52561cf8d34f9c2a0124e1fff58, type: 3}
  killReward: 80
