%YAML 1.1
%TAG !u! tag:unity3d.com,2011:
--- !u!114 &11400000
MonoBehaviour:
  m_ObjectHideFlags: 0
  m_CorrespondingSourceObject: {fileID: 0}
  m_PrefabInstance: {fileID: 0}
  m_PrefabAsset: {fileID: 0}
  m_GameObject: {fileID: 0}
  m_Enabled: 1
  m_EditorHideFlags: 0
  m_Script: {fileID: 11500000, guid: 88c167c0b5179834d9526cc62fb85c99, type: 3}
  m_Name: StreetBiom
  m_EditorClassIdentifier: 
  probFunctions:
  - name: Garage
    prefab: {fileID: 8914000980553216656, guid: 794a50cd80de5e84992301e69cad853e, type: 3}
    applyCondition: {fileID: 11400000, guid: 68b8de83e80f26b4089424375d59440e, type: 2}
    averageAmmountPerChunk: 0
  heightFunction: {fileID: 11400000, guid: e2dc52c5d073e564887271427132d797, type: 2}
  garageProbabilityPerSegment: 10
  doStripes: 1
  garagePositions:
  - {x: 250, y: 250}
  - {x: 203, y: 196}
  - {x: 250, y: 174}
  - {x: 144, y: 192}
  - {x: 224, y: 124}
  - {x: 168, y: 133}
  - {x: 113, y: 116}
  - {x: 191, y: 85}
  - {x: 69, y: 84}
  - {x: 164, y: 42}
  - {x: 37, y: 33}
  - {x: 106, y: 33}
  spawnedGarages: []
  lightPillarPrefab: {fileID: 4186670868985958196, guid: 9e26e6bbfbd95904680ea2cdc37a044f, type: 3}
  garagePrefab: {fileID: 0}
  streetWidth: 10
