%YAML 1.1
%TAG !u! tag:unity3d.com,2011:
--- !u!114 &11400000
MonoBehaviour:
  m_ObjectHideFlags: 0
  m_CorrespondingSourceObject: {fileID: 0}
  m_PrefabInstance: {fileID: 0}
  m_PrefabAsset: {fileID: 0}
  m_GameObject: {fileID: 0}
  m_Enabled: 1
  m_EditorHideFlags: 0
  m_Script: {fileID: 11500000, guid: 21a1993c831acd74087dc6b5b9524705, type: 3}
  m_Name: 17
  m_EditorClassIdentifier: 
  modules:
  - {fileID: 8868934788433129152, guid: 734cfe1125a4a2e4e98824a8ef324271, type: 3}
  - {fileID: 8868934788433129152, guid: 3f582e3ffea57454198dfb80a85dc727, type: 3}
  - {fileID: 8868934788433129152, guid: 25975b432e5a07445a38d4936322d459, type: 3}
  - {fileID: 6006467617465552631, guid: b49eb52561cf8d34f9c2a0124e1fff58, type: 3}
  - {fileID: 2883809558497311936, guid: 7ee5070134dbad8458dd73c702a0f1b3, type: 3}
  killReward: 0
