%YAML 1.1
%TAG !u! tag:unity3d.com,2011:
--- !u!114 &11400000
MonoBehaviour:
  m_ObjectHideFlags: 0
  m_CorrespondingSourceObject: {fileID: 0}
  m_PrefabInstance: {fileID: 0}
  m_PrefabAsset: {fileID: 0}
  m_GameObject: {fileID: 0}
  m_Enabled: 1
  m_EditorHideFlags: 0
  m_Script: {fileID: 11500000, guid: 5577c27c988db89458e7fafe4a01f926, type: 3}
  m_Name: Zone09
  m_EditorClassIdentifier: 
  startingDistance: 2000
  minEnemyCount: 1
  maxEnemyCount: 3
  spawnedEnemies:
  - {fileID: 11400000, guid: 65d36cfc8aafcae49b922c26302a40b1, type: 2}
  - {fileID: 11400000, guid: ccf78be1407043a4fb7883d9623d07c6, type: 2}
  - {fileID: 11400000, guid: 8104180c150c097458c31ebc4c030576, type: 2}
