%YAML 1.1
%TAG !u! tag:unity3d.com,2011:
--- !u!114 &11400000
MonoBehaviour:
  m_ObjectHideFlags: 0
  m_CorrespondingSourceObject: {fileID: 0}
  m_PrefabInstance: {fileID: 0}
  m_PrefabAsset: {fileID: 0}
  m_GameObject: {fileID: 0}
  m_Enabled: 1
  m_EditorHideFlags: 0
  m_Script: {fileID: 11500000, guid: 21a1993c831acd74087dc6b5b9524705, type: 3}
  m_Name: 08
  m_EditorClassIdentifier: 
  modules:
  - {fileID: 2883809558497311936, guid: 1f7b10ae8ec54e3499d8ae60cb362fc1, type: 3}
  killReward: 40
