%YAML 1.1
%TAG !u! tag:unity3d.com,2011:
--- !u!114 &11400000
MonoBehaviour:
  m_ObjectHideFlags: 0
  m_CorrespondingSourceObject: {fileID: 0}
  m_PrefabInstance: {fileID: 0}
  m_PrefabAsset: {fileID: 0}
  m_GameObject: {fileID: 0}
  m_Enabled: 1
  m_EditorHideFlags: 0
  m_Script: {fileID: 11500000, guid: da6f286778fed69499a1a5f6b2385bc1, type: 3}
  m_Name: Rockland
  m_EditorClassIdentifier: 
  probFunctions:
  - name: Cubespots
    prefab: {fileID: 4253425105785468842, guid: da4e8a1389366a9439947b2d57526991, type: 3}
    applyCondition: {fileID: 11400000, guid: a7f8b7a011ad6d147996a1ff32b1750b, type: 2}
    averageAmmountPerChunk: 2
  - name: Ambient Cubes
    prefab: {fileID: 4253425105785468842, guid: 80aa3668f7646484c92f1722a3989df7, type: 3}
    applyCondition: {fileID: 11400000, guid: a7f8b7a011ad6d147996a1ff32b1750b, type: 2}
    averageAmmountPerChunk: 2
  - name: Stones
    prefab: {fileID: 3651740803076133146, guid: 1698f20e6752e134ba16085f7a6a0802, type: 3}
    applyCondition: {fileID: 11400000, guid: 751a86db0effee34daa22c82567bb1a9, type: 2}
    averageAmmountPerChunk: 30
  - name: Cube_Particles
    prefab: {fileID: 7932638323912886263, guid: c965422b7314c864d9f567e5942d7fbe, type: 3}
    applyCondition: {fileID: 11400000, guid: a7f8b7a011ad6d147996a1ff32b1750b, type: 2}
    averageAmmountPerChunk: 10
  heightFunctions:
  - name: Base
    baseFunction: {fileID: 11400000, guid: b905fb5de77170b44a0d4ea062494c92, type: 2}
    applyCondition: {fileID: 11400000, guid: a7f8b7a011ad6d147996a1ff32b1750b, type: 2}
    usedApplyType: 0
  - name: Spikes
    baseFunction: {fileID: 11400000, guid: 904c9d6e02f5acb45a2016fb56e9540b, type: 2}
    applyCondition: {fileID: 11400000, guid: 3ff5267bb4445b94c9b6c47e5b09f48c, type: 2}
    usedApplyType: 0
  materialFunctions:
  - name: Snow
    materialIndex: 9
    applyCondition: {fileID: 11400000, guid: efee997ff1e644f458e371019c434d8a, type: 2}
  - name: Stone
    materialIndex: 10
    applyCondition: {fileID: 11400000, guid: a7f8b7a011ad6d147996a1ff32b1750b, type: 2}
  biomMinRangeFromCenter: 2050
  biomMaxRangeFromCenter: 2450
  transitionRange: 100
