%YAML 1.1
%TAG !u! tag:unity3d.com,2011:
--- !u!1 &4253425105785468842
GameObject:
  m_ObjectHideFlags: 0
  m_CorrespondingSourceObject: {fileID: 0}
  m_PrefabInstance: {fileID: 0}
  m_PrefabAsset: {fileID: 0}
  serializedVersion: 6
  m_Component:
  - component: {fileID: 4253425105785468840}
  - component: {fileID: 4253425105785468841}
  m_Layer: 0
  m_Name: CubeField_Gras
  m_TagString: Untagged
  m_Icon: {fileID: 0}
  m_NavMeshLayer: 0
  m_StaticEditorFlags: 0
  m_IsActive: 1
--- !u!4 &4253425105785468840
Transform:
  m_ObjectHideFlags: 0
  m_CorrespondingSourceObject: {fileID: 0}
  m_PrefabInstance: {fileID: 0}
  m_PrefabAsset: {fileID: 0}
  m_GameObject: {fileID: 4253425105785468842}
  m_LocalRotation: {x: 0, y: 0, z: 0, w: 1}
  m_LocalPosition: {x: 20.666424, y: 0, z: 1.0217957}
  m_LocalScale: {x: 1, y: 1, z: 1}
  m_Children: []
  m_Father: {fileID: 0}
  m_RootOrder: 0
  m_LocalEulerAnglesHint: {x: 0, y: 0, z: 0}
--- !u!114 &4253425105785468841
MonoBehaviour:
  m_ObjectHideFlags: 0
  m_CorrespondingSourceObject: {fileID: 0}
  m_PrefabInstance: {fileID: 0}
  m_PrefabAsset: {fileID: 0}
  m_GameObject: {fileID: 4253425105785468842}
  m_Enabled: 1
  m_EditorHideFlags: 0
  m_Script: {fileID: 11500000, guid: 24be910db3d5abf43825c76a8e0322fe, type: 3}
  m_Name: 
  m_EditorClassIdentifier: 
  radius: 8
  minSize: 0.3
  maxSize: 0.6
  cubeCount: 15
  prefab: {fileID: 1642219704549183078, guid: 3265b43c93e771b4f9958d8e18fb913e, type: 3}
