# Blender v2.80 (sub 75) OBJ File: ''
# www.blender.org
mtllib EnvironmentStone3_LP.mtl
o P_Stein3_LP
v 2.781500 4.820089 11.812413
v 3.583082 3.970117 11.817554
v 4.134530 4.073610 11.085492
v 3.829410 4.925598 10.307717
v 4.417520 4.363415 7.673300
v 3.758662 4.983042 7.552817
v 4.607965 4.475293 2.809055
v 4.060651 5.085980 2.850296
v 4.676594 4.466801 -2.522481
v 4.136768 5.229935 -2.367015
v 4.506374 4.784553 -8.158577
v 4.031933 5.362823 -8.117334
v 4.252216 4.866925 -12.192071
v 3.790179 5.482862 -11.948982
v 2.787426 4.905930 -13.267699
v 2.683819 5.470677 -12.752461
v 4.307095 4.269202 -12.668750
v 3.186090 4.152742 -13.298882
v -0.096901 4.891514 -13.261217
v 0.057894 5.429774 -12.952297
v -3.610462 5.004503 -13.121286
v -3.098578 5.423179 -12.657573
v -4.354820 4.781309 -11.274814
v -3.684340 5.593400 -11.058548
v -3.995493 4.114297 -13.096363
v -4.446019 3.903173 -12.299812
v -3.721333 1.892628 -13.155488
v -4.356495 1.719390 -12.504790
v -3.738770 -0.786385 -13.056241
v -4.260044 -0.778114 -12.485008
v -3.660312 -2.581779 -13.031428
v -4.146154 -2.522097 -12.293107
v -3.019560 -3.940175 -12.942241
v -3.877807 -3.902623 -11.771053
v -2.911707 -4.709342 -12.486127
v -3.412302 -4.697047 -11.618717
v -0.413530 -4.283071 -13.016564
v -0.426161 -4.830608 -12.412139
v 2.786530 -4.392267 -13.005836
v 2.356569 -4.870286 -12.425662
v 4.494750 -4.011706 -12.486686
v 4.314363 -4.881014 -11.050056
v 4.761871 -4.067588 -8.089284
v 4.299161 -4.872075 -8.286550
v 4.958239 -4.201037 -3.586711
v 4.668653 -4.909851 -3.608728
v 4.989756 -4.407245 2.129856
v 4.437192 -5.102089 2.196580
v 4.969084 -4.611328 7.811887
v 4.646190 -5.197203 7.781934
v 4.661726 -4.417752 10.426746
v 4.378516 -5.119192 10.273851
v -0.140935 3.975483 -13.266135
v -0.098464 1.893188 -13.227576
v 0.167649 -0.893009 -13.147106
v 0.382460 -2.803298 -13.085857
v 2.712988 -2.644370 -13.108323
v 2.434581 -0.649806 -13.174265
v 2.812237 1.923139 -13.256413
v 4.472506 2.190594 -12.628738
v 4.443341 -0.588335 -12.722733
v 4.552200 -2.558980 -12.700603
v 2.557636 -3.750067 11.767705
v 2.746629 -4.879119 11.249002
v 4.634679 -3.251817 11.221173
v 3.611691 -3.114122 11.775193
v 4.568741 -0.864064 11.219944
v 3.858695 -0.912012 11.780559
v 4.833511 -2.799389 -7.995289
v 4.878998 -0.798790 -7.845635
v 4.788692 1.878098 -7.837028
v 4.992440 1.570855 -2.619270
v 5.076485 -0.998515 -3.317915
v 5.029879 -3.028730 -3.652316
v 5.120299 -3.419018 2.046144
v 4.998695 -3.170340 7.707722
v 4.918448 -0.679317 7.688611
v 5.102978 -0.814886 2.252016
v 4.958352 1.504354 2.504494
v 4.769918 1.448804 7.431998
v 4.413943 1.396945 11.191779
v 3.883283 1.238463 11.812412
v -3.736645 -4.632449 -7.589358
v -4.065458 -3.920617 -7.544316
v -4.314027 4.673232 9.760851
v -4.467703 2.922987 11.028155
v -3.775316 2.983898 11.880702
v -2.796702 4.755711 11.737754
v -4.492178 4.847139 -7.754098
v -3.769954 5.388531 -7.776563
v -0.512220 5.479510 -7.909004
v -0.252703 5.673533 -10.972154
v 2.551824 5.595412 -11.153996
v 2.347405 5.470118 -8.140024
v 2.129014 5.198751 -1.978296
v 1.924039 5.063177 2.805031
v 1.785113 5.007971 7.774336
v 1.637472 5.072229 10.253400
v 1.613776 4.865469 11.857678
v 1.700395 3.796545 11.908866
v 1.715821 0.879026 11.830853
v 1.915542 -1.048478 11.805930
v -0.450972 -3.644672 11.752953
v -0.418336 -4.784453 11.158026
v -0.544073 -1.335378 11.855777
v -0.621193 0.595030 11.861477
v -0.591461 3.516573 11.915013
v -0.713507 5.022832 11.863936
v -0.654161 5.141418 10.249600
v -0.625996 4.976447 7.447199
v -0.943633 4.910511 2.620842
v -0.781797 5.041161 -2.167515
v -3.608563 4.862454 -2.288668
v -3.548545 4.736267 2.655936
v -3.409061 4.961812 7.397464
v -3.244433 5.148906 10.123976
v -2.419715 4.927943 11.904060
v -2.305270 3.541271 11.941949
v -2.298452 0.418105 11.902718
v -2.150698 -1.428815 11.903389
v -2.131809 -3.573255 11.771058
v -2.146788 -4.802783 11.138243
v -3.922510 -3.428742 11.633475
v -3.752630 -4.684870 10.891912
v -4.056071 -1.542591 11.639846
v -4.129947 0.116452 11.658734
v -4.508719 4.666524 7.162533
v -4.371471 4.611985 2.604972
v -4.530739 4.352465 -2.257933
v -4.189742 -2.472811 -7.257974
v -4.248419 -0.946433 -7.269261
v -4.384771 1.476303 -7.258755
v -4.521349 3.864611 -7.610928
v -4.588633 3.269798 -2.144715
v -4.527495 2.996084 2.935461
v -4.548842 3.057554 7.461840
v -4.357055 0.019104 11.139920
v -4.247077 -1.764446 11.117904
v -4.160011 -3.383812 11.123267
v -3.826951 -4.711471 10.443511
v -4.079877 -3.756212 8.183283
v -3.888869 -4.745558 8.223071
v -4.054396 -4.108606 3.362962
v -3.768611 -4.994682 3.338150
v -4.173647 -4.038308 -1.443948
v -3.810857 -4.892864 -1.530231
v -4.228077 -2.502763 -1.406953
v -4.298042 -1.040318 -1.424053
v -4.450939 1.305635 -1.678766
v -4.406791 1.381298 3.153962
v -4.215896 -0.979294 3.404427
v -4.116313 -2.561554 3.422086
v -4.420424 1.402422 7.498946
v -4.231208 -0.974152 7.672852
v -4.142241 -2.359148 7.868776
v -2.025744 -4.958361 10.477599
v -0.289918 -5.025531 10.400034
v 2.708294 -5.161327 10.386511
v 2.672754 -5.182224 7.646028
v -0.183294 -5.090356 7.584109
v -2.062963 -5.039054 7.617751
v -1.679831 -5.182896 3.716810
v 0.169324 -5.203011 3.725416
v 2.467440 -5.227043 3.826340
v -1.353030 -5.073030 -1.834009
v 0.781241 -5.048888 -2.357405
v 2.982791 -5.044641 -2.449611
v 2.734002 -4.970428 -7.542529
v 0.244988 -4.888056 -8.228320
v -1.811826 -4.840778 -8.234020
v -1.126927 -4.848492 -11.296386
v 0.842152 -4.902808 -11.194345
vt 0.019414 0.956271
vt 0.043012 0.970737
vt 0.039382 0.992330
vt 0.011594 0.999907
vt 0.639780 0.780349
vt 0.642886 0.697316
vt 0.664503 0.694451
vt 0.661679 0.761091
vt 0.640171 0.582671
vt 0.659297 0.583084
vt 0.634289 0.459707
vt 0.655978 0.462248
vt 0.634957 0.330379
vt 0.652319 0.330498
vt 0.636516 0.238378
vt 0.653659 0.245673
vt 0.668449 0.208803
vt 0.675486 0.225966
vt 0.046565 0.000093
vt 0.064131 0.006664
vt 0.062630 0.037766
vt 0.043110 0.044212
vt 0.736273 0.199286
vt 0.733804 0.214130
vt 0.818584 0.201351
vt 0.806330 0.215894
vt 0.844645 0.241637
vt 0.821356 0.251287
vt 0.022238 0.197583
vt 0.042962 0.205719
vt 0.044819 0.226064
vt 0.020844 0.244937
vt 0.092442 0.206799
vt 0.093714 0.227675
vt 0.152064 0.216753
vt 0.149359 0.233996
vt 0.191875 0.222089
vt 0.187844 0.241249
vt 0.225908 0.217771
vt 0.220530 0.252925
vt 0.243011 0.225020
vt 0.251682 0.243589
vt 0.240918 0.261485
vt 0.305464 0.221750
vt 0.305894 0.241822
vt 0.382882 0.227499
vt 0.370352 0.244120
vt 0.426813 0.241500
vt 0.410144 0.277818
vt 0.434034 0.341404
vt 0.412436 0.337582
vt 0.436077 0.443375
vt 0.418839 0.443312
vt 0.434117 0.573095
vt 0.413725 0.574883
vt 0.431424 0.702665
vt 0.416163 0.702006
vt 0.432323 0.764784
vt 0.413959 0.760868
vt 0.033274 0.113600
vt 0.054922 0.117344
vt 0.104421 0.123495
vt 0.170847 0.128410
vt 0.217081 0.132052
vt 0.247829 0.158284
vt 0.223887 0.075914
vt 0.266256 0.082342
vt 0.174806 0.073623
vt 0.114512 0.054392
vt 0.115135 0.010465
vt 0.182436 0.023737
vt 0.230652 0.030208
vt 0.266054 0.037438
vt 0.254728 0.977816
vt 0.221800 0.924323
vt 0.252150 0.925150
vt 0.271320 0.968427
vt 0.219649 0.977485
vt 0.209909 0.951132
vt 0.161488 0.987316
vt 0.159086 0.964978
vt 0.460365 0.233702
vt 0.462774 0.341953
vt 0.506845 0.229773
vt 0.508451 0.343075
vt 0.573140 0.229168
vt 0.569437 0.340483
vt 0.622498 0.227516
vt 0.567674 0.460330
vt 0.508676 0.446740
vt 0.462503 0.440914
vt 0.456899 0.570716
vt 0.464516 0.700956
vt 0.460025 0.784863
vt 0.522598 0.700543
vt 0.518480 0.785830
vt 0.516788 0.573974
vt 0.570609 0.578182
vt 0.572838 0.693646
vt 0.573961 0.784681
vt 0.107386 0.971705
vt 0.105212 0.992181
vt 0.229474 0.350641
vt 0.211388 0.350447
vt 0.007372 0.755002
vt 0.052314 0.774975
vt 0.053773 0.798392
vt 0.011150 0.816461
vt 0.854286 0.324684
vt 0.832594 0.325439
vt 0.756553 0.328831
vt 0.744934 0.259109
vt 0.682104 0.260692
vt 0.690735 0.327956
vt 0.702806 0.469892
vt 0.709351 0.581986
vt 0.711799 0.700309
vt 0.715018 0.760108
vt 0.715288 0.799351
vt 0.686830 0.798128
vt 0.014352 0.927138
vt 0.040897 0.926101
vt 0.110127 0.919360
vt 0.156122 0.918393
vt 0.208540 0.854100
vt 0.238958 0.848772
vt 0.154931 0.860784
vt 0.110589 0.864470
vt 0.042594 0.870373
vt 0.005392 0.869473
vt 0.770243 0.760128
vt 0.772008 0.799154
vt 0.769729 0.692656
vt 0.777517 0.577082
vt 0.771062 0.463133
vt 0.838756 0.457374
vt 0.840267 0.577185
vt 0.836816 0.691793
vt 0.831290 0.756388
vt 0.813523 0.799708
vt 0.006756 0.826620
vt 0.040411 0.830088
vt 0.110639 0.826384
vt 0.151696 0.824604
vt 0.199042 0.816662
vt 0.229924 0.807336
vt 0.186562 0.781560
vt 0.216688 0.769595
vt 0.148530 0.782926
vt 0.113093 0.785306
vt 0.859327 0.748833
vt 0.823822 0.796374
vt 0.864256 0.686068
vt 0.860337 0.575677
vt 0.864256 0.457536
vt 0.177869 0.354540
vt 0.142804 0.351786
vt 0.086605 0.347674
vt 0.031047 0.334368
vt 0.008075 0.328507
vt 0.035885 0.465557
vt 0.009986 0.461503
vt 0.039302 0.587413
vt 0.000093 0.579337
vt 0.040461 0.695245
vt 0.001256 0.690695
vt 0.114233 0.772878
vt 0.152529 0.770734
vt 0.185688 0.770289
vt 0.217152 0.759016
vt 0.196324 0.707402
vt 0.219215 0.708768
vt 0.204823 0.598387
vt 0.225948 0.598186
vt 0.205618 0.489307
vt 0.226788 0.488219
vt 0.170563 0.488710
vt 0.136858 0.486950
vt 0.082140 0.478740
vt 0.077789 0.592602
vt 0.133135 0.598596
vt 0.169567 0.599312
vt 0.079425 0.693744
vt 0.133825 0.695935
vt 0.164986 0.700004
vt 0.259270 0.763839
vt 0.254796 0.779724
vt 0.300828 0.764053
vt 0.296852 0.783231
vt 0.373299 0.764125
vt 0.374299 0.786269
vt 0.371508 0.699690
vt 0.305354 0.697581
vt 0.261939 0.696879
vt 0.273319 0.607846
vt 0.315406 0.608889
vt 0.367859 0.612035
vt 0.282542 0.482114
vt 0.330972 0.470796
vt 0.380787 0.469133
vt 0.376797 0.354597
vt 0.320378 0.337943
vt 0.273947 0.337045
vt 0.290131 0.268222
vt 0.334827 0.270780
vn 0.2681 0.8209 0.5043
vn 0.2994 0.0891 0.9500
vn 0.9412 0.2550 0.2215
vn 0.3409 0.9307 0.1324
vn 0.9639 0.2592 0.0614
vn 0.2525 0.9674 0.0203
vn 0.9707 0.2388 0.0270
vn 0.2137 0.9765 0.0287
vn 0.9735 0.2285 -0.0026
vn 0.2924 0.9560 0.0239
vn 0.9783 0.2039 -0.0358
vn 0.3329 0.9428 0.0182
vn 0.7891 0.5483 -0.2770
vn 0.3885 0.9168 -0.0927
vn 0.1952 0.4155 -0.8884
vn 0.0616 0.9429 -0.3273
vn 0.9519 0.1088 -0.2864
vn 0.1440 0.0152 -0.9895
vn -0.0137 0.2495 -0.9683
vn -0.0030 0.9439 -0.3303
vn -0.3722 0.5042 -0.7792
vn -0.1187 0.9495 -0.2904
vn -0.8670 0.4812 -0.1294
vn -0.1953 0.9804 -0.0273
vn -0.2168 0.0169 -0.9761
vn -0.9952 0.0286 -0.0934
vn -0.1653 -0.0106 -0.9862
vn -0.9937 -0.0392 -0.1048
vn -0.1541 -0.0339 -0.9875
vn -0.9936 -0.0562 -0.0981
vn -0.1904 -0.0814 -0.9783
vn -0.9849 -0.1404 -0.1016
vn -0.3166 -0.3377 -0.8864
vn -0.9315 -0.3245 -0.1645
vn -0.1887 -0.8459 -0.4988
vn -0.3364 -0.9399 -0.0580
vn -0.0294 -0.3320 -0.9428
vn -0.0261 -0.9332 -0.3583
vn 0.1314 -0.3470 -0.9286
vn 0.0338 -0.9843 -0.1733
vn 0.8671 -0.3531 -0.3513
vn 0.1883 -0.9801 -0.0635
vn 0.9758 -0.2126 -0.0512
vn 0.4176 -0.9080 -0.0335
vn 0.9741 -0.2238 -0.0339
vn 0.3640 -0.9309 -0.0308
vn 0.9409 -0.3386 -0.0048
vn 0.2952 -0.9552 -0.0201
vn 0.9811 -0.1896 0.0390
vn 0.2827 -0.9592 0.0076
vn 0.7954 -0.3300 0.5084
vn 0.3358 -0.9014 0.2733
vn -0.0231 -0.0124 -0.9997
vn -0.0160 -0.0201 -0.9997
vn -0.0170 -0.0330 -0.9993
vn -0.0136 -0.0337 -0.9993
vn 0.0911 -0.0449 -0.9948
vn 0.1134 -0.0357 -0.9929
vn 0.1445 -0.0354 -0.9889
vn 0.9304 0.0343 -0.3651
vn 0.9156 0.0000 -0.4021
vn 0.9216 -0.0114 -0.3879
vn 0.1079 -0.2217 0.9691
vn 0.0767 -0.6826 0.7267
vn 0.9536 -0.0399 0.2985
vn 0.2588 -0.1467 0.9547
vn 0.9690 0.0452 0.2428
vn 0.1995 -0.0162 0.9798
vn 0.9984 -0.0209 -0.0534
vn 0.9980 0.0063 -0.0626
vn 0.9968 0.0634 -0.0489
vn 0.9969 0.0773 -0.0134
vn 0.9997 0.0146 -0.0203
vn 0.9987 -0.0414 -0.0288
vn 0.9995 -0.0295 0.0062
vn 0.9988 0.0073 0.0493
vn 0.9971 0.0505 0.0564
vn 0.9994 0.0316 0.0121
vn 0.9956 0.0912 0.0215
vn 0.9934 0.0965 0.0616
vn 0.9759 0.0876 0.2000
vn 0.2371 0.0090 0.9714
vn -0.3805 -0.9244 -0.0262
vn -0.9796 -0.1995 -0.0257
vn -0.8076 0.5364 0.2451
vn -0.9830 0.0680 0.1707
vn -0.4568 0.1217 0.8812
vn -0.6310 0.4503 0.6317
vn -0.8734 0.4868 0.0137
vn -0.1827 0.9799 0.0808
vn -0.0196 0.9972 0.0723
vn -0.0033 1.0000 -0.0027
vn 0.0397 0.9991 0.0131
vn 0.0222 0.9985 0.0491
vn -0.0269 0.9991 0.0337
vn -0.0333 0.9993 0.0157
vn -0.0050 1.0000 -0.0031
vn 0.0392 0.9987 0.0320
vn 0.0443 0.7314 0.6805
vn 0.0179 -0.0056 0.9998
vn 0.0118 -0.0161 0.9998
vn 0.0169 -0.0162 0.9997
vn -0.0064 -0.1901 0.9817
vn -0.0284 -0.6936 0.7198
vn 0.0198 -0.0281 0.9994
vn 0.0188 -0.0130 0.9997
vn 0.0109 0.0003 0.9999
vn 0.0240 0.7466 0.6648
vn 0.0167 0.9999 0.0008
vn -0.0143 0.9995 -0.0264
vn -0.0553 0.9985 0.0038
vn -0.0548 0.9974 0.0479
vn -0.1871 0.9807 0.0567
vn -0.1016 0.9948 -0.0076
vn -0.0634 0.9972 -0.0407
vn -0.1258 0.9914 0.0351
vn -0.1818 0.7389 0.6489
vn -0.0099 -0.0109 0.9999
vn -0.0405 -0.0109 0.9991
vn -0.0596 -0.0290 0.9978
vn -0.0558 -0.2239 0.9730
vn -0.0696 -0.6742 0.7353
vn -0.3248 -0.2545 0.9109
vn -0.3340 -0.6403 0.6917
vn -0.3270 -0.0232 0.9448
vn -0.3597 -0.0148 0.9329
vn -0.8664 0.4993 -0.0052
vn -0.8489 0.5285 -0.0040
vn -0.8411 0.5404 0.0235
vn -0.9972 -0.0737 -0.0078
vn -0.9986 -0.0535 -0.0056
vn -0.9983 -0.0567 -0.0111
vn -0.9994 -0.0293 -0.0161
vn -0.9999 -0.0167 -0.0015
vn -1.0000 0.0024 0.0060
vn -0.9999 -0.0173 0.0005
vn -0.9979 -0.0503 0.0410
vn -0.9977 -0.0567 0.0371
vn -0.9896 -0.1345 0.0515
vn -0.6018 -0.7970 0.0519
vn -0.9929 -0.1189 -0.0012
vn -0.5055 -0.8621 0.0353
vn -0.9883 -0.1524 0.0112
vn -0.4224 -0.9064 0.0053
vn -0.9850 -0.1726 -0.0009
vn -0.3662 -0.9300 -0.0316
vn -0.9987 -0.0499 0.0065
vn -0.9982 -0.0593 0.0027
vn -0.9978 -0.0667 -0.0027
vn -0.9971 -0.0754 0.0038
vn -0.9974 -0.0714 0.0065
vn -0.9987 -0.0509 0.0097
vn -0.9974 -0.0723 -0.0046
vn -0.9972 -0.0737 -0.0080
vn -0.9984 -0.0549 -0.0112
vn -0.0795 -0.9944 0.0692
vn -0.0368 -0.9954 0.0880
vn -0.0238 -0.9966 0.0793
vn -0.0148 -0.9998 0.0143
vn -0.0280 -0.9993 0.0238
vn -0.0854 -0.9958 0.0322
vn -0.0533 -0.9986 -0.0013
vn -0.0102 -0.9999 -0.0057
vn 0.0169 -0.9998 -0.0138
vn -0.0424 -0.9986 -0.0304
vn -0.0029 -0.9996 -0.0278
vn 0.0240 -0.9994 -0.0244
vn 0.0058 -0.9997 -0.0247
vn -0.0126 -0.9998 -0.0141
vn -0.0634 -0.9978 -0.0216
vn -0.0523 -0.9985 -0.0167
vn -0.0111 -0.9999 -0.0103
usemtl Default.002
s 1
f 1/1/1 2/2/2 3/3/3 4/4/4
f 3/5/3 5/6/5 6/7/6 4/8/4
f 5/6/5 7/9/7 8/10/8 6/7/6
f 7/9/7 9/11/9 10/12/10 8/10/8
f 9/11/9 11/13/11 12/14/12 10/12/10
f 11/13/11 13/15/13 14/16/14 12/14/12
f 13/15/13 15/17/15 16/18/16 14/16/14
f 13/19/13 17/20/17 18/21/18 15/22/15
f 15/17/15 19/23/19 20/24/20 16/18/16
f 19/23/19 21/25/21 22/26/22 20/24/20
f 21/25/21 23/27/23 24/28/24 22/26/22
f 21/29/21 25/30/25 26/31/26 23/32/23
f 25/30/25 27/33/27 28/34/28 26/31/26
f 27/33/27 29/35/29 30/36/30 28/34/28
f 29/35/29 31/37/31 32/38/32 30/36/30
f 31/37/31 33/39/33 34/40/34 32/38/32
f 33/41/33 35/42/35 36/43/36 34/40/34
f 33/41/33 37/44/37 38/45/38 35/42/35
f 37/44/37 39/46/39 40/47/40 38/45/38
f 39/46/39 41/48/41 42/49/42 40/47/40
f 41/48/41 43/50/43 44/51/44 42/49/42
f 43/50/43 45/52/45 46/53/46 44/51/44
f 45/52/45 47/54/47 48/55/48 46/53/46
f 47/54/47 49/56/49 50/57/50 48/55/48
f 49/56/49 51/58/51 52/59/52 50/57/50
f 21/29/21 19/60/19 53/61/53 25/30/25
f 19/60/19 15/22/15 18/21/18 53/61/53
f 25/30/25 53/61/53 54/62/54 27/33/27
f 27/33/27 54/62/54 55/63/55 29/35/29
f 29/35/29 55/63/55 56/64/56 31/37/31
f 31/37/31 56/64/56 37/65/37 33/39/33
f 37/65/37 56/64/56 57/66/57 39/67/39
f 56/64/56 55/63/55 58/68/58 57/66/57
f 55/63/55 54/62/54 59/69/59 58/68/58
f 54/62/54 53/61/53 18/21/18 59/69/59
f 17/20/17 60/70/60 59/69/59 18/21/18
f 60/70/60 61/71/61 58/68/58 59/69/59
f 58/68/58 61/71/61 62/72/62 57/66/57
f 57/66/57 62/72/62 41/73/41 39/67/39
f 51/74/51 63/75/63 64/76/64 52/77/52
f 51/74/51 65/78/65 66/79/66 63/75/63
f 65/78/65 67/80/67 68/81/68 66/79/66
f 41/48/41 62/82/62 69/83/69 43/50/43
f 62/82/62 61/84/61 70/85/70 69/83/69
f 61/84/61 60/86/60 71/87/71 70/85/70
f 60/86/60 17/88/17 11/13/11 71/87/71
f 17/88/17 13/15/13 11/13/11
f 9/11/9 72/89/72 71/87/71 11/13/11
f 70/85/70 71/87/71 72/89/72 73/90/73
f 70/85/70 73/90/73 74/91/74 69/83/69
f 69/83/69 74/91/74 45/52/45 43/50/43
f 45/52/45 74/91/74 75/92/75 47/54/47
f 47/54/47 75/92/75 76/93/76 49/56/49
f 65/94/65 51/58/51 49/56/49 76/93/76
f 65/94/65 76/93/76 77/95/77 67/96/67
f 76/93/76 75/92/75 78/97/78 77/95/77
f 75/92/75 74/91/74 73/90/73 78/97/78
f 72/89/72 79/98/79 78/97/78 73/90/73
f 72/89/72 9/11/9 7/9/7 79/98/79
f 5/6/5 80/99/80 79/98/79 7/9/7
f 80/99/80 77/95/77 78/97/78 79/98/79
f 3/5/3 81/100/81 80/99/80 5/6/5
f 81/100/81 67/96/67 77/95/77 80/99/80
f 3/3/3 2/2/2 82/101/82 81/102/81
f 81/102/81 82/101/82 68/81/68 67/80/67
f 34/40/34 36/43/36 83/103/83 84/104/84
f 85/105/85 86/106/86 87/107/87 88/108/88
f 23/27/23 89/109/89 90/110/90 24/28/24
f 24/28/24 90/110/90 91/111/91 92/112/92
f 24/28/24 92/112/92 20/24/20 22/26/22
f 16/18/16 20/24/20 92/112/92 93/113/93
f 16/18/16 93/113/93 14/16/14
f 12/14/12 14/16/14 93/113/93 94/114/94
f 93/113/93 92/112/92 91/111/91 94/114/94
f 12/14/12 94/114/94 95/115/95 10/12/10
f 10/12/10 95/115/95 96/116/96 8/10/8
f 8/10/8 96/116/96 97/117/97 6/7/6
f 6/7/6 97/117/97 98/118/98 4/8/4
f 4/8/4 98/118/98 99/119/99 1/120/1
f 1/1/1 99/121/99 100/122/100 2/2/2
f 2/2/2 100/122/100 101/123/101 82/101/82
f 82/101/82 101/123/101 102/124/102 68/81/68
f 68/81/68 102/124/102 63/75/63 66/79/66
f 63/75/63 103/125/103 104/126/104 64/76/64
f 63/75/63 102/124/102 105/127/105 103/125/103
f 102/124/102 101/123/101 106/128/106 105/127/105
f 101/123/101 100/122/100 107/129/107 106/128/106
f 100/122/100 99/121/99 108/130/108 107/129/107
f 99/119/99 98/118/98 109/131/109 108/132/108
f 98/118/98 97/117/97 110/133/110 109/131/109
f 97/117/97 96/116/96 111/134/111 110/133/110
f 96/116/96 95/115/95 112/135/112 111/134/111
f 95/115/95 94/114/94 91/111/91 112/135/112
f 91/111/91 90/110/90 113/136/113 112/135/112
f 112/135/112 113/136/113 114/137/114 111/134/111
f 111/134/111 114/137/114 115/138/115 110/133/110
f 110/133/110 115/138/115 116/139/116 109/131/109
f 109/131/109 116/139/116 117/140/117 108/132/108
f 108/130/108 117/141/117 118/142/118 107/129/107
f 107/129/107 118/142/118 119/143/119 106/128/106
f 106/128/106 119/143/119 120/144/120 105/127/105
f 105/127/105 120/144/120 121/145/121 103/125/103
f 103/125/103 121/145/121 122/146/122 104/126/104
f 121/145/121 123/147/123 124/148/124 122/146/122
f 121/145/121 120/144/120 125/149/125 123/147/123
f 120/144/120 119/143/119 126/150/126 125/149/125
f 119/143/119 118/142/118 87/107/87 126/150/126
f 118/142/118 117/141/117 88/108/88 87/107/87
f 117/140/117 116/139/116 85/151/85 88/152/88
f 116/139/116 115/138/115 127/153/127 85/151/85
f 114/137/114 128/154/128 127/153/127 115/138/115
f 114/137/114 113/136/113 129/155/129 128/154/128
f 113/136/113 90/110/90 89/109/89 129/155/129
f 32/38/32 34/40/34 84/104/84 130/156/130
f 32/38/32 130/156/130 131/157/131 30/36/30
f 30/36/30 131/157/131 132/158/132 28/34/28
f 28/34/28 132/158/132 133/159/133 26/31/26
f 26/31/26 133/159/133 89/160/89 23/32/23
f 89/160/89 133/159/133 134/161/134 129/162/129
f 129/162/129 134/161/134 135/163/135 128/164/128
f 128/164/128 135/163/135 136/165/136 127/166/127
f 127/166/127 136/165/136 86/106/86 85/105/85
f 86/106/86 137/167/137 126/150/126 87/107/87
f 137/167/137 138/168/138 125/149/125 126/150/126
f 138/168/138 139/169/139 123/147/123 125/149/125
f 139/169/139 140/170/140 124/148/124 123/147/123
f 139/169/139 141/171/141 142/172/142 140/170/140
f 141/171/141 143/173/143 144/174/144 142/172/142
f 143/173/143 145/175/145 146/176/146 144/174/144
f 83/103/83 146/176/146 145/175/145 84/104/84
f 84/104/84 145/175/145 147/177/147 130/156/130
f 130/156/130 147/177/147 148/178/148 131/157/131
f 131/157/131 148/178/148 149/179/149 132/158/132
f 132/158/132 149/179/149 134/161/134 133/159/133
f 134/161/134 149/179/149 150/180/150 135/163/135
f 149/179/149 148/178/148 151/181/151 150/180/150
f 148/178/148 147/177/147 152/182/152 151/181/151
f 147/177/147 145/175/145 143/173/143 152/182/152
f 135/163/135 150/180/150 153/183/153 136/165/136
f 136/165/136 153/183/153 137/167/137 86/106/86
f 150/180/150 151/181/151 154/184/154 153/183/153
f 153/183/153 154/184/154 137/167/137
f 151/181/151 152/182/152 155/185/155 154/184/154
f 154/184/154 155/185/155 138/168/138 137/167/137
f 138/168/138 155/185/155 141/171/141 139/169/139
f 152/182/152 143/173/143 141/171/141 155/185/155
f 124/148/124 140/170/140 156/186/156 122/187/122
f 122/187/122 156/186/156 157/188/157 104/189/104
f 104/189/104 157/188/157 158/190/158 64/191/64
f 52/59/52 64/191/64 158/190/158
f 52/59/52 158/190/158 159/192/159 50/57/50
f 158/190/158 157/188/157 160/193/160 159/192/159
f 157/188/157 156/186/156 161/194/161 160/193/160
f 156/186/156 140/170/140 142/172/142 161/194/161
f 142/172/142 144/174/144 162/195/162 161/194/161
f 161/194/161 162/195/162 163/196/163 160/193/160
f 160/193/160 163/196/163 164/197/164 159/192/159
f 159/192/159 164/197/164 48/55/48 50/57/50
f 144/174/144 146/176/146 165/198/165 162/195/162
f 162/195/162 165/198/165 166/199/166 163/196/163
f 163/196/163 166/199/166 167/200/167 164/197/164
f 164/197/164 167/200/167 46/53/46 48/55/48
f 44/51/44 46/53/46 167/200/167 168/201/168
f 168/201/168 167/200/167 166/199/166 169/202/169
f 166/199/166 165/198/165 170/203/170 169/202/169
f 165/198/165 146/176/146 83/103/83 170/203/170
f 36/43/36 171/204/171 170/203/170 83/103/83
f 36/43/36 35/42/35 38/45/38 171/204/171
f 38/45/38 40/47/40 172/205/172 171/204/171
f 171/204/171 172/205/172 169/202/169 170/203/170
f 40/47/40 42/49/42 169/202/169 172/205/172
f 42/49/42 44/51/44 168/201/168 169/202/169
