%YAML 1.1
%TAG !u! tag:unity3d.com,2011:
--- !u!114 &11400000
MonoBehaviour:
  m_ObjectHideFlags: 0
  m_CorrespondingSourceObject: {fileID: 0}
  m_PrefabInstance: {fileID: 0}
  m_PrefabAsset: {fileID: 0}
  m_GameObject: {fileID: 0}
  m_Enabled: 1
  m_EditorHideFlags: 0
  m_Script: {fileID: 11500000, guid: d2a74781072307c47bc5200ff65bbf06, type: 3}
  m_Name: BA_FirePillarTrap
  m_EditorClassIdentifier: 
  trapPrefab: {fileID: 6572446224971882818, guid: edaf851ace82d9e499e90a03def5d369, type: 3}
  trapPreviewPrefab: {fileID: 6572446224971882818, guid: 5ce899705d65d3c43b5aa45434e98d54, type: 3}
  buildType: 0
  dropRateInPercent: 25
  sprite: {fileID: 21300000, guid: 9334b3b74e077cc4f80274621ba08b95, type: 3}
  customOffset: {x: 0, y: 0, z: 0}
