%YAML 1.1
%TAG !u! tag:unity3d.com,2011:
--- !u!114 &11400000
MonoBehaviour:
  m_ObjectHideFlags: 0
  m_CorrespondingSourceObject: {fileID: 0}
  m_PrefabInstance: {fileID: 0}
  m_PrefabAsset: {fileID: 0}
  m_GameObject: {fileID: 0}
  m_Enabled: 1
  m_EditorHideFlags: 0
  m_Script: {fileID: 11500000, guid: d2a74781072307c47bc5200ff65bbf06, type: 3}
  m_Name: BA_FireWallTrap
  m_EditorClassIdentifier: 
  trapPrefab: {fileID: 5658639352229645009, guid: e82390e662189894cbe8ebf68996a32d, type: 3}
  trapPreviewPrefab: {fileID: 5658639352229645009, guid: 4a3ce9868b27ad74a9aebc6962cc2d66, type: 3}
  buildType: 0
  dropRateInPercent: 25
  sprite: {fileID: 21300000, guid: a242569c0cf00894c969e57bf5fb7bd5, type: 3}
  customOffset: {x: 0, y: 5, z: 0}
