%YAML 1.1
%TAG !u! tag:unity3d.com,2011:
--- !u!54 &9084034858582234059
Rigidbody:
  m_ObjectHideFlags: 0
  m_CorrespondingSourceObject: {fileID: 0}
  m_PrefabInstance: {fileID: 0}
  m_PrefabAsset: {fileID: 0}
  m_GameObject: {fileID: 5658639352229645009}
  serializedVersion: 2
  m_Mass: 1
  m_Drag: 0
  m_AngularDrag: 0.05
  m_UseGravity: 0
  m_IsKinematic: 1
  m_Interpolate: 0
  m_Constraints: 0
  m_CollisionDetection: 0
--- !u!114 &6876019927157368169
MonoBehaviour:
  m_ObjectHideFlags: 0
  m_CorrespondingSourceObject: {fileID: 0}
  m_PrefabInstance: {fileID: 0}
  m_PrefabAsset: {fileID: 0}
  m_GameObject: {fileID: 5658639352229645009}
  m_Enabled: 1
  m_EditorHideFlags: 0
  m_Script: {fileID: 11500000, guid: 2170ac861b7347741bbd72dbbb8df017, type: 3}
  m_Name: 
  m_EditorClassIdentifier: 
  mat_build_Placeable: {fileID: 2100000, guid: 7723cb0fe2d5c8b4dae144cffc3675e8, type: 2}
  mat_build_notPlaceable: {fileID: 2100000, guid: 3381e5da771170743834558514e1c097, type: 2}
  ability: {fileID: 11400000, guid: daef99ff06e4ff64eadc4cd3cb573485, type: 2}
  onLava: 0
  onNormalPlatform: 0
--- !u!1001 &346254335021620740
PrefabInstance:
  m_ObjectHideFlags: 0
  serializedVersion: 2
  m_Modification:
    m_TransformParent: {fileID: 0}
    m_Modifications:
    - target: {fileID: 5352988823063549140, guid: 3a574e82a30db71419a200e26971b9ee, type: 3}
      propertyPath: m_LocalPosition.x
      value: 0
      objectReference: {fileID: 0}
    - target: {fileID: 5352988823063549140, guid: 3a574e82a30db71419a200e26971b9ee, type: 3}
      propertyPath: m_LocalPosition.y
      value: 0
      objectReference: {fileID: 0}
    - target: {fileID: 5352988823063549140, guid: 3a574e82a30db71419a200e26971b9ee, type: 3}
      propertyPath: m_LocalPosition.z
      value: 0
      objectReference: {fileID: 0}
    - target: {fileID: 5352988823063549140, guid: 3a574e82a30db71419a200e26971b9ee, type: 3}
      propertyPath: m_LocalRotation.x
      value: -0
      objectReference: {fileID: 0}
    - target: {fileID: 5352988823063549140, guid: 3a574e82a30db71419a200e26971b9ee, type: 3}
      propertyPath: m_LocalRotation.y
      value: -0
      objectReference: {fileID: 0}
    - target: {fileID: 5352988823063549140, guid: 3a574e82a30db71419a200e26971b9ee, type: 3}
      propertyPath: m_LocalRotation.z
      value: -0
      objectReference: {fileID: 0}
    - target: {fileID: 5352988823063549140, guid: 3a574e82a30db71419a200e26971b9ee, type: 3}
      propertyPath: m_LocalRotation.w
      value: 1
      objectReference: {fileID: 0}
    - target: {fileID: 5352988823063549140, guid: 3a574e82a30db71419a200e26971b9ee, type: 3}
      propertyPath: m_RootOrder
      value: 0
      objectReference: {fileID: 0}
    - target: {fileID: 5352988823063549140, guid: 3a574e82a30db71419a200e26971b9ee, type: 3}
      propertyPath: m_LocalEulerAnglesHint.x
      value: 0
      objectReference: {fileID: 0}
    - target: {fileID: 5352988823063549140, guid: 3a574e82a30db71419a200e26971b9ee, type: 3}
      propertyPath: m_LocalEulerAnglesHint.y
      value: 0
      objectReference: {fileID: 0}
    - target: {fileID: 5352988823063549140, guid: 3a574e82a30db71419a200e26971b9ee, type: 3}
      propertyPath: m_LocalEulerAnglesHint.z
      value: 0
      objectReference: {fileID: 0}
    - target: {fileID: 5352988823063549140, guid: 3a574e82a30db71419a200e26971b9ee, type: 3}
      propertyPath: m_LocalScale.y
      value: 10
      objectReference: {fileID: 0}
    - target: {fileID: 5352988823063549140, guid: 3a574e82a30db71419a200e26971b9ee, type: 3}
      propertyPath: m_LocalScale.z
      value: 10
      objectReference: {fileID: 0}
    - target: {fileID: 5352988823063549140, guid: 3a574e82a30db71419a200e26971b9ee, type: 3}
      propertyPath: m_LocalScale.x
      value: 1
      objectReference: {fileID: 0}
    - target: {fileID: 5352988823063549141, guid: 3a574e82a30db71419a200e26971b9ee, type: 3}
      propertyPath: m_Name
      value: Preview_FireWallTrapPrefab
      objectReference: {fileID: 0}
    - target: {fileID: 5352988823063549141, guid: 3a574e82a30db71419a200e26971b9ee, type: 3}
      propertyPath: m_Layer
      value: 16
      objectReference: {fileID: 0}
    - target: {fileID: 5352988823063549142, guid: 3a574e82a30db71419a200e26971b9ee, type: 3}
      propertyPath: m_Materials.Array.data[0]
      value: 
      objectReference: {fileID: 2100000, guid: 7723cb0fe2d5c8b4dae144cffc3675e8, type: 2}
    - target: {fileID: 5352988823063549143, guid: 3a574e82a30db71419a200e26971b9ee, type: 3}
      propertyPath: m_Enabled
      value: 1
      objectReference: {fileID: 0}
    - target: {fileID: 5352988823063549143, guid: 3a574e82a30db71419a200e26971b9ee, type: 3}
      propertyPath: m_IsTrigger
      value: 1
      objectReference: {fileID: 0}
    m_RemovedComponents:
    - {fileID: 5352988823063549136, guid: 3a574e82a30db71419a200e26971b9ee, type: 3}
  m_SourcePrefab: {fileID: 100100000, guid: 3a574e82a30db71419a200e26971b9ee, type: 3}
--- !u!1 &5658639352229645009 stripped
GameObject:
  m_CorrespondingSourceObject: {fileID: 5352988823063549141, guid: 3a574e82a30db71419a200e26971b9ee, type: 3}
  m_PrefabInstance: {fileID: 346254335021620740}
  m_PrefabAsset: {fileID: 0}
