%YAML 1.1
%TAG !u! tag:unity3d.com,2011:
--- !u!135 &909746680298251123
SphereCollider:
  m_ObjectHideFlags: 0
  m_CorrespondingSourceObject: {fileID: 0}
  m_PrefabInstance: {fileID: 0}
  m_PrefabAsset: {fileID: 0}
  m_GameObject: {fileID: 2986356025405824366}
  m_Material: {fileID: 0}
  m_IsTrigger: 0
  m_Enabled: 1
  serializedVersion: 2
  m_Radius: 0.5
  m_Center: {x: 0, y: 0, z: 0}
--- !u!114 &2937353024453225990
MonoBehaviour:
  m_ObjectHideFlags: 0
  m_CorrespondingSourceObject: {fileID: 0}
  m_PrefabInstance: {fileID: 0}
  m_PrefabAsset: {fileID: 0}
  m_GameObject: {fileID: 2986356025405824366}
  m_Enabled: 1
  m_EditorHideFlags: 0
  m_Script: {fileID: 11500000, guid: ca755deec3caf904a82e5fba11f1494b, type: 3}
  m_Name: 
  m_EditorClassIdentifier: 
  duration: 4
  downTime: 2
  timer: 0
  rotation: {x: 180, y: 0, z: 0}
--- !u!1001 &7149473216195430843
PrefabInstance:
  m_ObjectHideFlags: 0
  serializedVersion: 2
  m_Modification:
    m_TransformParent: {fileID: 0}
    m_Modifications:
    - target: {fileID: 5352988823063549137, guid: 3a574e82a30db71419a200e26971b9ee, type: 3}
      propertyPath: m_Mesh
      value: 
      objectReference: {fileID: 10207, guid: 0000000000000000e000000000000000, type: 0}
    - target: {fileID: 5352988823063549140, guid: 3a574e82a30db71419a200e26971b9ee, type: 3}
      propertyPath: m_LocalPosition.x
      value: 0
      objectReference: {fileID: 0}
    - target: {fileID: 5352988823063549140, guid: 3a574e82a30db71419a200e26971b9ee, type: 3}
      propertyPath: m_LocalPosition.y
      value: 0
      objectReference: {fileID: 0}
    - target: {fileID: 5352988823063549140, guid: 3a574e82a30db71419a200e26971b9ee, type: 3}
      propertyPath: m_LocalPosition.z
      value: 0
      objectReference: {fileID: 0}
    - target: {fileID: 5352988823063549140, guid: 3a574e82a30db71419a200e26971b9ee, type: 3}
      propertyPath: m_LocalRotation.x
      value: -0
      objectReference: {fileID: 0}
    - target: {fileID: 5352988823063549140, guid: 3a574e82a30db71419a200e26971b9ee, type: 3}
      propertyPath: m_LocalRotation.y
      value: -0
      objectReference: {fileID: 0}
    - target: {fileID: 5352988823063549140, guid: 3a574e82a30db71419a200e26971b9ee, type: 3}
      propertyPath: m_LocalRotation.z
      value: -0
      objectReference: {fileID: 0}
    - target: {fileID: 5352988823063549140, guid: 3a574e82a30db71419a200e26971b9ee, type: 3}
      propertyPath: m_LocalRotation.w
      value: 1
      objectReference: {fileID: 0}
    - target: {fileID: 5352988823063549140, guid: 3a574e82a30db71419a200e26971b9ee, type: 3}
      propertyPath: m_RootOrder
      value: 0
      objectReference: {fileID: 0}
    - target: {fileID: 5352988823063549140, guid: 3a574e82a30db71419a200e26971b9ee, type: 3}
      propertyPath: m_LocalEulerAnglesHint.x
      value: 0
      objectReference: {fileID: 0}
    - target: {fileID: 5352988823063549140, guid: 3a574e82a30db71419a200e26971b9ee, type: 3}
      propertyPath: m_LocalEulerAnglesHint.y
      value: 0
      objectReference: {fileID: 0}
    - target: {fileID: 5352988823063549140, guid: 3a574e82a30db71419a200e26971b9ee, type: 3}
      propertyPath: m_LocalEulerAnglesHint.z
      value: 0
      objectReference: {fileID: 0}
    - target: {fileID: 5352988823063549140, guid: 3a574e82a30db71419a200e26971b9ee, type: 3}
      propertyPath: m_LocalScale.x
      value: 2
      objectReference: {fileID: 0}
    - target: {fileID: 5352988823063549140, guid: 3a574e82a30db71419a200e26971b9ee, type: 3}
      propertyPath: m_LocalScale.z
      value: 2
      objectReference: {fileID: 0}
    - target: {fileID: 5352988823063549140, guid: 3a574e82a30db71419a200e26971b9ee, type: 3}
      propertyPath: m_LocalScale.y
      value: 2
      objectReference: {fileID: 0}
    - target: {fileID: 5352988823063549141, guid: 3a574e82a30db71419a200e26971b9ee, type: 3}
      propertyPath: m_Name
      value: Fireball
      objectReference: {fileID: 0}
    m_RemovedComponents:
    - {fileID: 5352988823063549143, guid: 3a574e82a30db71419a200e26971b9ee, type: 3}
  m_SourcePrefab: {fileID: 100100000, guid: 3a574e82a30db71419a200e26971b9ee, type: 3}
--- !u!1 &2986356025405824366 stripped
GameObject:
  m_CorrespondingSourceObject: {fileID: 5352988823063549141, guid: 3a574e82a30db71419a200e26971b9ee, type: 3}
  m_PrefabInstance: {fileID: 7149473216195430843}
  m_PrefabAsset: {fileID: 0}
