%YAML 1.1
%TAG !u! tag:unity3d.com,2011:
--- !u!1 &3928509713160222092
GameObject:
  m_ObjectHideFlags: 0
  m_CorrespondingSourceObject: {fileID: 0}
  m_PrefabInstance: {fileID: 0}
  m_PrefabAsset: {fileID: 0}
  serializedVersion: 6
  m_Component:
  - component: {fileID: 1231685999745959304}
  - component: {fileID: 670053991603436670}
  m_Layer: 11
  m_Name: Wampe
  m_TagString: Untagged
  m_Icon: {fileID: 0}
  m_NavMeshLayer: 0
  m_StaticEditorFlags: 0
  m_IsActive: 1
--- !u!4 &1231685999745959304
Transform:
  m_ObjectHideFlags: 0
  m_CorrespondingSourceObject: {fileID: 0}
  m_PrefabInstance: {fileID: 0}
  m_PrefabAsset: {fileID: 0}
  m_GameObject: {fileID: 3928509713160222092}
  m_LocalRotation: {x: 0, y: 0, z: 0, w: 1}
  m_LocalPosition: {x: 0, y: 0, z: 0}
  m_LocalScale: {x: 0, y: 1, z: 1}
  m_Children: []
  m_Father: {fileID: 3645187674829217104}
  m_RootOrder: 1
  m_LocalEulerAnglesHint: {x: 0, y: 0, z: 0}
--- !u!135 &670053991603436670
SphereCollider:
  m_ObjectHideFlags: 0
  m_CorrespondingSourceObject: {fileID: 0}
  m_PrefabInstance: {fileID: 0}
  m_PrefabAsset: {fileID: 0}
  m_GameObject: {fileID: 3928509713160222092}
  m_Material: {fileID: 13400000, guid: df03573e2d29d39478d0062ba6541a84, type: 2}
  m_IsTrigger: 0
  m_Enabled: 1
  serializedVersion: 2
  m_Radius: 0.11
  m_Center: {x: 0, y: 0.68, z: 0.06}
--- !u!65 &1473716918189247815
BoxCollider:
  m_ObjectHideFlags: 0
  m_CorrespondingSourceObject: {fileID: 0}
  m_PrefabInstance: {fileID: 0}
  m_PrefabAsset: {fileID: 0}
  m_GameObject: {fileID: 4169662879460722666}
  m_Material: {fileID: 13400000, guid: df03573e2d29d39478d0062ba6541a84, type: 2}
  m_IsTrigger: 0
  m_Enabled: 1
  serializedVersion: 2
  m_Size: {x: 0.32, y: 0.46, z: 0.19}
  m_Center: {x: 0, y: 0.78, z: 0}
--- !u!1 &8377001436726168184
GameObject:
  m_ObjectHideFlags: 0
  m_CorrespondingSourceObject: {fileID: 0}
  m_PrefabInstance: {fileID: 0}
  m_PrefabAsset: {fileID: 0}
  serializedVersion: 6
  m_Component:
  - component: {fileID: 3851344153469482605}
  - component: {fileID: 6043258529570710612}
  - component: {fileID: 490097333718528762}
  m_Layer: 11
  m_Name: BodyLimb
  m_TagString: Untagged
  m_Icon: {fileID: 0}
  m_NavMeshLayer: 0
  m_StaticEditorFlags: 0
  m_IsActive: 1
--- !u!4 &3851344153469482605
Transform:
  m_ObjectHideFlags: 0
  m_CorrespondingSourceObject: {fileID: 0}
  m_PrefabInstance: {fileID: 0}
  m_PrefabAsset: {fileID: 0}
  m_GameObject: {fileID: 8377001436726168184}
  m_LocalRotation: {x: 0, y: 0, z: 0, w: 1}
  m_LocalPosition: {x: 0, y: 0.53, z: 0}
  m_LocalScale: {x: 1, y: 1, z: 1}
  m_Children:
  - {fileID: 3645187674829217104}
  - {fileID: 5404037200390178566}
  - {fileID: 8713799684702556503}
  - {fileID: 1255714013193926296}
  - {fileID: 1496902782228705657}
  - {fileID: 3988599978768608306}
  m_Father: {fileID: 0}
  m_RootOrder: 0
  m_LocalEulerAnglesHint: {x: 0, y: 0, z: 0}
--- !u!54 &6043258529570710612
Rigidbody:
  m_ObjectHideFlags: 0
  m_CorrespondingSourceObject: {fileID: 0}
  m_PrefabInstance: {fileID: 0}
  m_PrefabAsset: {fileID: 0}
  m_GameObject: {fileID: 8377001436726168184}
  serializedVersion: 2
  m_Mass: 1
  m_Drag: 0
  m_AngularDrag: 0.05
  m_UseGravity: 1
  m_IsKinematic: 0
  m_Interpolate: 0
  m_Constraints: 0
  m_CollisionDetection: 0
--- !u!114 &490097333718528762
MonoBehaviour:
  m_ObjectHideFlags: 0
  m_CorrespondingSourceObject: {fileID: 0}
  m_PrefabInstance: {fileID: 0}
  m_PrefabAsset: {fileID: 0}
  m_GameObject: {fileID: 8377001436726168184}
  m_Enabled: 1
  m_EditorHideFlags: 0
  m_Script: {fileID: 11500000, guid: 4485d519dafbfd24598e0610a694c3b0, type: 3}
  m_Name: 
  m_EditorClassIdentifier: 
  sounds: {fileID: 11400000, guid: 104c9ffb88a27eb4a85d40d9ee720fca, type: 2}
  sources: 1
  layers:
    serializedVersion: 2
    m_Bits: 4096
--- !u!1001 &64722452256847916
PrefabInstance:
  m_ObjectHideFlags: 0
  serializedVersion: 2
  m_Modification:
    m_TransformParent: {fileID: 3851344153469482605}
    m_Modifications:
    - target: {fileID: 1451251566983760213, guid: a94dadcf0d5e72549951bcfb815291df, type: 3}
      propertyPath: m_LocalPosition.x
      value: 0.223
      objectReference: {fileID: 0}
    - target: {fileID: 1451251566983760213, guid: a94dadcf0d5e72549951bcfb815291df, type: 3}
      propertyPath: m_LocalPosition.y
      value: -0.601
      objectReference: {fileID: 0}
    - target: {fileID: 1451251566983760213, guid: a94dadcf0d5e72549951bcfb815291df, type: 3}
      propertyPath: m_LocalPosition.z
      value: 0.111
      objectReference: {fileID: 0}
    - target: {fileID: 1451251566983760213, guid: a94dadcf0d5e72549951bcfb815291df, type: 3}
      propertyPath: m_LocalRotation.x
      value: -0.62658936
      objectReference: {fileID: 0}
    - target: {fileID: 1451251566983760213, guid: a94dadcf0d5e72549951bcfb815291df, type: 3}
      propertyPath: m_LocalRotation.y
      value: 0.32769766
      objectReference: {fileID: 0}
    - target: {fileID: 1451251566983760213, guid: a94dadcf0d5e72549951bcfb815291df, type: 3}
      propertyPath: m_LocalRotation.z
      value: -0.6265895
      objectReference: {fileID: 0}
    - target: {fileID: 1451251566983760213, guid: a94dadcf0d5e72549951bcfb815291df, type: 3}
      propertyPath: m_LocalRotation.w
      value: -0.32769772
      objectReference: {fileID: 0}
    - target: {fileID: 1451251566983760213, guid: a94dadcf0d5e72549951bcfb815291df, type: 3}
      propertyPath: m_RootOrder
      value: 4
      objectReference: {fileID: 0}
    - target: {fileID: 1451251566983760213, guid: a94dadcf0d5e72549951bcfb815291df, type: 3}
      propertyPath: m_LocalEulerAnglesHint.x
      value: 124.782
      objectReference: {fileID: 0}
    - target: {fileID: 1451251566983760213, guid: a94dadcf0d5e72549951bcfb815291df, type: 3}
      propertyPath: m_LocalEulerAnglesHint.y
      value: 270
      objectReference: {fileID: 0}
    - target: {fileID: 1451251566983760213, guid: a94dadcf0d5e72549951bcfb815291df, type: 3}
      propertyPath: m_LocalEulerAnglesHint.z
      value: 0
      objectReference: {fileID: 0}
    - target: {fileID: 1451251566983760214, guid: a94dadcf0d5e72549951bcfb815291df, type: 3}
      propertyPath: m_Name
      value: LimbSplash (3)
      objectReference: {fileID: 0}
    - target: {fileID: 1451251566983760214, guid: a94dadcf0d5e72549951bcfb815291df, type: 3}
      propertyPath: m_Layer
      value: 11
      objectReference: {fileID: 0}
    - target: {fileID: 1710545952963039871, guid: a94dadcf0d5e72549951bcfb815291df, type: 3}
      propertyPath: EmissionModule.rateOverTime.scalar
      value: 10
      objectReference: {fileID: 0}
    m_RemovedComponents: []
  m_SourcePrefab: {fileID: 100100000, guid: a94dadcf0d5e72549951bcfb815291df, type: 3}
--- !u!4 &1496902782228705657 stripped
Transform:
  m_CorrespondingSourceObject: {fileID: 1451251566983760213, guid: a94dadcf0d5e72549951bcfb815291df, type: 3}
  m_PrefabInstance: {fileID: 64722452256847916}
  m_PrefabAsset: {fileID: 0}
--- !u!1001 &382472410935115725
PrefabInstance:
  m_ObjectHideFlags: 0
  serializedVersion: 2
  m_Modification:
    m_TransformParent: {fileID: 3851344153469482605}
    m_Modifications:
    - target: {fileID: 1451251566983760213, guid: a94dadcf0d5e72549951bcfb815291df, type: 3}
      propertyPath: m_LocalPosition.x
      value: -0.118
      objectReference: {fileID: 0}
    - target: {fileID: 1451251566983760213, guid: a94dadcf0d5e72549951bcfb815291df, type: 3}
      propertyPath: m_LocalPosition.y
      value: -0.598
      objectReference: {fileID: 0}
    - target: {fileID: 1451251566983760213, guid: a94dadcf0d5e72549951bcfb815291df, type: 3}
      propertyPath: m_LocalPosition.z
      value: 0.111
      objectReference: {fileID: 0}
    - target: {fileID: 1451251566983760213, guid: a94dadcf0d5e72549951bcfb815291df, type: 3}
      propertyPath: m_LocalRotation.x
      value: -0.40376166
      objectReference: {fileID: 0}
    - target: {fileID: 1451251566983760213, guid: a94dadcf0d5e72549951bcfb815291df, type: 3}
      propertyPath: m_LocalRotation.y
      value: 0.5804968
      objectReference: {fileID: 0}
    - target: {fileID: 1451251566983760213, guid: a94dadcf0d5e72549951bcfb815291df, type: 3}
      propertyPath: m_LocalRotation.z
      value: -0.40376174
      objectReference: {fileID: 0}
    - target: {fileID: 1451251566983760213, guid: a94dadcf0d5e72549951bcfb815291df, type: 3}
      propertyPath: m_LocalRotation.w
      value: -0.5804968
      objectReference: {fileID: 0}
    - target: {fileID: 1451251566983760213, guid: a94dadcf0d5e72549951bcfb815291df, type: 3}
      propertyPath: m_RootOrder
      value: 3
      objectReference: {fileID: 0}
    - target: {fileID: 1451251566983760213, guid: a94dadcf0d5e72549951bcfb815291df, type: 3}
      propertyPath: m_LocalEulerAnglesHint.x
      value: 69.641
      objectReference: {fileID: 0}
    - target: {fileID: 1451251566983760213, guid: a94dadcf0d5e72549951bcfb815291df, type: 3}
      propertyPath: m_LocalEulerAnglesHint.y
      value: 270
      objectReference: {fileID: 0}
    - target: {fileID: 1451251566983760213, guid: a94dadcf0d5e72549951bcfb815291df, type: 3}
      propertyPath: m_LocalEulerAnglesHint.z
      value: 0
      objectReference: {fileID: 0}
    - target: {fileID: 1451251566983760214, guid: a94dadcf0d5e72549951bcfb815291df, type: 3}
      propertyPath: m_Name
      value: LimbSplash (2)
      objectReference: {fileID: 0}
    - target: {fileID: 1451251566983760214, guid: a94dadcf0d5e72549951bcfb815291df, type: 3}
      propertyPath: m_Layer
      value: 11
      objectReference: {fileID: 0}
    - target: {fileID: 1710545952963039871, guid: a94dadcf0d5e72549951bcfb815291df, type: 3}
      propertyPath: EmissionModule.rateOverTime.scalar
      value: 10
      objectReference: {fileID: 0}
    m_RemovedComponents: []
  m_SourcePrefab: {fileID: 100100000, guid: a94dadcf0d5e72549951bcfb815291df, type: 3}
--- !u!4 &1255714013193926296 stripped
Transform:
  m_CorrespondingSourceObject: {fileID: 1451251566983760213, guid: a94dadcf0d5e72549951bcfb815291df, type: 3}
  m_PrefabInstance: {fileID: 382472410935115725}
  m_PrefabAsset: {fileID: 0}
--- !u!1001 &2556279941514257767
PrefabInstance:
  m_ObjectHideFlags: 0
  serializedVersion: 2
  m_Modification:
    m_TransformParent: {fileID: 3851344153469482605}
    m_Modifications:
    - target: {fileID: 1451251566983760213, guid: a94dadcf0d5e72549951bcfb815291df, type: 3}
      propertyPath: m_LocalPosition.x
      value: -0.045
      objectReference: {fileID: 0}
    - target: {fileID: 1451251566983760213, guid: a94dadcf0d5e72549951bcfb815291df, type: 3}
      propertyPath: m_LocalPosition.y
      value: 0.209
      objectReference: {fileID: 0}
    - target: {fileID: 1451251566983760213, guid: a94dadcf0d5e72549951bcfb815291df, type: 3}
      propertyPath: m_LocalPosition.z
      value: 0.067
      objectReference: {fileID: 0}
    - target: {fileID: 1451251566983760213, guid: a94dadcf0d5e72549951bcfb815291df, type: 3}
      propertyPath: m_LocalRotation.x
      value: -0.5
      objectReference: {fileID: 0}
    - target: {fileID: 1451251566983760213, guid: a94dadcf0d5e72549951bcfb815291df, type: 3}
      propertyPath: m_LocalRotation.y
      value: 0.5
      objectReference: {fileID: 0}
    - target: {fileID: 1451251566983760213, guid: a94dadcf0d5e72549951bcfb815291df, type: 3}
      propertyPath: m_LocalRotation.z
      value: 0.5
      objectReference: {fileID: 0}
    - target: {fileID: 1451251566983760213, guid: a94dadcf0d5e72549951bcfb815291df, type: 3}
      propertyPath: m_LocalRotation.w
      value: 0.5
      objectReference: {fileID: 0}
    - target: {fileID: 1451251566983760213, guid: a94dadcf0d5e72549951bcfb815291df, type: 3}
      propertyPath: m_RootOrder
      value: 5
      objectReference: {fileID: 0}
    - target: {fileID: 1451251566983760213, guid: a94dadcf0d5e72549951bcfb815291df, type: 3}
      propertyPath: m_LocalEulerAnglesHint.x
      value: -90
      objectReference: {fileID: 0}
    - target: {fileID: 1451251566983760213, guid: a94dadcf0d5e72549951bcfb815291df, type: 3}
      propertyPath: m_LocalEulerAnglesHint.y
      value: 90
      objectReference: {fileID: 0}
    - target: {fileID: 1451251566983760213, guid: a94dadcf0d5e72549951bcfb815291df, type: 3}
      propertyPath: m_LocalEulerAnglesHint.z
      value: 0
      objectReference: {fileID: 0}
    - target: {fileID: 1451251566983760214, guid: a94dadcf0d5e72549951bcfb815291df, type: 3}
      propertyPath: m_Name
      value: LimbSplash (4)
      objectReference: {fileID: 0}
    - target: {fileID: 1451251566983760214, guid: a94dadcf0d5e72549951bcfb815291df, type: 3}
      propertyPath: m_Layer
      value: 11
      objectReference: {fileID: 0}
    - target: {fileID: 1710545952963039871, guid: a94dadcf0d5e72549951bcfb815291df, type: 3}
      propertyPath: EmissionModule.rateOverTime.scalar
      value: 10
      objectReference: {fileID: 0}
    m_RemovedComponents: []
  m_SourcePrefab: {fileID: 100100000, guid: a94dadcf0d5e72549951bcfb815291df, type: 3}
--- !u!4 &3988599978768608306 stripped
Transform:
  m_CorrespondingSourceObject: {fileID: 1451251566983760213, guid: a94dadcf0d5e72549951bcfb815291df, type: 3}
  m_PrefabInstance: {fileID: 2556279941514257767}
  m_PrefabAsset: {fileID: 0}
--- !u!1001 &3827206041057016507
PrefabInstance:
  m_ObjectHideFlags: 0
  serializedVersion: 2
  m_Modification:
    m_TransformParent: {fileID: 3851344153469482605}
    m_Modifications:
    - target: {fileID: -8679921383154817045, guid: 8670ab2e93a61094eb3292ecc55aec1a, type: 3}
      propertyPath: m_LocalPosition.x
      value: 0.064
      objectReference: {fileID: 0}
    - target: {fileID: -8679921383154817045, guid: 8670ab2e93a61094eb3292ecc55aec1a, type: 3}
      propertyPath: m_LocalPosition.y
      value: -1.711
      objectReference: {fileID: 0}
    - target: {fileID: -8679921383154817045, guid: 8670ab2e93a61094eb3292ecc55aec1a, type: 3}
      propertyPath: m_LocalPosition.z
      value: 0.454
      objectReference: {fileID: 0}
    - target: {fileID: -8679921383154817045, guid: 8670ab2e93a61094eb3292ecc55aec1a, type: 3}
      propertyPath: m_LocalRotation.x
      value: -0.1011733
      objectReference: {fileID: 0}
    - target: {fileID: -8679921383154817045, guid: 8670ab2e93a61094eb3292ecc55aec1a, type: 3}
      propertyPath: m_LocalRotation.y
      value: 0.0018816588
      objectReference: {fileID: 0}
    - target: {fileID: -8679921383154817045, guid: 8670ab2e93a61094eb3292ecc55aec1a, type: 3}
      propertyPath: m_LocalRotation.z
      value: 0.028153028
      objectReference: {fileID: 0}
    - target: {fileID: -8679921383154817045, guid: 8670ab2e93a61094eb3292ecc55aec1a, type: 3}
      propertyPath: m_LocalRotation.w
      value: 0.9944687
      objectReference: {fileID: 0}
    - target: {fileID: -8679921383154817045, guid: 8670ab2e93a61094eb3292ecc55aec1a, type: 3}
      propertyPath: m_RootOrder
      value: 0
      objectReference: {fileID: 0}
    - target: {fileID: -8679921383154817045, guid: 8670ab2e93a61094eb3292ecc55aec1a, type: 3}
      propertyPath: m_LocalEulerAnglesHint.x
      value: -11.615
      objectReference: {fileID: 0}
    - target: {fileID: -8679921383154817045, guid: 8670ab2e93a61094eb3292ecc55aec1a, type: 3}
      propertyPath: m_LocalEulerAnglesHint.y
      value: -0.114
      objectReference: {fileID: 0}
    - target: {fileID: -8679921383154817045, guid: 8670ab2e93a61094eb3292ecc55aec1a, type: 3}
      propertyPath: m_LocalEulerAnglesHint.z
      value: 3.255
      objectReference: {fileID: 0}
    - target: {fileID: -8679921383154817045, guid: 8670ab2e93a61094eb3292ecc55aec1a, type: 3}
      propertyPath: m_LocalScale.x
      value: 2
      objectReference: {fileID: 0}
    - target: {fileID: -8679921383154817045, guid: 8670ab2e93a61094eb3292ecc55aec1a, type: 3}
      propertyPath: m_LocalScale.y
      value: 2
      objectReference: {fileID: 0}
    - target: {fileID: -8679921383154817045, guid: 8670ab2e93a61094eb3292ecc55aec1a, type: 3}
      propertyPath: m_LocalScale.z
      value: 2
      objectReference: {fileID: 0}
    - target: {fileID: -7635826562936255635, guid: 8670ab2e93a61094eb3292ecc55aec1a, type: 3}
      propertyPath: m_Materials.Array.data[0]
      value: 
      objectReference: {fileID: 2100000, guid: 7506813fb61409844bd887977ef17451, type: 2}
    - target: {fileID: 919132149155446097, guid: 8670ab2e93a61094eb3292ecc55aec1a, type: 3}
      propertyPath: m_Name
      value: body
      objectReference: {fileID: 0}
    - target: {fileID: 919132149155446097, guid: 8670ab2e93a61094eb3292ecc55aec1a, type: 3}
      propertyPath: m_Layer
      value: 11
      objectReference: {fileID: 0}
    - target: {fileID: 8164078558771037576, guid: 8670ab2e93a61094eb3292ecc55aec1a, type: 3}
      propertyPath: m_Layer
      value: 11
      objectReference: {fileID: 0}
    m_RemovedComponents: []
  m_SourcePrefab: {fileID: 100100000, guid: 8670ab2e93a61094eb3292ecc55aec1a, type: 3}
--- !u!1 &4169662879460722666 stripped
GameObject:
  m_CorrespondingSourceObject: {fileID: 919132149155446097, guid: 8670ab2e93a61094eb3292ecc55aec1a, type: 3}
  m_PrefabInstance: {fileID: 3827206041057016507}
  m_PrefabAsset: {fileID: 0}
--- !u!4 &3645187674829217104 stripped
Transform:
  m_CorrespondingSourceObject: {fileID: -8679921383154817045, guid: 8670ab2e93a61094eb3292ecc55aec1a, type: 3}
  m_PrefabInstance: {fileID: 3827206041057016507}
  m_PrefabAsset: {fileID: 0}
--- !u!1001 &6835653549667061331
PrefabInstance:
  m_ObjectHideFlags: 0
  serializedVersion: 2
  m_Modification:
    m_TransformParent: {fileID: 3851344153469482605}
    m_Modifications:
    - target: {fileID: 1451251566983760213, guid: a94dadcf0d5e72549951bcfb815291df, type: 3}
      propertyPath: m_LocalPosition.x
      value: 0.259
      objectReference: {fileID: 0}
    - target: {fileID: 1451251566983760213, guid: a94dadcf0d5e72549951bcfb815291df, type: 3}
      propertyPath: m_LocalPosition.y
      value: 0.2
      objectReference: {fileID: 0}
    - target: {fileID: 1451251566983760213, guid: a94dadcf0d5e72549951bcfb815291df, type: 3}
      propertyPath: m_LocalPosition.z
      value: 0.111
      objectReference: {fileID: 0}
    - target: {fileID: 1451251566983760213, guid: a94dadcf0d5e72549951bcfb815291df, type: 3}
      propertyPath: m_LocalRotation.x
      value: 0
      objectReference: {fileID: 0}
    - target: {fileID: 1451251566983760213, guid: a94dadcf0d5e72549951bcfb815291df, type: 3}
      propertyPath: m_LocalRotation.y
      value: 0.7071068
      objectReference: {fileID: 0}
    - target: {fileID: 1451251566983760213, guid: a94dadcf0d5e72549951bcfb815291df, type: 3}
      propertyPath: m_LocalRotation.z
      value: 0
      objectReference: {fileID: 0}
    - target: {fileID: 1451251566983760213, guid: a94dadcf0d5e72549951bcfb815291df, type: 3}
      propertyPath: m_LocalRotation.w
      value: 0.7071068
      objectReference: {fileID: 0}
    - target: {fileID: 1451251566983760213, guid: a94dadcf0d5e72549951bcfb815291df, type: 3}
      propertyPath: m_RootOrder
      value: 1
      objectReference: {fileID: 0}
    - target: {fileID: 1451251566983760213, guid: a94dadcf0d5e72549951bcfb815291df, type: 3}
      propertyPath: m_LocalEulerAnglesHint.x
      value: 0
      objectReference: {fileID: 0}
    - target: {fileID: 1451251566983760213, guid: a94dadcf0d5e72549951bcfb815291df, type: 3}
      propertyPath: m_LocalEulerAnglesHint.y
      value: 90
      objectReference: {fileID: 0}
    - target: {fileID: 1451251566983760213, guid: a94dadcf0d5e72549951bcfb815291df, type: 3}
      propertyPath: m_LocalEulerAnglesHint.z
      value: 0
      objectReference: {fileID: 0}
    - target: {fileID: 1451251566983760214, guid: a94dadcf0d5e72549951bcfb815291df, type: 3}
      propertyPath: m_Name
      value: LimbSplash
      objectReference: {fileID: 0}
    - target: {fileID: 1451251566983760214, guid: a94dadcf0d5e72549951bcfb815291df, type: 3}
      propertyPath: m_Layer
      value: 11
      objectReference: {fileID: 0}
    - target: {fileID: 1710545952963039871, guid: a94dadcf0d5e72549951bcfb815291df, type: 3}
      propertyPath: EmissionModule.rateOverTime.scalar
      value: 10
      objectReference: {fileID: 0}
    m_RemovedComponents: []
  m_SourcePrefab: {fileID: 100100000, guid: a94dadcf0d5e72549951bcfb815291df, type: 3}
--- !u!4 &5404037200390178566 stripped
Transform:
  m_CorrespondingSourceObject: {fileID: 1451251566983760213, guid: a94dadcf0d5e72549951bcfb815291df, type: 3}
  m_PrefabInstance: {fileID: 6835653549667061331}
  m_PrefabAsset: {fileID: 0}
--- !u!1001 &7840277914251728898
PrefabInstance:
  m_ObjectHideFlags: 0
  serializedVersion: 2
  m_Modification:
    m_TransformParent: {fileID: 3851344153469482605}
    m_Modifications:
    - target: {fileID: 1451251566983760213, guid: a94dadcf0d5e72549951bcfb815291df, type: 3}
      propertyPath: m_LocalPosition.x
      value: -0.275
      objectReference: {fileID: 0}
    - target: {fileID: 1451251566983760213, guid: a94dadcf0d5e72549951bcfb815291df, type: 3}
      propertyPath: m_LocalPosition.y
      value: 0.171
      objectReference: {fileID: 0}
    - target: {fileID: 1451251566983760213, guid: a94dadcf0d5e72549951bcfb815291df, type: 3}
      propertyPath: m_LocalPosition.z
      value: 0.111
      objectReference: {fileID: 0}
    - target: {fileID: 1451251566983760213, guid: a94dadcf0d5e72549951bcfb815291df, type: 3}
      propertyPath: m_LocalRotation.x
      value: 0
      objectReference: {fileID: 0}
    - target: {fileID: 1451251566983760213, guid: a94dadcf0d5e72549951bcfb815291df, type: 3}
      propertyPath: m_LocalRotation.y
      value: 0.7071068
      objectReference: {fileID: 0}
    - target: {fileID: 1451251566983760213, guid: a94dadcf0d5e72549951bcfb815291df, type: 3}
      propertyPath: m_LocalRotation.z
      value: -0
      objectReference: {fileID: 0}
    - target: {fileID: 1451251566983760213, guid: a94dadcf0d5e72549951bcfb815291df, type: 3}
      propertyPath: m_LocalRotation.w
      value: -0.7071068
      objectReference: {fileID: 0}
    - target: {fileID: 1451251566983760213, guid: a94dadcf0d5e72549951bcfb815291df, type: 3}
      propertyPath: m_RootOrder
      value: 2
      objectReference: {fileID: 0}
    - target: {fileID: 1451251566983760213, guid: a94dadcf0d5e72549951bcfb815291df, type: 3}
      propertyPath: m_LocalEulerAnglesHint.x
      value: 0
      objectReference: {fileID: 0}
    - target: {fileID: 1451251566983760213, guid: a94dadcf0d5e72549951bcfb815291df, type: 3}
      propertyPath: m_LocalEulerAnglesHint.y
      value: 270
      objectReference: {fileID: 0}
    - target: {fileID: 1451251566983760213, guid: a94dadcf0d5e72549951bcfb815291df, type: 3}
      propertyPath: m_LocalEulerAnglesHint.z
      value: 0
      objectReference: {fileID: 0}
    - target: {fileID: 1451251566983760214, guid: a94dadcf0d5e72549951bcfb815291df, type: 3}
      propertyPath: m_Name
      value: LimbSplash (1)
      objectReference: {fileID: 0}
    - target: {fileID: 1451251566983760214, guid: a94dadcf0d5e72549951bcfb815291df, type: 3}
      propertyPath: m_Layer
      value: 11
      objectReference: {fileID: 0}
    - target: {fileID: 1710545952963039871, guid: a94dadcf0d5e72549951bcfb815291df, type: 3}
      propertyPath: EmissionModule.rateOverTime.scalar
      value: 10
      objectReference: {fileID: 0}
    m_RemovedComponents: []
  m_SourcePrefab: {fileID: 100100000, guid: a94dadcf0d5e72549951bcfb815291df, type: 3}
--- !u!4 &8713799684702556503 stripped
Transform:
  m_CorrespondingSourceObject: {fileID: 1451251566983760213, guid: a94dadcf0d5e72549951bcfb815291df, type: 3}
  m_PrefabInstance: {fileID: 7840277914251728898}
  m_PrefabAsset: {fileID: 0}
