%YAML 1.1
%TAG !u! tag:unity3d.com,2011:
--- !u!1 &4975870337630229575
GameObject:
  m_ObjectHideFlags: 0
  m_CorrespondingSourceObject: {fileID: 0}
  m_PrefabInstance: {fileID: 0}
  m_PrefabAsset: {fileID: 0}
  serializedVersion: 6
  m_Component:
  - component: {fileID: 1489756212412799431}
  - component: {fileID: 8777529232303068997}
  m_Layer: 11
  m_Name: Collider
  m_TagString: Untagged
  m_Icon: {fileID: 0}
  m_NavMeshLayer: 0
  m_StaticEditorFlags: 0
  m_IsActive: 1
--- !u!4 &1489756212412799431
Transform:
  m_ObjectHideFlags: 0
  m_CorrespondingSourceObject: {fileID: 0}
  m_PrefabInstance: {fileID: 0}
  m_PrefabAsset: {fileID: 0}
  m_GameObject: {fileID: 4975870337630229575}
  m_LocalRotation: {x: -0.17276208, y: -0, z: -0, w: 0.9849636}
  m_LocalPosition: {x: 0, y: 0.292, z: -0.049}
  m_LocalScale: {x: 1, y: 1, z: 1}
  m_Children: []
  m_Father: {fileID: 4972767035252335272}
  m_RootOrder: 1
  m_LocalEulerAnglesHint: {x: -19.897, y: 0, z: 0}
--- !u!136 &8777529232303068997
CapsuleCollider:
  m_ObjectHideFlags: 0
  m_CorrespondingSourceObject: {fileID: 0}
  m_PrefabInstance: {fileID: 0}
  m_PrefabAsset: {fileID: 0}
  m_GameObject: {fileID: 4975870337630229575}
  m_Material: {fileID: 13400000, guid: df03573e2d29d39478d0062ba6541a84, type: 2}
  m_IsTrigger: 0
  m_Enabled: 1
  m_Radius: 0.16
  m_Height: 0.64
  m_Direction: 1
  m_Center: {x: 0, y: 0, z: 0}
--- !u!1 &5805627751316733135
GameObject:
  m_ObjectHideFlags: 0
  m_CorrespondingSourceObject: {fileID: 0}
  m_PrefabInstance: {fileID: 0}
  m_PrefabAsset: {fileID: 0}
  serializedVersion: 6
  m_Component:
  - component: {fileID: 2750109149319510952}
  - component: {fileID: 552877989648332772}
  - component: {fileID: 8794692707151131152}
  m_Layer: 11
  m_Name: HeadLimb
  m_TagString: Untagged
  m_Icon: {fileID: 0}
  m_NavMeshLayer: 0
  m_StaticEditorFlags: 0
  m_IsActive: 1
--- !u!4 &2750109149319510952
Transform:
  m_ObjectHideFlags: 0
  m_CorrespondingSourceObject: {fileID: 0}
  m_PrefabInstance: {fileID: 0}
  m_PrefabAsset: {fileID: 0}
  m_GameObject: {fileID: 5805627751316733135}
  m_LocalRotation: {x: 0, y: 0, z: 0, w: 1}
  m_LocalPosition: {x: 0, y: 0, z: 0}
  m_LocalScale: {x: 1, y: 1, z: 1}
  m_Children:
  - {fileID: 4972767035252335272}
  - {fileID: 828700673147907962}
  m_Father: {fileID: 0}
  m_RootOrder: 0
  m_LocalEulerAnglesHint: {x: 0, y: 0, z: 0}
--- !u!54 &552877989648332772
Rigidbody:
  m_ObjectHideFlags: 0
  m_CorrespondingSourceObject: {fileID: 0}
  m_PrefabInstance: {fileID: 0}
  m_PrefabAsset: {fileID: 0}
  m_GameObject: {fileID: 5805627751316733135}
  serializedVersion: 2
  m_Mass: 1
  m_Drag: 0
  m_AngularDrag: 0.05
  m_UseGravity: 1
  m_IsKinematic: 0
  m_Interpolate: 0
  m_Constraints: 0
  m_CollisionDetection: 0
--- !u!114 &8794692707151131152
MonoBehaviour:
  m_ObjectHideFlags: 0
  m_CorrespondingSourceObject: {fileID: 0}
  m_PrefabInstance: {fileID: 0}
  m_PrefabAsset: {fileID: 0}
  m_GameObject: {fileID: 5805627751316733135}
  m_Enabled: 1
  m_EditorHideFlags: 0
  m_Script: {fileID: 11500000, guid: 4485d519dafbfd24598e0610a694c3b0, type: 3}
  m_Name: 
  m_EditorClassIdentifier: 
  sounds: {fileID: 11400000, guid: 104c9ffb88a27eb4a85d40d9ee720fca, type: 2}
  sources: 1
  layers:
    serializedVersion: 2
    m_Bits: 4096
--- !u!1001 &2279880530282440239
PrefabInstance:
  m_ObjectHideFlags: 0
  serializedVersion: 2
  m_Modification:
    m_TransformParent: {fileID: 2750109149319510952}
    m_Modifications:
    - target: {fileID: 1451251566983760213, guid: a94dadcf0d5e72549951bcfb815291df, type: 3}
      propertyPath: m_LocalPosition.x
      value: 0
      objectReference: {fileID: 0}
    - target: {fileID: 1451251566983760213, guid: a94dadcf0d5e72549951bcfb815291df, type: 3}
      propertyPath: m_LocalPosition.y
      value: 0.07
      objectReference: {fileID: 0}
    - target: {fileID: 1451251566983760213, guid: a94dadcf0d5e72549951bcfb815291df, type: 3}
      propertyPath: m_LocalPosition.z
      value: 0.03
      objectReference: {fileID: 0}
    - target: {fileID: 1451251566983760213, guid: a94dadcf0d5e72549951bcfb815291df, type: 3}
      propertyPath: m_LocalRotation.x
      value: 0.7459314
      objectReference: {fileID: 0}
    - target: {fileID: 1451251566983760213, guid: a94dadcf0d5e72549951bcfb815291df, type: 3}
      propertyPath: m_LocalRotation.y
      value: -0
      objectReference: {fileID: 0}
    - target: {fileID: 1451251566983760213, guid: a94dadcf0d5e72549951bcfb815291df, type: 3}
      propertyPath: m_LocalRotation.z
      value: -0
      objectReference: {fileID: 0}
    - target: {fileID: 1451251566983760213, guid: a94dadcf0d5e72549951bcfb815291df, type: 3}
      propertyPath: m_LocalRotation.w
      value: 0.66602284
      objectReference: {fileID: 0}
    - target: {fileID: 1451251566983760213, guid: a94dadcf0d5e72549951bcfb815291df, type: 3}
      propertyPath: m_RootOrder
      value: 1
      objectReference: {fileID: 0}
    - target: {fileID: 1451251566983760213, guid: a94dadcf0d5e72549951bcfb815291df, type: 3}
      propertyPath: m_LocalEulerAnglesHint.x
      value: 96.478
      objectReference: {fileID: 0}
    - target: {fileID: 1451251566983760213, guid: a94dadcf0d5e72549951bcfb815291df, type: 3}
      propertyPath: m_LocalEulerAnglesHint.y
      value: 0
      objectReference: {fileID: 0}
    - target: {fileID: 1451251566983760213, guid: a94dadcf0d5e72549951bcfb815291df, type: 3}
      propertyPath: m_LocalEulerAnglesHint.z
      value: 0
      objectReference: {fileID: 0}
    - target: {fileID: 1451251566983760214, guid: a94dadcf0d5e72549951bcfb815291df, type: 3}
      propertyPath: m_Name
      value: LimbSplash
      objectReference: {fileID: 0}
    - target: {fileID: 1451251566983760214, guid: a94dadcf0d5e72549951bcfb815291df, type: 3}
      propertyPath: m_Layer
      value: 11
      objectReference: {fileID: 0}
    m_RemovedComponents: []
  m_SourcePrefab: {fileID: 100100000, guid: a94dadcf0d5e72549951bcfb815291df, type: 3}
--- !u!4 &828700673147907962 stripped
Transform:
  m_CorrespondingSourceObject: {fileID: 1451251566983760213, guid: a94dadcf0d5e72549951bcfb815291df, type: 3}
  m_PrefabInstance: {fileID: 2279880530282440239}
  m_PrefabAsset: {fileID: 0}
--- !u!1001 &4794196397094176067
PrefabInstance:
  m_ObjectHideFlags: 0
  serializedVersion: 2
  m_Modification:
    m_TransformParent: {fileID: 2750109149319510952}
    m_Modifications:
    - target: {fileID: -8679921383154817045, guid: 24e3958968e6db24fab330394929c74a, type: 3}
      propertyPath: m_LocalPosition.x
      value: 0.001
      objectReference: {fileID: 0}
    - target: {fileID: -8679921383154817045, guid: 24e3958968e6db24fab330394929c74a, type: 3}
      propertyPath: m_LocalPosition.y
      value: -0.002
      objectReference: {fileID: 0}
    - target: {fileID: -8679921383154817045, guid: 24e3958968e6db24fab330394929c74a, type: 3}
      propertyPath: m_LocalPosition.z
      value: 0.022
      objectReference: {fileID: 0}
    - target: {fileID: -8679921383154817045, guid: 24e3958968e6db24fab330394929c74a, type: 3}
      propertyPath: m_LocalRotation.x
      value: -0.059571132
      objectReference: {fileID: 0}
    - target: {fileID: -8679921383154817045, guid: 24e3958968e6db24fab330394929c74a, type: 3}
      propertyPath: m_LocalRotation.y
      value: -0.1676511
      objectReference: {fileID: 0}
    - target: {fileID: -8679921383154817045, guid: 24e3958968e6db24fab330394929c74a, type: 3}
      propertyPath: m_LocalRotation.z
      value: 0.001396045
      objectReference: {fileID: 0}
    - target: {fileID: -8679921383154817045, guid: 24e3958968e6db24fab330394929c74a, type: 3}
      propertyPath: m_LocalRotation.w
      value: 0.98404396
      objectReference: {fileID: 0}
    - target: {fileID: -8679921383154817045, guid: 24e3958968e6db24fab330394929c74a, type: 3}
      propertyPath: m_RootOrder
      value: 0
      objectReference: {fileID: 0}
    - target: {fileID: -8679921383154817045, guid: 24e3958968e6db24fab330394929c74a, type: 3}
      propertyPath: m_LocalEulerAnglesHint.x
      value: -6.706
      objectReference: {fileID: 0}
    - target: {fileID: -8679921383154817045, guid: 24e3958968e6db24fab330394929c74a, type: 3}
      propertyPath: m_LocalEulerAnglesHint.y
      value: -19.414
      objectReference: {fileID: 0}
    - target: {fileID: -8679921383154817045, guid: 24e3958968e6db24fab330394929c74a, type: 3}
      propertyPath: m_LocalEulerAnglesHint.z
      value: 1.311
      objectReference: {fileID: 0}
    - target: {fileID: -8679921383154817045, guid: 24e3958968e6db24fab330394929c74a, type: 3}
      propertyPath: m_LocalScale.x
      value: 2
      objectReference: {fileID: 0}
    - target: {fileID: -8679921383154817045, guid: 24e3958968e6db24fab330394929c74a, type: 3}
      propertyPath: m_LocalScale.y
      value: 2
      objectReference: {fileID: 0}
    - target: {fileID: -8679921383154817045, guid: 24e3958968e6db24fab330394929c74a, type: 3}
      propertyPath: m_LocalScale.z
      value: 2
      objectReference: {fileID: 0}
    - target: {fileID: -7635826562936255635, guid: 24e3958968e6db24fab330394929c74a, type: 3}
      propertyPath: m_Materials.Array.data[0]
      value: 
      objectReference: {fileID: 2100000, guid: 7506813fb61409844bd887977ef17451, type: 2}
    - target: {fileID: 919132149155446097, guid: 24e3958968e6db24fab330394929c74a, type: 3}
      propertyPath: m_Name
      value: head
      objectReference: {fileID: 0}
    - target: {fileID: 919132149155446097, guid: 24e3958968e6db24fab330394929c74a, type: 3}
      propertyPath: m_Layer
      value: 11
      objectReference: {fileID: 0}
    - target: {fileID: 8164078558771037576, guid: 24e3958968e6db24fab330394929c74a, type: 3}
      propertyPath: m_Layer
      value: 11
      objectReference: {fileID: 0}
    m_RemovedComponents: []
  m_SourcePrefab: {fileID: 100100000, guid: 24e3958968e6db24fab330394929c74a, type: 3}
--- !u!4 &4972767035252335272 stripped
Transform:
  m_CorrespondingSourceObject: {fileID: -8679921383154817045, guid: 24e3958968e6db24fab330394929c74a, type: 3}
  m_PrefabInstance: {fileID: 4794196397094176067}
  m_PrefabAsset: {fileID: 0}
