%YAML 1.1
%TAG !u! tag:unity3d.com,2011:
--- !u!1 &3645599566667279732
GameObject:
  m_ObjectHideFlags: 0
  m_CorrespondingSourceObject: {fileID: 0}
  m_PrefabInstance: {fileID: 0}
  m_PrefabAsset: {fileID: 0}
  serializedVersion: 6
  m_Component:
  - component: {fileID: 4529697724912151705}
  - component: {fileID: 6194744032617373670}
  m_Layer: 11
  m_Name: LegRightLimb
  m_TagString: Untagged
  m_Icon: {fileID: 0}
  m_NavMeshLayer: 0
  m_StaticEditorFlags: 0
  m_IsActive: 1
--- !u!4 &4529697724912151705
Transform:
  m_ObjectHideFlags: 0
  m_CorrespondingSourceObject: {fileID: 0}
  m_PrefabInstance: {fileID: 0}
  m_PrefabAsset: {fileID: 0}
  m_GameObject: {fileID: 3645599566667279732}
  m_LocalRotation: {x: 0, y: 0, z: 0, w: 1}
  m_LocalPosition: {x: -20.34, y: 1, z: 4.01}
  m_LocalScale: {x: 1, y: 1, z: 1}
  m_Children:
  - {fileID: 3124209722866771789}
  - {fileID: 1942090561862603305}
  m_Father: {fileID: 0}
  m_RootOrder: 0
  m_LocalEulerAnglesHint: {x: 0, y: 0, z: 0}
--- !u!54 &6194744032617373670
Rigidbody:
  m_ObjectHideFlags: 0
  m_CorrespondingSourceObject: {fileID: 0}
  m_PrefabInstance: {fileID: 0}
  m_PrefabAsset: {fileID: 0}
  m_GameObject: {fileID: 3645599566667279732}
  serializedVersion: 2
  m_Mass: 1
  m_Drag: 0
  m_AngularDrag: 0.05
  m_UseGravity: 1
  m_IsKinematic: 0
  m_Interpolate: 0
  m_Constraints: 0
  m_CollisionDetection: 0
--- !u!64 &4172048212390467711
MeshCollider:
  m_ObjectHideFlags: 0
  m_CorrespondingSourceObject: {fileID: 0}
  m_PrefabInstance: {fileID: 0}
  m_PrefabAsset: {fileID: 0}
  m_GameObject: {fileID: 6745679193412502830}
  m_Material: {fileID: 13400000, guid: df03573e2d29d39478d0062ba6541a84, type: 2}
  m_IsTrigger: 0
  m_Enabled: 1
  serializedVersion: 4
  m_Convex: 1
  m_CookingOptions: 30
  m_Mesh: {fileID: -2432090755550338912, guid: c970e5ee147e6b447851940341c3be23, type: 3}
--- !u!1001 &2560052838506402261
PrefabInstance:
  m_ObjectHideFlags: 0
  serializedVersion: 2
  m_Modification:
    m_TransformParent: {fileID: 4529697724912151705}
    m_Modifications:
    - target: {fileID: 4140096056506582012, guid: affd2d96cc2b5cc4d8b1242c582e3c89, type: 3}
      propertyPath: m_LocalPosition.x
      value: -0.057
      objectReference: {fileID: 0}
    - target: {fileID: 4140096056506582012, guid: affd2d96cc2b5cc4d8b1242c582e3c89, type: 3}
      propertyPath: m_LocalPosition.y
      value: 0.002
      objectReference: {fileID: 0}
    - target: {fileID: 4140096056506582012, guid: affd2d96cc2b5cc4d8b1242c582e3c89, type: 3}
      propertyPath: m_LocalPosition.z
      value: 0.033
      objectReference: {fileID: 0}
    - target: {fileID: 4140096056506582012, guid: affd2d96cc2b5cc4d8b1242c582e3c89, type: 3}
      propertyPath: m_LocalRotation.x
      value: -0
      objectReference: {fileID: 0}
    - target: {fileID: 4140096056506582012, guid: affd2d96cc2b5cc4d8b1242c582e3c89, type: 3}
      propertyPath: m_LocalRotation.y
      value: 0.7365301
      objectReference: {fileID: 0}
    - target: {fileID: 4140096056506582012, guid: affd2d96cc2b5cc4d8b1242c582e3c89, type: 3}
      propertyPath: m_LocalRotation.z
      value: -0
      objectReference: {fileID: 0}
    - target: {fileID: 4140096056506582012, guid: affd2d96cc2b5cc4d8b1242c582e3c89, type: 3}
      propertyPath: m_LocalRotation.w
      value: 0.67640483
      objectReference: {fileID: 0}
    - target: {fileID: 4140096056506582012, guid: affd2d96cc2b5cc4d8b1242c582e3c89, type: 3}
      propertyPath: m_RootOrder
      value: 1
      objectReference: {fileID: 0}
    - target: {fileID: 4140096056506582012, guid: affd2d96cc2b5cc4d8b1242c582e3c89, type: 3}
      propertyPath: m_LocalEulerAnglesHint.x
      value: 0
      objectReference: {fileID: 0}
    - target: {fileID: 4140096056506582012, guid: affd2d96cc2b5cc4d8b1242c582e3c89, type: 3}
      propertyPath: m_LocalEulerAnglesHint.y
      value: 94.873
      objectReference: {fileID: 0}
    - target: {fileID: 4140096056506582012, guid: affd2d96cc2b5cc4d8b1242c582e3c89, type: 3}
      propertyPath: m_LocalEulerAnglesHint.z
      value: 0
      objectReference: {fileID: 0}
    - target: {fileID: 4140096056506582012, guid: affd2d96cc2b5cc4d8b1242c582e3c89, type: 3}
      propertyPath: m_LocalScale.x
      value: 1
      objectReference: {fileID: 0}
    - target: {fileID: 4140096056506582012, guid: affd2d96cc2b5cc4d8b1242c582e3c89, type: 3}
      propertyPath: m_LocalScale.y
      value: 1
      objectReference: {fileID: 0}
    - target: {fileID: 4140096056506582012, guid: affd2d96cc2b5cc4d8b1242c582e3c89, type: 3}
      propertyPath: m_LocalScale.z
      value: 1
      objectReference: {fileID: 0}
    - target: {fileID: 4140096056506582015, guid: affd2d96cc2b5cc4d8b1242c582e3c89, type: 3}
      propertyPath: m_Name
      value: CockLimbSplash Variant
      objectReference: {fileID: 0}
    - target: {fileID: 4245318345592789206, guid: affd2d96cc2b5cc4d8b1242c582e3c89, type: 3}
      propertyPath: ShapeModule.m_Scale.x
      value: 0.05
      objectReference: {fileID: 0}
    - target: {fileID: 4245318345592789206, guid: affd2d96cc2b5cc4d8b1242c582e3c89, type: 3}
      propertyPath: ShapeModule.m_Scale.y
      value: 0.05
      objectReference: {fileID: 0}
    - target: {fileID: 4245318345592789206, guid: affd2d96cc2b5cc4d8b1242c582e3c89, type: 3}
      propertyPath: ShapeModule.m_Scale.z
      value: 0.05
      objectReference: {fileID: 0}
    - target: {fileID: 4245318345592789206, guid: affd2d96cc2b5cc4d8b1242c582e3c89, type: 3}
      propertyPath: EmissionModule.rateOverTime.scalar
      value: 10
      objectReference: {fileID: 0}
    m_RemovedComponents: []
  m_SourcePrefab: {fileID: 100100000, guid: affd2d96cc2b5cc4d8b1242c582e3c89, type: 3}
--- !u!4 &1942090561862603305 stripped
Transform:
  m_CorrespondingSourceObject: {fileID: 4140096056506582012, guid: affd2d96cc2b5cc4d8b1242c582e3c89, type: 3}
  m_PrefabInstance: {fileID: 2560052838506402261}
  m_PrefabAsset: {fileID: 0}
--- !u!1001 &3229596938013163686
PrefabInstance:
  m_ObjectHideFlags: 0
  serializedVersion: 2
  m_Modification:
    m_TransformParent: {fileID: 4529697724912151705}
    m_Modifications:
    - target: {fileID: -8679921383154817045, guid: c970e5ee147e6b447851940341c3be23, type: 3}
      propertyPath: m_LocalPosition.x
      value: 0
      objectReference: {fileID: 0}
    - target: {fileID: -8679921383154817045, guid: c970e5ee147e6b447851940341c3be23, type: 3}
      propertyPath: m_LocalPosition.y
      value: 0
      objectReference: {fileID: 0}
    - target: {fileID: -8679921383154817045, guid: c970e5ee147e6b447851940341c3be23, type: 3}
      propertyPath: m_LocalPosition.z
      value: 0
      objectReference: {fileID: 0}
    - target: {fileID: -8679921383154817045, guid: c970e5ee147e6b447851940341c3be23, type: 3}
      propertyPath: m_LocalRotation.x
      value: 0.055130668
      objectReference: {fileID: 0}
    - target: {fileID: -8679921383154817045, guid: c970e5ee147e6b447851940341c3be23, type: 3}
      propertyPath: m_LocalRotation.y
      value: -0.99300534
      objectReference: {fileID: 0}
    - target: {fileID: -8679921383154817045, guid: c970e5ee147e6b447851940341c3be23, type: 3}
      propertyPath: m_LocalRotation.z
      value: 0.003602058
      objectReference: {fileID: 0}
    - target: {fileID: -8679921383154817045, guid: c970e5ee147e6b447851940341c3be23, type: 3}
      propertyPath: m_LocalRotation.w
      value: 0.10434576
      objectReference: {fileID: 0}
    - target: {fileID: -8679921383154817045, guid: c970e5ee147e6b447851940341c3be23, type: 3}
      propertyPath: m_RootOrder
      value: 0
      objectReference: {fileID: 0}
    - target: {fileID: -8679921383154817045, guid: c970e5ee147e6b447851940341c3be23, type: 3}
      propertyPath: m_LocalEulerAnglesHint.x
      value: 0
      objectReference: {fileID: 0}
    - target: {fileID: -8679921383154817045, guid: c970e5ee147e6b447851940341c3be23, type: 3}
      propertyPath: m_LocalEulerAnglesHint.y
      value: 0
      objectReference: {fileID: 0}
    - target: {fileID: -8679921383154817045, guid: c970e5ee147e6b447851940341c3be23, type: 3}
      propertyPath: m_LocalEulerAnglesHint.z
      value: 0
      objectReference: {fileID: 0}
    - target: {fileID: -8679921383154817045, guid: c970e5ee147e6b447851940341c3be23, type: 3}
      propertyPath: m_LocalScale.x
      value: 2
      objectReference: {fileID: 0}
    - target: {fileID: -8679921383154817045, guid: c970e5ee147e6b447851940341c3be23, type: 3}
      propertyPath: m_LocalScale.y
      value: 2
      objectReference: {fileID: 0}
    - target: {fileID: -8679921383154817045, guid: c970e5ee147e6b447851940341c3be23, type: 3}
      propertyPath: m_LocalScale.z
      value: 2
      objectReference: {fileID: 0}
    - target: {fileID: -7635826562936255635, guid: c970e5ee147e6b447851940341c3be23, type: 3}
      propertyPath: m_Materials.Array.data[0]
      value: 
      objectReference: {fileID: 2100000, guid: 01df1565cc2bf384f83a564c5cb01615, type: 2}
    - target: {fileID: 919132149155446097, guid: c970e5ee147e6b447851940341c3be23, type: 3}
      propertyPath: m_Name
      value: leg_right
      objectReference: {fileID: 0}
    - target: {fileID: 919132149155446097, guid: c970e5ee147e6b447851940341c3be23, type: 3}
      propertyPath: m_Layer
      value: 11
      objectReference: {fileID: 0}
    - target: {fileID: 8164078558771037576, guid: c970e5ee147e6b447851940341c3be23, type: 3}
      propertyPath: m_Layer
      value: 11
      objectReference: {fileID: 0}
    m_RemovedComponents: []
  m_SourcePrefab: {fileID: 100100000, guid: c970e5ee147e6b447851940341c3be23, type: 3}
--- !u!4 &3124209722866771789 stripped
Transform:
  m_CorrespondingSourceObject: {fileID: -8679921383154817045, guid: c970e5ee147e6b447851940341c3be23, type: 3}
  m_PrefabInstance: {fileID: 3229596938013163686}
  m_PrefabAsset: {fileID: 0}
--- !u!1 &6745679193412502830 stripped
GameObject:
  m_CorrespondingSourceObject: {fileID: 8164078558771037576, guid: c970e5ee147e6b447851940341c3be23, type: 3}
  m_PrefabInstance: {fileID: 3229596938013163686}
  m_PrefabAsset: {fileID: 0}
