%YAML 1.1
%TAG !u! tag:unity3d.com,2011:
--- !u!1 &1943366193568904315
GameObject:
  m_ObjectHideFlags: 0
  m_CorrespondingSourceObject: {fileID: 0}
  m_PrefabInstance: {fileID: 0}
  m_PrefabAsset: {fileID: 0}
  serializedVersion: 6
  m_Component:
  - component: {fileID: 8941222021018277761}
  - component: {fileID: 8059422875964800331}
  m_Layer: 11
  m_Name: GameObject
  m_TagString: Untagged
  m_Icon: {fileID: 0}
  m_NavMeshLayer: 0
  m_StaticEditorFlags: 0
  m_IsActive: 1
--- !u!4 &8941222021018277761
Transform:
  m_ObjectHideFlags: 0
  m_CorrespondingSourceObject: {fileID: 0}
  m_PrefabInstance: {fileID: 0}
  m_PrefabAsset: {fileID: 0}
  m_GameObject: {fileID: 1943366193568904315}
  m_LocalRotation: {x: -0.007942115, y: 0.0039276755, z: -0.0219564, w: 0.99971974}
  m_LocalPosition: {x: 0, y: 0, z: 0}
  m_LocalScale: {x: 1, y: 1, z: 1}
  m_Children: []
  m_Father: {fileID: 3334074297194330704}
  m_RootOrder: 1
  m_LocalEulerAnglesHint: {x: -0.9, y: 0.47, z: -2.52}
--- !u!136 &8059422875964800331
CapsuleCollider:
  m_ObjectHideFlags: 0
  m_CorrespondingSourceObject: {fileID: 0}
  m_PrefabInstance: {fileID: 0}
  m_PrefabAsset: {fileID: 0}
  m_GameObject: {fileID: 1943366193568904315}
  m_Material: {fileID: 13400000, guid: df03573e2d29d39478d0062ba6541a84, type: 2}
  m_IsTrigger: 0
  m_Enabled: 1
  m_Radius: 0.06
  m_Height: 0.59
  m_Direction: 1
  m_Center: {x: -0.01, y: -0.29, z: 0.02}
--- !u!135 &8554526986928240291
SphereCollider:
  m_ObjectHideFlags: 0
  m_CorrespondingSourceObject: {fileID: 0}
  m_PrefabInstance: {fileID: 0}
  m_PrefabAsset: {fileID: 0}
  m_GameObject: {fileID: 2670302818605687018}
  m_Material: {fileID: 13400000, guid: df03573e2d29d39478d0062ba6541a84, type: 2}
  m_IsTrigger: 0
  m_Enabled: 1
  serializedVersion: 2
  m_Radius: 0.04
  m_Center: {x: -0.05, y: -0.545, z: 0.14}
--- !u!1 &6972322813272288736
GameObject:
  m_ObjectHideFlags: 0
  m_CorrespondingSourceObject: {fileID: 0}
  m_PrefabInstance: {fileID: 0}
  m_PrefabAsset: {fileID: 0}
  serializedVersion: 6
  m_Component:
  - component: {fileID: 3798048962273191360}
  - component: {fileID: 495589474199560367}
  - component: {fileID: -8947015317861729453}
  m_Layer: 11
  m_Name: LegLeftLimb
  m_TagString: Untagged
  m_Icon: {fileID: 0}
  m_NavMeshLayer: 0
  m_StaticEditorFlags: 0
  m_IsActive: 1
--- !u!4 &3798048962273191360
Transform:
  m_ObjectHideFlags: 0
  m_CorrespondingSourceObject: {fileID: 0}
  m_PrefabInstance: {fileID: 0}
  m_PrefabAsset: {fileID: 0}
  m_GameObject: {fileID: 6972322813272288736}
  m_LocalRotation: {x: 0, y: 0, z: 0, w: 1}
  m_LocalPosition: {x: 0, y: 0.87, z: 0}
  m_LocalScale: {x: 1, y: 1, z: 1}
  m_Children:
  - {fileID: 3334074297194330704}
  - {fileID: 1893193313163028715}
  m_Father: {fileID: 0}
  m_RootOrder: 0
  m_LocalEulerAnglesHint: {x: 0, y: 0, z: 0}
--- !u!54 &495589474199560367
Rigidbody:
  m_ObjectHideFlags: 0
  m_CorrespondingSourceObject: {fileID: 0}
  m_PrefabInstance: {fileID: 0}
  m_PrefabAsset: {fileID: 0}
  m_GameObject: {fileID: 6972322813272288736}
  serializedVersion: 2
  m_Mass: 1
  m_Drag: 0
  m_AngularDrag: 0.05
  m_UseGravity: 1
  m_IsKinematic: 0
  m_Interpolate: 0
  m_Constraints: 0
  m_CollisionDetection: 0
--- !u!114 &-8947015317861729453
MonoBehaviour:
  m_ObjectHideFlags: 0
  m_CorrespondingSourceObject: {fileID: 0}
  m_PrefabInstance: {fileID: 0}
  m_PrefabAsset: {fileID: 0}
  m_GameObject: {fileID: 6972322813272288736}
  m_Enabled: 1
  m_EditorHideFlags: 0
  m_Script: {fileID: 11500000, guid: 4485d519dafbfd24598e0610a694c3b0, type: 3}
  m_Name: 
  m_EditorClassIdentifier: 
  sounds: {fileID: 11400000, guid: 104c9ffb88a27eb4a85d40d9ee720fca, type: 2}
  sources: 1
  layers:
    serializedVersion: 2
    m_Bits: 4096
--- !u!1001 &1037544070952640958
PrefabInstance:
  m_ObjectHideFlags: 0
  serializedVersion: 2
  m_Modification:
    m_TransformParent: {fileID: 3798048962273191360}
    m_Modifications:
    - target: {fileID: 1451251566983760213, guid: a94dadcf0d5e72549951bcfb815291df, type: 3}
      propertyPath: m_LocalPosition.x
      value: 0.032
      objectReference: {fileID: 0}
    - target: {fileID: 1451251566983760213, guid: a94dadcf0d5e72549951bcfb815291df, type: 3}
      propertyPath: m_LocalPosition.y
      value: 0.085
      objectReference: {fileID: 0}
    - target: {fileID: 1451251566983760213, guid: a94dadcf0d5e72549951bcfb815291df, type: 3}
      propertyPath: m_LocalPosition.z
      value: 0.111
      objectReference: {fileID: 0}
    - target: {fileID: 1451251566983760213, guid: a94dadcf0d5e72549951bcfb815291df, type: 3}
      propertyPath: m_LocalRotation.x
      value: 0.5163326
      objectReference: {fileID: 0}
    - target: {fileID: 1451251566983760213, guid: a94dadcf0d5e72549951bcfb815291df, type: 3}
      propertyPath: m_LocalRotation.y
      value: 0.48434973
      objectReference: {fileID: 0}
    - target: {fileID: 1451251566983760213, guid: a94dadcf0d5e72549951bcfb815291df, type: 3}
      propertyPath: m_LocalRotation.z
      value: -0.51508236
      objectReference: {fileID: 0}
    - target: {fileID: 1451251566983760213, guid: a94dadcf0d5e72549951bcfb815291df, type: 3}
      propertyPath: m_LocalRotation.w
      value: 0.4832143
      objectReference: {fileID: 0}
    - target: {fileID: 1451251566983760213, guid: a94dadcf0d5e72549951bcfb815291df, type: 3}
      propertyPath: m_RootOrder
      value: 1
      objectReference: {fileID: 0}
    - target: {fileID: 1451251566983760213, guid: a94dadcf0d5e72549951bcfb815291df, type: 3}
      propertyPath: m_LocalEulerAnglesHint.x
      value: 93.66199
      objectReference: {fileID: 0}
    - target: {fileID: 1451251566983760213, guid: a94dadcf0d5e72549951bcfb815291df, type: 3}
      propertyPath: m_LocalEulerAnglesHint.y
      value: 87.857
      objectReference: {fileID: 0}
    - target: {fileID: 1451251566983760213, guid: a94dadcf0d5e72549951bcfb815291df, type: 3}
      propertyPath: m_LocalEulerAnglesHint.z
      value: -2.1359863
      objectReference: {fileID: 0}
    - target: {fileID: 1451251566983760214, guid: a94dadcf0d5e72549951bcfb815291df, type: 3}
      propertyPath: m_Name
      value: LimbSplash
      objectReference: {fileID: 0}
    - target: {fileID: 1710545952963039871, guid: a94dadcf0d5e72549951bcfb815291df, type: 3}
      propertyPath: EmissionModule.rateOverTime.scalar
      value: 10
      objectReference: {fileID: 0}
    m_RemovedComponents: []
  m_SourcePrefab: {fileID: 100100000, guid: a94dadcf0d5e72549951bcfb815291df, type: 3}
--- !u!4 &1893193313163028715 stripped
Transform:
  m_CorrespondingSourceObject: {fileID: 1451251566983760213, guid: a94dadcf0d5e72549951bcfb815291df, type: 3}
  m_PrefabInstance: {fileID: 1037544070952640958}
  m_PrefabAsset: {fileID: 0}
--- !u!1001 &3012832928212868539
PrefabInstance:
  m_ObjectHideFlags: 0
  serializedVersion: 2
  m_Modification:
    m_TransformParent: {fileID: 3798048962273191360}
    m_Modifications:
    - target: {fileID: -8679921383154817045, guid: 1927158e5e408ba419f96a734d63bb6f, type: 3}
      propertyPath: m_LocalPosition.x
      value: -0
      objectReference: {fileID: 0}
    - target: {fileID: -8679921383154817045, guid: 1927158e5e408ba419f96a734d63bb6f, type: 3}
      propertyPath: m_LocalPosition.y
      value: 0
      objectReference: {fileID: 0}
    - target: {fileID: -8679921383154817045, guid: 1927158e5e408ba419f96a734d63bb6f, type: 3}
      propertyPath: m_LocalPosition.z
      value: 0
      objectReference: {fileID: 0}
    - target: {fileID: -8679921383154817045, guid: 1927158e5e408ba419f96a734d63bb6f, type: 3}
      propertyPath: m_LocalRotation.x
      value: 0.09949903
      objectReference: {fileID: 0}
    - target: {fileID: -8679921383154817045, guid: 1927158e5e408ba419f96a734d63bb6f, type: 3}
      propertyPath: m_LocalRotation.y
      value: -0.090320796
      objectReference: {fileID: 0}
    - target: {fileID: -8679921383154817045, guid: 1927158e5e408ba419f96a734d63bb6f, type: 3}
      propertyPath: m_LocalRotation.z
      value: -0.9909296
      objectReference: {fileID: 0}
    - target: {fileID: -8679921383154817045, guid: 1927158e5e408ba419f96a734d63bb6f, type: 3}
      propertyPath: m_LocalRotation.w
      value: -0.00081815186
      objectReference: {fileID: 0}
    - target: {fileID: -8679921383154817045, guid: 1927158e5e408ba419f96a734d63bb6f, type: 3}
      propertyPath: m_RootOrder
      value: 0
      objectReference: {fileID: 0}
    - target: {fileID: -8679921383154817045, guid: 1927158e5e408ba419f96a734d63bb6f, type: 3}
      propertyPath: m_LocalEulerAnglesHint.x
      value: -10.321
      objectReference: {fileID: 0}
    - target: {fileID: -8679921383154817045, guid: 1927158e5e408ba419f96a734d63bb6f, type: 3}
      propertyPath: m_LocalEulerAnglesHint.y
      value: -11.554
      objectReference: {fileID: 0}
    - target: {fileID: -8679921383154817045, guid: 1927158e5e408ba419f96a734d63bb6f, type: 3}
      propertyPath: m_LocalEulerAnglesHint.z
      value: -179.048
      objectReference: {fileID: 0}
    - target: {fileID: -8679921383154817045, guid: 1927158e5e408ba419f96a734d63bb6f, type: 3}
      propertyPath: m_LocalScale.x
      value: 2
      objectReference: {fileID: 0}
    - target: {fileID: -8679921383154817045, guid: 1927158e5e408ba419f96a734d63bb6f, type: 3}
      propertyPath: m_LocalScale.y
      value: 2
      objectReference: {fileID: 0}
    - target: {fileID: -8679921383154817045, guid: 1927158e5e408ba419f96a734d63bb6f, type: 3}
      propertyPath: m_LocalScale.z
      value: 2
      objectReference: {fileID: 0}
    - target: {fileID: -7635826562936255635, guid: 1927158e5e408ba419f96a734d63bb6f, type: 3}
      propertyPath: m_Materials.Array.data[0]
      value: 
      objectReference: {fileID: 2100000, guid: 1c02ce963c27cbc4cbed24e4dbba81e5, type: 2}
    - target: {fileID: 919132149155446097, guid: 1927158e5e408ba419f96a734d63bb6f, type: 3}
      propertyPath: m_Name
      value: left_leg
      objectReference: {fileID: 0}
    - target: {fileID: 919132149155446097, guid: 1927158e5e408ba419f96a734d63bb6f, type: 3}
      propertyPath: m_Layer
      value: 11
      objectReference: {fileID: 0}
    - target: {fileID: 8164078558771037576, guid: 1927158e5e408ba419f96a734d63bb6f, type: 3}
      propertyPath: m_Layer
      value: 11
      objectReference: {fileID: 0}
    m_RemovedComponents: []
  m_SourcePrefab: {fileID: 100100000, guid: 1927158e5e408ba419f96a734d63bb6f, type: 3}
--- !u!1 &2670302818605687018 stripped
GameObject:
  m_CorrespondingSourceObject: {fileID: 919132149155446097, guid: 1927158e5e408ba419f96a734d63bb6f, type: 3}
  m_PrefabInstance: {fileID: 3012832928212868539}
  m_PrefabAsset: {fileID: 0}
--- !u!4 &3334074297194330704 stripped
Transform:
  m_CorrespondingSourceObject: {fileID: -8679921383154817045, guid: 1927158e5e408ba419f96a734d63bb6f, type: 3}
  m_PrefabInstance: {fileID: 3012832928212868539}
  m_PrefabAsset: {fileID: 0}
