%YAML 1.1
%TAG !u! tag:unity3d.com,2011:
--- !u!1 &7096006588066099925
GameObject:
  m_ObjectHideFlags: 0
  m_CorrespondingSourceObject: {fileID: 0}
  m_PrefabInstance: {fileID: 0}
  m_PrefabAsset: {fileID: 0}
  serializedVersion: 6
  m_Component:
  - component: {fileID: 8731303109725723450}
  - component: {fileID: 5412448573446596257}
  m_Layer: 11
  m_Name: LegLeftLimb
  m_TagString: Untagged
  m_Icon: {fileID: 0}
  m_NavMeshLayer: 0
  m_StaticEditorFlags: 0
  m_IsActive: 1
--- !u!4 &8731303109725723450
Transform:
  m_ObjectHideFlags: 0
  m_CorrespondingSourceObject: {fileID: 0}
  m_PrefabInstance: {fileID: 0}
  m_PrefabAsset: {fileID: 0}
  m_GameObject: {fileID: 7096006588066099925}
  m_LocalRotation: {x: 0, y: 0, z: 0, w: 1}
  m_LocalPosition: {x: -20.34, y: 1, z: 4.01}
  m_LocalScale: {x: 1, y: 1, z: 1}
  m_Children:
  - {fileID: 1017847536010989704}
  - {fileID: 1922631649219976711}
  m_Father: {fileID: 0}
  m_RootOrder: 0
  m_LocalEulerAnglesHint: {x: 0, y: 0, z: 0}
--- !u!54 &5412448573446596257
Rigidbody:
  m_ObjectHideFlags: 0
  m_CorrespondingSourceObject: {fileID: 0}
  m_PrefabInstance: {fileID: 0}
  m_PrefabAsset: {fileID: 0}
  m_GameObject: {fileID: 7096006588066099925}
  serializedVersion: 2
  m_Mass: 1
  m_Drag: 0
  m_AngularDrag: 0.05
  m_UseGravity: 1
  m_IsKinematic: 0
  m_Interpolate: 0
  m_Constraints: 0
  m_CollisionDetection: 0
--- !u!64 &4528792606288044747
MeshCollider:
  m_ObjectHideFlags: 0
  m_CorrespondingSourceObject: {fileID: 0}
  m_PrefabInstance: {fileID: 0}
  m_PrefabAsset: {fileID: 0}
  m_GameObject: {fileID: 7811656284465085540}
  m_Material: {fileID: 13400000, guid: df03573e2d29d39478d0062ba6541a84, type: 2}
  m_IsTrigger: 0
  m_Enabled: 1
  serializedVersion: 4
  m_Convex: 1
  m_CookingOptions: 30
  m_Mesh: {fileID: -2432090755550338912, guid: cb793ca08922dad4085c12516a4dbc30, type: 3}
--- !u!1001 &2099862910797052396
PrefabInstance:
  m_ObjectHideFlags: 0
  serializedVersion: 2
  m_Modification:
    m_TransformParent: {fileID: 8731303109725723450}
    m_Modifications:
    - target: {fileID: -8679921383154817045, guid: cb793ca08922dad4085c12516a4dbc30, type: 3}
      propertyPath: m_LocalPosition.x
      value: 0
      objectReference: {fileID: 0}
    - target: {fileID: -8679921383154817045, guid: cb793ca08922dad4085c12516a4dbc30, type: 3}
      propertyPath: m_LocalPosition.y
      value: 0
      objectReference: {fileID: 0}
    - target: {fileID: -8679921383154817045, guid: cb793ca08922dad4085c12516a4dbc30, type: 3}
      propertyPath: m_LocalPosition.z
      value: 0
      objectReference: {fileID: 0}
    - target: {fileID: -8679921383154817045, guid: cb793ca08922dad4085c12516a4dbc30, type: 3}
      propertyPath: m_LocalRotation.x
      value: 0
      objectReference: {fileID: 0}
    - target: {fileID: -8679921383154817045, guid: cb793ca08922dad4085c12516a4dbc30, type: 3}
      propertyPath: m_LocalRotation.y
      value: -0
      objectReference: {fileID: 0}
    - target: {fileID: -8679921383154817045, guid: cb793ca08922dad4085c12516a4dbc30, type: 3}
      propertyPath: m_LocalRotation.z
      value: 0.9973603
      objectReference: {fileID: 0}
    - target: {fileID: -8679921383154817045, guid: cb793ca08922dad4085c12516a4dbc30, type: 3}
      propertyPath: m_LocalRotation.w
      value: -0.072611555
      objectReference: {fileID: 0}
    - target: {fileID: -8679921383154817045, guid: cb793ca08922dad4085c12516a4dbc30, type: 3}
      propertyPath: m_RootOrder
      value: 1
      objectReference: {fileID: 0}
    - target: {fileID: -8679921383154817045, guid: cb793ca08922dad4085c12516a4dbc30, type: 3}
      propertyPath: m_LocalEulerAnglesHint.x
      value: 0
      objectReference: {fileID: 0}
    - target: {fileID: -8679921383154817045, guid: cb793ca08922dad4085c12516a4dbc30, type: 3}
      propertyPath: m_LocalEulerAnglesHint.y
      value: 0
      objectReference: {fileID: 0}
    - target: {fileID: -8679921383154817045, guid: cb793ca08922dad4085c12516a4dbc30, type: 3}
      propertyPath: m_LocalEulerAnglesHint.z
      value: 188.328
      objectReference: {fileID: 0}
    - target: {fileID: -8679921383154817045, guid: cb793ca08922dad4085c12516a4dbc30, type: 3}
      propertyPath: m_LocalScale.x
      value: 2
      objectReference: {fileID: 0}
    - target: {fileID: -8679921383154817045, guid: cb793ca08922dad4085c12516a4dbc30, type: 3}
      propertyPath: m_LocalScale.y
      value: 2
      objectReference: {fileID: 0}
    - target: {fileID: -8679921383154817045, guid: cb793ca08922dad4085c12516a4dbc30, type: 3}
      propertyPath: m_LocalScale.z
      value: 2
      objectReference: {fileID: 0}
    - target: {fileID: -7635826562936255635, guid: cb793ca08922dad4085c12516a4dbc30, type: 3}
      propertyPath: m_Materials.Array.data[0]
      value: 
      objectReference: {fileID: 2100000, guid: 01df1565cc2bf384f83a564c5cb01615, type: 2}
    - target: {fileID: 919132149155446097, guid: cb793ca08922dad4085c12516a4dbc30, type: 3}
      propertyPath: m_Name
      value: leg_left
      objectReference: {fileID: 0}
    - target: {fileID: 919132149155446097, guid: cb793ca08922dad4085c12516a4dbc30, type: 3}
      propertyPath: m_Layer
      value: 11
      objectReference: {fileID: 0}
    - target: {fileID: 8164078558771037576, guid: cb793ca08922dad4085c12516a4dbc30, type: 3}
      propertyPath: m_Layer
      value: 11
      objectReference: {fileID: 0}
    m_RemovedComponents: []
  m_SourcePrefab: {fileID: 100100000, guid: cb793ca08922dad4085c12516a4dbc30, type: 3}
--- !u!4 &1922631649219976711 stripped
Transform:
  m_CorrespondingSourceObject: {fileID: -8679921383154817045, guid: cb793ca08922dad4085c12516a4dbc30, type: 3}
  m_PrefabInstance: {fileID: 2099862910797052396}
  m_PrefabAsset: {fileID: 0}
--- !u!1 &7811656284465085540 stripped
GameObject:
  m_CorrespondingSourceObject: {fileID: 8164078558771037576, guid: cb793ca08922dad4085c12516a4dbc30, type: 3}
  m_PrefabInstance: {fileID: 2099862910797052396}
  m_PrefabAsset: {fileID: 0}
--- !u!1001 &3986967276978115444
PrefabInstance:
  m_ObjectHideFlags: 0
  serializedVersion: 2
  m_Modification:
    m_TransformParent: {fileID: 8731303109725723450}
    m_Modifications:
    - target: {fileID: 4140096056506582012, guid: affd2d96cc2b5cc4d8b1242c582e3c89, type: 3}
      propertyPath: m_LocalPosition.x
      value: 0.117
      objectReference: {fileID: 0}
    - target: {fileID: 4140096056506582012, guid: affd2d96cc2b5cc4d8b1242c582e3c89, type: 3}
      propertyPath: m_LocalPosition.y
      value: -0.025
      objectReference: {fileID: 0}
    - target: {fileID: 4140096056506582012, guid: affd2d96cc2b5cc4d8b1242c582e3c89, type: 3}
      propertyPath: m_LocalPosition.z
      value: 0.031
      objectReference: {fileID: 0}
    - target: {fileID: 4140096056506582012, guid: affd2d96cc2b5cc4d8b1242c582e3c89, type: 3}
      propertyPath: m_LocalRotation.x
      value: -0
      objectReference: {fileID: 0}
    - target: {fileID: 4140096056506582012, guid: affd2d96cc2b5cc4d8b1242c582e3c89, type: 3}
      propertyPath: m_LocalRotation.y
      value: -0.6849642
      objectReference: {fileID: 0}
    - target: {fileID: 4140096056506582012, guid: affd2d96cc2b5cc4d8b1242c582e3c89, type: 3}
      propertyPath: m_LocalRotation.z
      value: -0
      objectReference: {fileID: 0}
    - target: {fileID: 4140096056506582012, guid: affd2d96cc2b5cc4d8b1242c582e3c89, type: 3}
      propertyPath: m_LocalRotation.w
      value: 0.7285768
      objectReference: {fileID: 0}
    - target: {fileID: 4140096056506582012, guid: affd2d96cc2b5cc4d8b1242c582e3c89, type: 3}
      propertyPath: m_RootOrder
      value: 0
      objectReference: {fileID: 0}
    - target: {fileID: 4140096056506582012, guid: affd2d96cc2b5cc4d8b1242c582e3c89, type: 3}
      propertyPath: m_LocalEulerAnglesHint.x
      value: 0
      objectReference: {fileID: 0}
    - target: {fileID: 4140096056506582012, guid: affd2d96cc2b5cc4d8b1242c582e3c89, type: 3}
      propertyPath: m_LocalEulerAnglesHint.y
      value: -86.466
      objectReference: {fileID: 0}
    - target: {fileID: 4140096056506582012, guid: affd2d96cc2b5cc4d8b1242c582e3c89, type: 3}
      propertyPath: m_LocalEulerAnglesHint.z
      value: 0
      objectReference: {fileID: 0}
    - target: {fileID: 4140096056506582012, guid: affd2d96cc2b5cc4d8b1242c582e3c89, type: 3}
      propertyPath: m_LocalScale.x
      value: 1
      objectReference: {fileID: 0}
    - target: {fileID: 4140096056506582012, guid: affd2d96cc2b5cc4d8b1242c582e3c89, type: 3}
      propertyPath: m_LocalScale.y
      value: 1
      objectReference: {fileID: 0}
    - target: {fileID: 4140096056506582012, guid: affd2d96cc2b5cc4d8b1242c582e3c89, type: 3}
      propertyPath: m_LocalScale.z
      value: 1
      objectReference: {fileID: 0}
    - target: {fileID: 4140096056506582015, guid: affd2d96cc2b5cc4d8b1242c582e3c89, type: 3}
      propertyPath: m_Name
      value: CockLimbSplash Variant
      objectReference: {fileID: 0}
    - target: {fileID: 4245318345592789206, guid: affd2d96cc2b5cc4d8b1242c582e3c89, type: 3}
      propertyPath: ShapeModule.m_Scale.x
      value: 0.05
      objectReference: {fileID: 0}
    - target: {fileID: 4245318345592789206, guid: affd2d96cc2b5cc4d8b1242c582e3c89, type: 3}
      propertyPath: ShapeModule.m_Scale.y
      value: 0.05
      objectReference: {fileID: 0}
    - target: {fileID: 4245318345592789206, guid: affd2d96cc2b5cc4d8b1242c582e3c89, type: 3}
      propertyPath: ShapeModule.m_Scale.z
      value: 0.05
      objectReference: {fileID: 0}
    - target: {fileID: 4245318345592789206, guid: affd2d96cc2b5cc4d8b1242c582e3c89, type: 3}
      propertyPath: EmissionModule.rateOverTime.scalar
      value: 10
      objectReference: {fileID: 0}
    m_RemovedComponents: []
  m_SourcePrefab: {fileID: 100100000, guid: affd2d96cc2b5cc4d8b1242c582e3c89, type: 3}
--- !u!4 &1017847536010989704 stripped
Transform:
  m_CorrespondingSourceObject: {fileID: 4140096056506582012, guid: affd2d96cc2b5cc4d8b1242c582e3c89, type: 3}
  m_PrefabInstance: {fileID: 3986967276978115444}
  m_PrefabAsset: {fileID: 0}
