%YAML 1.1
%TAG !u! tag:unity3d.com,2011:
--- !u!1 &644575149294703578
GameObject:
  m_ObjectHideFlags: 0
  m_CorrespondingSourceObject: {fileID: 0}
  m_PrefabInstance: {fileID: 0}
  m_PrefabAsset: {fileID: 0}
  serializedVersion: 6
  m_Component:
  - component: {fileID: 5305301057873957986}
  - component: {fileID: 1337366656719948267}
  - component: {fileID: -3885469421751116470}
  m_Layer: 11
  m_Name: ArmRightLimb
  m_TagString: Untagged
  m_Icon: {fileID: 0}
  m_NavMeshLayer: 0
  m_StaticEditorFlags: 0
  m_IsActive: 1
--- !u!4 &5305301057873957986
Transform:
  m_ObjectHideFlags: 0
  m_CorrespondingSourceObject: {fileID: 0}
  m_PrefabInstance: {fileID: 0}
  m_PrefabAsset: {fileID: 0}
  m_GameObject: {fileID: 644575149294703578}
  m_LocalRotation: {x: 0, y: 0, z: 0, w: 1}
  m_LocalPosition: {x: 0, y: 0, z: 0}
  m_LocalScale: {x: 1, y: 1, z: 1}
  m_Children:
  - {fileID: 9178368750955947403}
  - {fileID: 5861817496311076646}
  m_Father: {fileID: 0}
  m_RootOrder: 0
  m_LocalEulerAnglesHint: {x: 0, y: 0, z: 0}
--- !u!54 &1337366656719948267
Rigidbody:
  m_ObjectHideFlags: 0
  m_CorrespondingSourceObject: {fileID: 0}
  m_PrefabInstance: {fileID: 0}
  m_PrefabAsset: {fileID: 0}
  m_GameObject: {fileID: 644575149294703578}
  serializedVersion: 2
  m_Mass: 1
  m_Drag: 0
  m_AngularDrag: 0.05
  m_UseGravity: 1
  m_IsKinematic: 0
  m_Interpolate: 0
  m_Constraints: 0
  m_CollisionDetection: 0
--- !u!114 &-3885469421751116470
MonoBehaviour:
  m_ObjectHideFlags: 0
  m_CorrespondingSourceObject: {fileID: 0}
  m_PrefabInstance: {fileID: 0}
  m_PrefabAsset: {fileID: 0}
  m_GameObject: {fileID: 644575149294703578}
  m_Enabled: 1
  m_EditorHideFlags: 0
  m_Script: {fileID: 11500000, guid: 4485d519dafbfd24598e0610a694c3b0, type: 3}
  m_Name: 
  m_EditorClassIdentifier: 
  sounds: {fileID: 11400000, guid: 104c9ffb88a27eb4a85d40d9ee720fca, type: 2}
  sources: 1
  layers:
    serializedVersion: 2
    m_Bits: 4096
--- !u!136 &3778248299810356708
CapsuleCollider:
  m_ObjectHideFlags: 0
  m_CorrespondingSourceObject: {fileID: 0}
  m_PrefabInstance: {fileID: 0}
  m_PrefabAsset: {fileID: 0}
  m_GameObject: {fileID: 8371009815513022257}
  m_Material: {fileID: 13400000, guid: df03573e2d29d39478d0062ba6541a84, type: 2}
  m_IsTrigger: 0
  m_Enabled: 1
  m_Radius: 0.04
  m_Height: 0.56
  m_Direction: 0
  m_Center: {x: 0.28, y: 0.02, z: 0}
--- !u!1001 &5006518895171952243
PrefabInstance:
  m_ObjectHideFlags: 0
  serializedVersion: 2
  m_Modification:
    m_TransformParent: {fileID: 5305301057873957986}
    m_Modifications:
    - target: {fileID: 1451251566983760213, guid: a94dadcf0d5e72549951bcfb815291df, type: 3}
      propertyPath: m_LocalPosition.x
      value: -0.025
      objectReference: {fileID: 0}
    - target: {fileID: 1451251566983760213, guid: a94dadcf0d5e72549951bcfb815291df, type: 3}
      propertyPath: m_LocalPosition.y
      value: 0.108
      objectReference: {fileID: 0}
    - target: {fileID: 1451251566983760213, guid: a94dadcf0d5e72549951bcfb815291df, type: 3}
      propertyPath: m_LocalPosition.z
      value: 0.111
      objectReference: {fileID: 0}
    - target: {fileID: 1451251566983760213, guid: a94dadcf0d5e72549951bcfb815291df, type: 3}
      propertyPath: m_LocalRotation.x
      value: 0.9269368
      objectReference: {fileID: 0}
    - target: {fileID: 1451251566983760213, guid: a94dadcf0d5e72549951bcfb815291df, type: 3}
      propertyPath: m_LocalRotation.y
      value: -0
      objectReference: {fileID: 0}
    - target: {fileID: 1451251566983760213, guid: a94dadcf0d5e72549951bcfb815291df, type: 3}
      propertyPath: m_LocalRotation.z
      value: -0
      objectReference: {fileID: 0}
    - target: {fileID: 1451251566983760213, guid: a94dadcf0d5e72549951bcfb815291df, type: 3}
      propertyPath: m_LocalRotation.w
      value: 0.37521753
      objectReference: {fileID: 0}
    - target: {fileID: 1451251566983760213, guid: a94dadcf0d5e72549951bcfb815291df, type: 3}
      propertyPath: m_RootOrder
      value: 1
      objectReference: {fileID: 0}
    - target: {fileID: 1451251566983760213, guid: a94dadcf0d5e72549951bcfb815291df, type: 3}
      propertyPath: m_LocalEulerAnglesHint.x
      value: 135.925
      objectReference: {fileID: 0}
    - target: {fileID: 1451251566983760213, guid: a94dadcf0d5e72549951bcfb815291df, type: 3}
      propertyPath: m_LocalEulerAnglesHint.y
      value: 0
      objectReference: {fileID: 0}
    - target: {fileID: 1451251566983760213, guid: a94dadcf0d5e72549951bcfb815291df, type: 3}
      propertyPath: m_LocalEulerAnglesHint.z
      value: 0
      objectReference: {fileID: 0}
    - target: {fileID: 1451251566983760214, guid: a94dadcf0d5e72549951bcfb815291df, type: 3}
      propertyPath: m_Name
      value: LimbSplash
      objectReference: {fileID: 0}
    m_RemovedComponents: []
  m_SourcePrefab: {fileID: 100100000, guid: a94dadcf0d5e72549951bcfb815291df, type: 3}
--- !u!4 &5861817496311076646 stripped
Transform:
  m_CorrespondingSourceObject: {fileID: 1451251566983760213, guid: a94dadcf0d5e72549951bcfb815291df, type: 3}
  m_PrefabInstance: {fileID: 5006518895171952243}
  m_PrefabAsset: {fileID: 0}
--- !u!1001 &8712957584463299168
PrefabInstance:
  m_ObjectHideFlags: 0
  serializedVersion: 2
  m_Modification:
    m_TransformParent: {fileID: 5305301057873957986}
    m_Modifications:
    - target: {fileID: -8679921383154817045, guid: c65d744554065904ba5e85b4755bf4ad, type: 3}
      propertyPath: m_LocalPosition.x
      value: 0
      objectReference: {fileID: 0}
    - target: {fileID: -8679921383154817045, guid: c65d744554065904ba5e85b4755bf4ad, type: 3}
      propertyPath: m_LocalPosition.y
      value: 0
      objectReference: {fileID: 0}
    - target: {fileID: -8679921383154817045, guid: c65d744554065904ba5e85b4755bf4ad, type: 3}
      propertyPath: m_LocalPosition.z
      value: 0
      objectReference: {fileID: 0}
    - target: {fileID: -8679921383154817045, guid: c65d744554065904ba5e85b4755bf4ad, type: 3}
      propertyPath: m_LocalRotation.x
      value: -0.14900604
      objectReference: {fileID: 0}
    - target: {fileID: -8679921383154817045, guid: c65d744554065904ba5e85b4755bf4ad, type: 3}
      propertyPath: m_LocalRotation.y
      value: -0.5833597
      objectReference: {fileID: 0}
    - target: {fileID: -8679921383154817045, guid: c65d744554065904ba5e85b4755bf4ad, type: 3}
      propertyPath: m_LocalRotation.z
      value: 0.38709396
      objectReference: {fileID: 0}
    - target: {fileID: -8679921383154817045, guid: c65d744554065904ba5e85b4755bf4ad, type: 3}
      propertyPath: m_LocalRotation.w
      value: 0.6983173
      objectReference: {fileID: 0}
    - target: {fileID: -8679921383154817045, guid: c65d744554065904ba5e85b4755bf4ad, type: 3}
      propertyPath: m_RootOrder
      value: 0
      objectReference: {fileID: 0}
    - target: {fileID: -8679921383154817045, guid: c65d744554065904ba5e85b4755bf4ad, type: 3}
      propertyPath: m_LocalEulerAnglesHint.x
      value: 14.095
      objectReference: {fileID: 0}
    - target: {fileID: -8679921383154817045, guid: c65d744554065904ba5e85b4755bf4ad, type: 3}
      propertyPath: m_LocalEulerAnglesHint.y
      value: -73.53
      objectReference: {fileID: 0}
    - target: {fileID: -8679921383154817045, guid: c65d744554065904ba5e85b4755bf4ad, type: 3}
      propertyPath: m_LocalEulerAnglesHint.z
      value: 47.447
      objectReference: {fileID: 0}
    - target: {fileID: -8679921383154817045, guid: c65d744554065904ba5e85b4755bf4ad, type: 3}
      propertyPath: m_LocalScale.x
      value: 2
      objectReference: {fileID: 0}
    - target: {fileID: -8679921383154817045, guid: c65d744554065904ba5e85b4755bf4ad, type: 3}
      propertyPath: m_LocalScale.y
      value: 2
      objectReference: {fileID: 0}
    - target: {fileID: -8679921383154817045, guid: c65d744554065904ba5e85b4755bf4ad, type: 3}
      propertyPath: m_LocalScale.z
      value: 2
      objectReference: {fileID: 0}
    - target: {fileID: -7635826562936255635, guid: c65d744554065904ba5e85b4755bf4ad, type: 3}
      propertyPath: m_Materials.Array.data[0]
      value: 
      objectReference: {fileID: 2100000, guid: 1c02ce963c27cbc4cbed24e4dbba81e5, type: 2}
    - target: {fileID: 919132149155446097, guid: c65d744554065904ba5e85b4755bf4ad, type: 3}
      propertyPath: m_Name
      value: arm_right
      objectReference: {fileID: 0}
    - target: {fileID: 919132149155446097, guid: c65d744554065904ba5e85b4755bf4ad, type: 3}
      propertyPath: m_Layer
      value: 11
      objectReference: {fileID: 0}
    - target: {fileID: 8164078558771037576, guid: c65d744554065904ba5e85b4755bf4ad, type: 3}
      propertyPath: m_Layer
      value: 11
      objectReference: {fileID: 0}
    m_RemovedComponents: []
  m_SourcePrefab: {fileID: 100100000, guid: c65d744554065904ba5e85b4755bf4ad, type: 3}
--- !u!1 &8371009815513022257 stripped
GameObject:
  m_CorrespondingSourceObject: {fileID: 919132149155446097, guid: c65d744554065904ba5e85b4755bf4ad, type: 3}
  m_PrefabInstance: {fileID: 8712957584463299168}
  m_PrefabAsset: {fileID: 0}
--- !u!4 &9178368750955947403 stripped
Transform:
  m_CorrespondingSourceObject: {fileID: -8679921383154817045, guid: c65d744554065904ba5e85b4755bf4ad, type: 3}
  m_PrefabInstance: {fileID: 8712957584463299168}
  m_PrefabAsset: {fileID: 0}
