%YAML 1.1
%TAG !u! tag:unity3d.com,2011:
--- !u!1 &4740474245967306059
GameObject:
  m_ObjectHideFlags: 0
  m_CorrespondingSourceObject: {fileID: 0}
  m_PrefabInstance: {fileID: 0}
  m_PrefabAsset: {fileID: 0}
  serializedVersion: 6
  m_Component:
  - component: {fileID: 3302762967559729750}
  - component: {fileID: 2239392998849926205}
  m_Layer: 31
  m_Name: BricksFixt
  m_TagString: Untagged
  m_Icon: {fileID: 0}
  m_NavMeshLayer: 0
  m_StaticEditorFlags: 0
  m_IsActive: 1
--- !u!4 &3302762967559729750
Transform:
  m_ObjectHideFlags: 0
  m_CorrespondingSourceObject: {fileID: 0}
  m_PrefabInstance: {fileID: 0}
  m_PrefabAsset: {fileID: 0}
  m_GameObject: {fileID: 4740474245967306059}
  m_LocalRotation: {x: 0, y: 0, z: 0, w: 1}
  m_LocalPosition: {x: 0, y: 0, z: 0}
  m_LocalScale: {x: 1, y: 1, z: 1}
  m_Children:
  - {fileID: 8284872978561776074}
  m_Father: {fileID: 0}
  m_RootOrder: 0
  m_LocalEulerAnglesHint: {x: 0, y: 0, z: 0}
--- !u!156049354 &2239392998849926205
Grid:
  m_ObjectHideFlags: 0
  m_CorrespondingSourceObject: {fileID: 0}
  m_PrefabInstance: {fileID: 0}
  m_PrefabAsset: {fileID: 0}
  m_GameObject: {fileID: 4740474245967306059}
  m_Enabled: 1
  m_CellSize: {x: 1, y: 1, z: 0}
  m_CellGap: {x: 0, y: 0, z: 0}
  m_CellLayout: 0
  m_CellSwizzle: 0
--- !u!1 &6021099215924150576
GameObject:
  m_ObjectHideFlags: 0
  m_CorrespondingSourceObject: {fileID: 0}
  m_PrefabInstance: {fileID: 0}
  m_PrefabAsset: {fileID: 0}
  serializedVersion: 6
  m_Component:
  - component: {fileID: 8284872978561776074}
  - component: {fileID: 1919601647919831714}
  - component: {fileID: 144621025497580525}
  m_Layer: 0
  m_Name: Layer1
  m_TagString: Untagged
  m_Icon: {fileID: 0}
  m_NavMeshLayer: 0
  m_StaticEditorFlags: 0
  m_IsActive: 1
--- !u!4 &8284872978561776074
Transform:
  m_ObjectHideFlags: 0
  m_CorrespondingSourceObject: {fileID: 0}
  m_PrefabInstance: {fileID: 0}
  m_PrefabAsset: {fileID: 0}
  m_GameObject: {fileID: 6021099215924150576}
  m_LocalRotation: {x: -0, y: -0, z: -0, w: 1}
  m_LocalPosition: {x: 0, y: 0, z: 0}
  m_LocalScale: {x: 1, y: 1, z: 1}
  m_Children: []
  m_Father: {fileID: 3302762967559729750}
  m_RootOrder: 0
  m_LocalEulerAnglesHint: {x: 0, y: 0, z: 0}
--- !u!1839735485 &1919601647919831714
Tilemap:
  m_ObjectHideFlags: 0
  m_CorrespondingSourceObject: {fileID: 0}
  m_PrefabInstance: {fileID: 0}
  m_PrefabAsset: {fileID: 0}
  m_GameObject: {fileID: 6021099215924150576}
  m_Enabled: 1
  m_Tiles:
  - first: {x: 2, y: -12, z: 0}
    second:
      serializedVersion: 2
      m_TileIndex: 96
      m_TileSpriteIndex: 96
      m_TileMatrixIndex: 0
      m_TileColorIndex: 0
      m_TileObjectToInstantiateIndex: 65535
      m_AllTileFlags: 1073741825
  - first: {x: 3, y: -12, z: 0}
    second:
      serializedVersion: 2
      m_TileIndex: 98
      m_TileSpriteIndex: 98
      m_TileMatrixIndex: 0
      m_TileColorIndex: 0
      m_TileObjectToInstantiateIndex: 65535
      m_AllTileFlags: 1073741825
  - first: {x: 4, y: -12, z: 0}
    second:
      serializedVersion: 2
      m_TileIndex: 97
      m_TileSpriteIndex: 97
      m_TileMatrixIndex: 0
      m_TileColorIndex: 0
      m_TileObjectToInstantiateIndex: 65535
      m_AllTileFlags: 1073741825
  - first: {x: 5, y: -12, z: 0}
    second:
      serializedVersion: 2
      m_TileIndex: 99
      m_TileSpriteIndex: 99
      m_TileMatrixIndex: 0
      m_TileColorIndex: 0
      m_TileObjectToInstantiateIndex: 65535
      m_AllTileFlags: 1073741825
  - first: {x: 2, y: -11, z: 0}
    second:
      serializedVersion: 2
      m_TileIndex: 92
      m_TileSpriteIndex: 95
      m_TileMatrixIndex: 0
      m_TileColorIndex: 0
      m_TileObjectToInstantiateIndex: 65535
      m_AllTileFlags: 1073741825
  - first: {x: 3, y: -11, z: 0}
    second:
      serializedVersion: 2
      m_TileIndex: 91
      m_TileSpriteIndex: 94
      m_TileMatrixIndex: 0
      m_TileColorIndex: 0
      m_TileObjectToInstantiateIndex: 65535
      m_AllTileFlags: 1073741825
  - first: {x: 4, y: -11, z: 0}
    second:
      serializedVersion: 2
      m_TileIndex: 95
      m_TileSpriteIndex: 93
      m_TileMatrixIndex: 0
      m_TileColorIndex: 0
      m_TileObjectToInstantiateIndex: 65535
      m_AllTileFlags: 1073741825
  - first: {x: 5, y: -11, z: 0}
    second:
      serializedVersion: 2
      m_TileIndex: 94
      m_TileSpriteIndex: 92
      m_TileMatrixIndex: 0
      m_TileColorIndex: 0
      m_TileObjectToInstantiateIndex: 65535
      m_AllTileFlags: 1073741825
  - first: {x: -3, y: -10, z: 0}
    second:
      serializedVersion: 2
      m_TileIndex: 78
      m_TileSpriteIndex: 78
      m_TileMatrixIndex: 0
      m_TileColorIndex: 0
      m_TileObjectToInstantiateIndex: 65535
      m_AllTileFlags: 1073741825
  - first: {x: -2, y: -10, z: 0}
    second:
      serializedVersion: 2
      m_TileIndex: 77
      m_TileSpriteIndex: 77
      m_TileMatrixIndex: 0
      m_TileColorIndex: 0
      m_TileObjectToInstantiateIndex: 65535
      m_AllTileFlags: 1073741825
  - first: {x: -1, y: -10, z: 0}
    second:
      serializedVersion: 2
      m_TileIndex: 76
      m_TileSpriteIndex: 76
      m_TileMatrixIndex: 0
      m_TileColorIndex: 0
      m_TileObjectToInstantiateIndex: 65535
      m_AllTileFlags: 1073741825
  - first: {x: 0, y: -10, z: 0}
    second:
      serializedVersion: 2
      m_TileIndex: 74
      m_TileSpriteIndex: 74
      m_TileMatrixIndex: 0
      m_TileColorIndex: 0
      m_TileObjectToInstantiateIndex: 65535
      m_AllTileFlags: 1073741825
  - first: {x: 1, y: -10, z: 0}
    second:
      serializedVersion: 2
      m_TileIndex: 68
      m_TileSpriteIndex: 68
      m_TileMatrixIndex: 0
      m_TileColorIndex: 0
      m_TileObjectToInstantiateIndex: 65535
      m_AllTileFlags: 1073741825
  - first: {x: 2, y: -10, z: 0}
    second:
      serializedVersion: 2
      m_TileIndex: 88
      m_TileSpriteIndex: 88
      m_TileMatrixIndex: 0
      m_TileColorIndex: 0
      m_TileObjectToInstantiateIndex: 65535
      m_AllTileFlags: 1073741825
  - first: {x: 3, y: -10, z: 0}
    second:
      serializedVersion: 2
      m_TileIndex: 89
      m_TileSpriteIndex: 89
      m_TileMatrixIndex: 0
      m_TileColorIndex: 0
      m_TileObjectToInstantiateIndex: 65535
      m_AllTileFlags: 1073741825
  - first: {x: 4, y: -10, z: 0}
    second:
      serializedVersion: 2
      m_TileIndex: 90
      m_TileSpriteIndex: 90
      m_TileMatrixIndex: 0
      m_TileColorIndex: 0
      m_TileObjectToInstantiateIndex: 65535
      m_AllTileFlags: 1073741825
  - first: {x: 5, y: -10, z: 0}
    second:
      serializedVersion: 2
      m_TileIndex: 93
      m_TileSpriteIndex: 91
      m_TileMatrixIndex: 0
      m_TileColorIndex: 0
      m_TileObjectToInstantiateIndex: 65535
      m_AllTileFlags: 1073741825
  - first: {x: -1, y: -9, z: 0}
    second:
      serializedVersion: 2
      m_TileIndex: 64
      m_TileSpriteIndex: 64
      m_TileMatrixIndex: 0
      m_TileColorIndex: 0
      m_TileObjectToInstantiateIndex: 65535
      m_AllTileFlags: 1073741825
  - first: {x: 2, y: -9, z: 0}
    second:
      serializedVersion: 2
      m_TileIndex: 75
      m_TileSpriteIndex: 75
      m_TileMatrixIndex: 0
      m_TileColorIndex: 0
      m_TileObjectToInstantiateIndex: 65535
      m_AllTileFlags: 1073741825
  - first: {x: 5, y: -9, z: 0}
    second:
      serializedVersion: 2
      m_TileIndex: 87
      m_TileSpriteIndex: 87
      m_TileMatrixIndex: 0
      m_TileColorIndex: 0
      m_TileObjectToInstantiateIndex: 65535
      m_AllTileFlags: 1073741825
  - first: {x: 6, y: -9, z: 0}
    second:
      serializedVersion: 2
      m_TileIndex: 86
      m_TileSpriteIndex: 86
      m_TileMatrixIndex: 0
      m_TileColorIndex: 0
      m_TileObjectToInstantiateIndex: 65535
      m_AllTileFlags: 1073741825
  - first: {x: 7, y: -9, z: 0}
    second:
      serializedVersion: 2
      m_TileIndex: 85
      m_TileSpriteIndex: 85
      m_TileMatrixIndex: 0
      m_TileColorIndex: 0
      m_TileObjectToInstantiateIndex: 65535
      m_AllTileFlags: 1073741825
  - first: {x: -2, y: -8, z: 0}
    second:
      serializedVersion: 2
      m_TileIndex: 63
      m_TileSpriteIndex: 63
      m_TileMatrixIndex: 0
      m_TileColorIndex: 0
      m_TileObjectToInstantiateIndex: 65535
      m_AllTileFlags: 1073741825
  - first: {x: 0, y: -8, z: 0}
    second:
      serializedVersion: 2
      m_TileIndex: 69
      m_TileSpriteIndex: 69
      m_TileMatrixIndex: 0
      m_TileColorIndex: 0
      m_TileObjectToInstantiateIndex: 65535
      m_AllTileFlags: 1073741825
  - first: {x: 1, y: -8, z: 0}
    second:
      serializedVersion: 2
      m_TileIndex: 70
      m_TileSpriteIndex: 70
      m_TileMatrixIndex: 0
      m_TileColorIndex: 0
      m_TileObjectToInstantiateIndex: 65535
      m_AllTileFlags: 1073741825
  - first: {x: 2, y: -8, z: 0}
    second:
      serializedVersion: 2
      m_TileIndex: 71
      m_TileSpriteIndex: 73
      m_TileMatrixIndex: 0
      m_TileColorIndex: 0
      m_TileObjectToInstantiateIndex: 65535
      m_AllTileFlags: 1073741825
  - first: {x: 3, y: -8, z: 0}
    second:
      serializedVersion: 2
      m_TileIndex: 73
      m_TileSpriteIndex: 72
      m_TileMatrixIndex: 0
      m_TileColorIndex: 0
      m_TileObjectToInstantiateIndex: 65535
      m_AllTileFlags: 1073741825
  - first: {x: 4, y: -8, z: 0}
    second:
      serializedVersion: 2
      m_TileIndex: 72
      m_TileSpriteIndex: 71
      m_TileMatrixIndex: 0
      m_TileColorIndex: 0
      m_TileObjectToInstantiateIndex: 65535
      m_AllTileFlags: 1073741825
  - first: {x: 5, y: -8, z: 0}
    second:
      serializedVersion: 2
      m_TileIndex: 84
      m_TileSpriteIndex: 84
      m_TileMatrixIndex: 0
      m_TileColorIndex: 0
      m_TileObjectToInstantiateIndex: 65535
      m_AllTileFlags: 1073741825
  - first: {x: 6, y: -8, z: 0}
    second:
      serializedVersion: 2
      m_TileIndex: 83
      m_TileSpriteIndex: 83
      m_TileMatrixIndex: 0
      m_TileColorIndex: 0
      m_TileObjectToInstantiateIndex: 65535
      m_AllTileFlags: 1073741825
  - first: {x: 7, y: -8, z: 0}
    second:
      serializedVersion: 2
      m_TileIndex: 82
      m_TileSpriteIndex: 82
      m_TileMatrixIndex: 0
      m_TileColorIndex: 0
      m_TileObjectToInstantiateIndex: 65535
      m_AllTileFlags: 1073741825
  - first: {x: -2, y: -7, z: 0}
    second:
      serializedVersion: 2
      m_TileIndex: 62
      m_TileSpriteIndex: 62
      m_TileMatrixIndex: 0
      m_TileColorIndex: 0
      m_TileObjectToInstantiateIndex: 65535
      m_AllTileFlags: 1073741825
  - first: {x: 1, y: -7, z: 0}
    second:
      serializedVersion: 2
      m_TileIndex: 67
      m_TileSpriteIndex: 67
      m_TileMatrixIndex: 0
      m_TileColorIndex: 0
      m_TileObjectToInstantiateIndex: 65535
      m_AllTileFlags: 1073741825
  - first: {x: 2, y: -7, z: 0}
    second:
      serializedVersion: 2
      m_TileIndex: 66
      m_TileSpriteIndex: 66
      m_TileMatrixIndex: 0
      m_TileColorIndex: 0
      m_TileObjectToInstantiateIndex: 65535
      m_AllTileFlags: 1073741825
  - first: {x: 3, y: -7, z: 0}
    second:
      serializedVersion: 2
      m_TileIndex: 65
      m_TileSpriteIndex: 65
      m_TileMatrixIndex: 0
      m_TileColorIndex: 0
      m_TileObjectToInstantiateIndex: 65535
      m_AllTileFlags: 1073741825
  - first: {x: 5, y: -7, z: 0}
    second:
      serializedVersion: 2
      m_TileIndex: 81
      m_TileSpriteIndex: 81
      m_TileMatrixIndex: 0
      m_TileColorIndex: 0
      m_TileObjectToInstantiateIndex: 65535
      m_AllTileFlags: 1073741825
  - first: {x: 6, y: -7, z: 0}
    second:
      serializedVersion: 2
      m_TileIndex: 80
      m_TileSpriteIndex: 80
      m_TileMatrixIndex: 0
      m_TileColorIndex: 0
      m_TileObjectToInstantiateIndex: 65535
      m_AllTileFlags: 1073741825
  - first: {x: 7, y: -7, z: 0}
    second:
      serializedVersion: 2
      m_TileIndex: 79
      m_TileSpriteIndex: 79
      m_TileMatrixIndex: 0
      m_TileColorIndex: 0
      m_TileObjectToInstantiateIndex: 65535
      m_AllTileFlags: 1073741825
  - first: {x: -2, y: -6, z: 0}
    second:
      serializedVersion: 2
      m_TileIndex: 60
      m_TileSpriteIndex: 60
      m_TileMatrixIndex: 0
      m_TileColorIndex: 0
      m_TileObjectToInstantiateIndex: 65535
      m_AllTileFlags: 1073741825
  - first: {x: -1, y: -6, z: 0}
    second:
      serializedVersion: 2
      m_TileIndex: 61
      m_TileSpriteIndex: 61
      m_TileMatrixIndex: 0
      m_TileColorIndex: 0
      m_TileObjectToInstantiateIndex: 65535
      m_AllTileFlags: 1073741825
  - first: {x: 1, y: -6, z: 0}
    second:
      serializedVersion: 2
      m_TileIndex: 58
      m_TileSpriteIndex: 58
      m_TileMatrixIndex: 0
      m_TileColorIndex: 0
      m_TileObjectToInstantiateIndex: 65535
      m_AllTileFlags: 1073741825
  - first: {x: 2, y: -6, z: 0}
    second:
      serializedVersion: 2
      m_TileIndex: 57
      m_TileSpriteIndex: 57
      m_TileMatrixIndex: 0
      m_TileColorIndex: 0
      m_TileObjectToInstantiateIndex: 65535
      m_AllTileFlags: 1073741825
  - first: {x: 3, y: -6, z: 0}
    second:
      serializedVersion: 2
      m_TileIndex: 56
      m_TileSpriteIndex: 56
      m_TileMatrixIndex: 0
      m_TileColorIndex: 0
      m_TileObjectToInstantiateIndex: 65535
      m_AllTileFlags: 1073741825
  - first: {x: 4, y: -6, z: 0}
    second:
      serializedVersion: 2
      m_TileIndex: 59
      m_TileSpriteIndex: 59
      m_TileMatrixIndex: 0
      m_TileColorIndex: 0
      m_TileObjectToInstantiateIndex: 65535
      m_AllTileFlags: 1073741825
  - first: {x: -2, y: -5, z: 0}
    second:
      serializedVersion: 2
      m_TileIndex: 49
      m_TileSpriteIndex: 49
      m_TileMatrixIndex: 0
      m_TileColorIndex: 0
      m_TileObjectToInstantiateIndex: 65535
      m_AllTileFlags: 1073741825
  - first: {x: -1, y: -5, z: 0}
    second:
      serializedVersion: 2
      m_TileIndex: 48
      m_TileSpriteIndex: 48
      m_TileMatrixIndex: 0
      m_TileColorIndex: 0
      m_TileObjectToInstantiateIndex: 65535
      m_AllTileFlags: 1073741825
  - first: {x: 0, y: -5, z: 0}
    second:
      serializedVersion: 2
      m_TileIndex: 47
      m_TileSpriteIndex: 47
      m_TileMatrixIndex: 0
      m_TileColorIndex: 0
      m_TileObjectToInstantiateIndex: 65535
      m_AllTileFlags: 1073741825
  - first: {x: 1, y: -5, z: 0}
    second:
      serializedVersion: 2
      m_TileIndex: 50
      m_TileSpriteIndex: 50
      m_TileMatrixIndex: 0
      m_TileColorIndex: 0
      m_TileObjectToInstantiateIndex: 65535
      m_AllTileFlags: 1073741825
  - first: {x: 2, y: -5, z: 0}
    second:
      serializedVersion: 2
      m_TileIndex: 51
      m_TileSpriteIndex: 51
      m_TileMatrixIndex: 0
      m_TileColorIndex: 0
      m_TileObjectToInstantiateIndex: 65535
      m_AllTileFlags: 1073741825
  - first: {x: 3, y: -5, z: 0}
    second:
      serializedVersion: 2
      m_TileIndex: 52
      m_TileSpriteIndex: 52
      m_TileMatrixIndex: 0
      m_TileColorIndex: 0
      m_TileObjectToInstantiateIndex: 65535
      m_AllTileFlags: 1073741825
  - first: {x: 4, y: -5, z: 0}
    second:
      serializedVersion: 2
      m_TileIndex: 55
      m_TileSpriteIndex: 55
      m_TileMatrixIndex: 0
      m_TileColorIndex: 0
      m_TileObjectToInstantiateIndex: 65535
      m_AllTileFlags: 1073741825
  - first: {x: 5, y: -5, z: 0}
    second:
      serializedVersion: 2
      m_TileIndex: 54
      m_TileSpriteIndex: 54
      m_TileMatrixIndex: 0
      m_TileColorIndex: 0
      m_TileObjectToInstantiateIndex: 65535
      m_AllTileFlags: 1073741825
  - first: {x: -2, y: -4, z: 0}
    second:
      serializedVersion: 2
      m_TileIndex: 30
      m_TileSpriteIndex: 31
      m_TileMatrixIndex: 0
      m_TileColorIndex: 0
      m_TileObjectToInstantiateIndex: 65535
      m_AllTileFlags: 1073741825
  - first: {x: -1, y: -4, z: 0}
    second:
      serializedVersion: 2
      m_TileIndex: 29
      m_TileSpriteIndex: 30
      m_TileMatrixIndex: 0
      m_TileColorIndex: 0
      m_TileObjectToInstantiateIndex: 65535
      m_AllTileFlags: 1073741825
  - first: {x: 0, y: -4, z: 0}
    second:
      serializedVersion: 2
      m_TileIndex: 45
      m_TileSpriteIndex: 45
      m_TileMatrixIndex: 0
      m_TileColorIndex: 0
      m_TileObjectToInstantiateIndex: 65535
      m_AllTileFlags: 1073741825
  - first: {x: 1, y: -4, z: 0}
    second:
      serializedVersion: 2
      m_TileIndex: 44
      m_TileSpriteIndex: 44
      m_TileMatrixIndex: 0
      m_TileColorIndex: 0
      m_TileObjectToInstantiateIndex: 65535
      m_AllTileFlags: 1073741825
  - first: {x: 2, y: -4, z: 0}
    second:
      serializedVersion: 2
      m_TileIndex: 43
      m_TileSpriteIndex: 43
      m_TileMatrixIndex: 0
      m_TileColorIndex: 0
      m_TileObjectToInstantiateIndex: 65535
      m_AllTileFlags: 1073741825
  - first: {x: 3, y: -4, z: 0}
    second:
      serializedVersion: 2
      m_TileIndex: 42
      m_TileSpriteIndex: 42
      m_TileMatrixIndex: 0
      m_TileColorIndex: 0
      m_TileObjectToInstantiateIndex: 65535
      m_AllTileFlags: 1073741825
  - first: {x: 4, y: -4, z: 0}
    second:
      serializedVersion: 2
      m_TileIndex: 41
      m_TileSpriteIndex: 41
      m_TileMatrixIndex: 0
      m_TileColorIndex: 0
      m_TileObjectToInstantiateIndex: 65535
      m_AllTileFlags: 1073741825
  - first: {x: 5, y: -4, z: 0}
    second:
      serializedVersion: 2
      m_TileIndex: 53
      m_TileSpriteIndex: 53
      m_TileMatrixIndex: 0
      m_TileColorIndex: 0
      m_TileObjectToInstantiateIndex: 65535
      m_AllTileFlags: 1073741825
  - first: {x: -2, y: -3, z: 0}
    second:
      serializedVersion: 2
      m_TileIndex: 24
      m_TileSpriteIndex: 29
      m_TileMatrixIndex: 0
      m_TileColorIndex: 0
      m_TileObjectToInstantiateIndex: 65535
      m_AllTileFlags: 1073741825
  - first: {x: -1, y: -3, z: 0}
    second:
      serializedVersion: 2
      m_TileIndex: 23
      m_TileSpriteIndex: 24
      m_TileMatrixIndex: 0
      m_TileColorIndex: 0
      m_TileObjectToInstantiateIndex: 65535
      m_AllTileFlags: 1073741825
  - first: {x: 0, y: -3, z: 0}
    second:
      serializedVersion: 2
      m_TileIndex: 39
      m_TileSpriteIndex: 39
      m_TileMatrixIndex: 0
      m_TileColorIndex: 0
      m_TileObjectToInstantiateIndex: 65535
      m_AllTileFlags: 1073741825
  - first: {x: 1, y: -3, z: 0}
    second:
      serializedVersion: 2
      m_TileIndex: 38
      m_TileSpriteIndex: 38
      m_TileMatrixIndex: 0
      m_TileColorIndex: 0
      m_TileObjectToInstantiateIndex: 65535
      m_AllTileFlags: 1073741825
  - first: {x: 2, y: -3, z: 0}
    second:
      serializedVersion: 2
      m_TileIndex: 37
      m_TileSpriteIndex: 37
      m_TileMatrixIndex: 0
      m_TileColorIndex: 0
      m_TileObjectToInstantiateIndex: 65535
      m_AllTileFlags: 1073741825
  - first: {x: 3, y: -3, z: 0}
    second:
      serializedVersion: 2
      m_TileIndex: 36
      m_TileSpriteIndex: 36
      m_TileMatrixIndex: 0
      m_TileColorIndex: 0
      m_TileObjectToInstantiateIndex: 65535
      m_AllTileFlags: 1073741825
  - first: {x: 4, y: -3, z: 0}
    second:
      serializedVersion: 2
      m_TileIndex: 35
      m_TileSpriteIndex: 35
      m_TileMatrixIndex: 0
      m_TileColorIndex: 0
      m_TileObjectToInstantiateIndex: 65535
      m_AllTileFlags: 1073741825
  - first: {x: 5, y: -3, z: 0}
    second:
      serializedVersion: 2
      m_TileIndex: 46
      m_TileSpriteIndex: 46
      m_TileMatrixIndex: 0
      m_TileColorIndex: 0
      m_TileObjectToInstantiateIndex: 65535
      m_AllTileFlags: 1073741825
  - first: {x: -2, y: -2, z: 0}
    second:
      serializedVersion: 2
      m_TileIndex: 25
      m_TileSpriteIndex: 14
      m_TileMatrixIndex: 0
      m_TileColorIndex: 0
      m_TileObjectToInstantiateIndex: 65535
      m_AllTileFlags: 1073741825
  - first: {x: -1, y: -2, z: 0}
    second:
      serializedVersion: 2
      m_TileIndex: 15
      m_TileSpriteIndex: 16
      m_TileMatrixIndex: 0
      m_TileColorIndex: 0
      m_TileObjectToInstantiateIndex: 65535
      m_AllTileFlags: 1073741825
  - first: {x: 0, y: -2, z: 0}
    second:
      serializedVersion: 2
      m_TileIndex: 14
      m_TileSpriteIndex: 15
      m_TileMatrixIndex: 0
      m_TileColorIndex: 0
      m_TileObjectToInstantiateIndex: 65535
      m_AllTileFlags: 1073741825
  - first: {x: 1, y: -2, z: 0}
    second:
      serializedVersion: 2
      m_TileIndex: 16
      m_TileSpriteIndex: 23
      m_TileMatrixIndex: 0
      m_TileColorIndex: 0
      m_TileObjectToInstantiateIndex: 65535
      m_AllTileFlags: 1073741825
  - first: {x: 2, y: -2, z: 0}
    second:
      serializedVersion: 2
      m_TileIndex: 28
      m_TileSpriteIndex: 33
      m_TileMatrixIndex: 0
      m_TileColorIndex: 0
      m_TileObjectToInstantiateIndex: 65535
      m_AllTileFlags: 1073741825
  - first: {x: 3, y: -2, z: 0}
    second:
      serializedVersion: 2
      m_TileIndex: 27
      m_TileSpriteIndex: 32
      m_TileMatrixIndex: 0
      m_TileColorIndex: 0
      m_TileObjectToInstantiateIndex: 65535
      m_AllTileFlags: 1073741825
  - first: {x: 4, y: -2, z: 0}
    second:
      serializedVersion: 2
      m_TileIndex: 26
      m_TileSpriteIndex: 28
      m_TileMatrixIndex: 0
      m_TileColorIndex: 0
      m_TileObjectToInstantiateIndex: 65535
      m_AllTileFlags: 1073741825
  - first: {x: 5, y: -2, z: 0}
    second:
      serializedVersion: 2
      m_TileIndex: 40
      m_TileSpriteIndex: 40
      m_TileMatrixIndex: 0
      m_TileColorIndex: 0
      m_TileObjectToInstantiateIndex: 65535
      m_AllTileFlags: 1073741825
  - first: {x: -2, y: -1, z: 0}
    second:
      serializedVersion: 2
      m_TileIndex: 11
      m_TileSpriteIndex: 11
      m_TileMatrixIndex: 0
      m_TileColorIndex: 0
      m_TileObjectToInstantiateIndex: 65535
      m_AllTileFlags: 1073741825
  - first: {x: -1, y: -1, z: 0}
    second:
      serializedVersion: 2
      m_TileIndex: 10
      m_TileSpriteIndex: 12
      m_TileMatrixIndex: 0
      m_TileColorIndex: 0
      m_TileObjectToInstantiateIndex: 65535
      m_AllTileFlags: 1073741825
  - first: {x: 0, y: -1, z: 0}
    second:
      serializedVersion: 2
      m_TileIndex: 12
      m_TileSpriteIndex: 10
      m_TileMatrixIndex: 0
      m_TileColorIndex: 0
      m_TileObjectToInstantiateIndex: 65535
      m_AllTileFlags: 1073741825
  - first: {x: 1, y: -1, z: 0}
    second:
      serializedVersion: 2
      m_TileIndex: 13
      m_TileSpriteIndex: 13
      m_TileMatrixIndex: 0
      m_TileColorIndex: 0
      m_TileObjectToInstantiateIndex: 65535
      m_AllTileFlags: 1073741825
  - first: {x: 2, y: -1, z: 0}
    second:
      serializedVersion: 2
      m_TileIndex: 22
      m_TileSpriteIndex: 27
      m_TileMatrixIndex: 0
      m_TileColorIndex: 0
      m_TileObjectToInstantiateIndex: 65535
      m_AllTileFlags: 1073741825
  - first: {x: 3, y: -1, z: 0}
    second:
      serializedVersion: 2
      m_TileIndex: 21
      m_TileSpriteIndex: 22
      m_TileMatrixIndex: 0
      m_TileColorIndex: 0
      m_TileObjectToInstantiateIndex: 65535
      m_AllTileFlags: 1073741825
  - first: {x: 4, y: -1, z: 0}
    second:
      serializedVersion: 2
      m_TileIndex: 20
      m_TileSpriteIndex: 21
      m_TileMatrixIndex: 0
      m_TileColorIndex: 0
      m_TileObjectToInstantiateIndex: 65535
      m_AllTileFlags: 1073741825
  - first: {x: 5, y: -1, z: 0}
    second:
      serializedVersion: 2
      m_TileIndex: 34
      m_TileSpriteIndex: 34
      m_TileMatrixIndex: 0
      m_TileColorIndex: 0
      m_TileObjectToInstantiateIndex: 65535
      m_AllTileFlags: 1073741825
  - first: {x: -2, y: 0, z: 0}
    second:
      serializedVersion: 2
      m_TileIndex: 7
      m_TileSpriteIndex: 7
      m_TileMatrixIndex: 0
      m_TileColorIndex: 0
      m_TileObjectToInstantiateIndex: 65535
      m_AllTileFlags: 1073741825
  - first: {x: -1, y: 0, z: 0}
    second:
      serializedVersion: 2
      m_TileIndex: 6
      m_TileSpriteIndex: 9
      m_TileMatrixIndex: 0
      m_TileColorIndex: 0
      m_TileObjectToInstantiateIndex: 65535
      m_AllTileFlags: 1073741825
  - first: {x: 0, y: 0, z: 0}
    second:
      serializedVersion: 2
      m_TileIndex: 5
      m_TileSpriteIndex: 8
      m_TileMatrixIndex: 0
      m_TileColorIndex: 0
      m_TileObjectToInstantiateIndex: 65535
      m_AllTileFlags: 1073741825
  - first: {x: 1, y: 0, z: 0}
    second:
      serializedVersion: 2
      m_TileIndex: 9
      m_TileSpriteIndex: 6
      m_TileMatrixIndex: 0
      m_TileColorIndex: 0
      m_TileObjectToInstantiateIndex: 65535
      m_AllTileFlags: 1073741825
  - first: {x: 2, y: 0, z: 0}
    second:
      serializedVersion: 2
      m_TileIndex: 8
      m_TileSpriteIndex: 5
      m_TileMatrixIndex: 0
      m_TileColorIndex: 0
      m_TileObjectToInstantiateIndex: 65535
      m_AllTileFlags: 1073741825
  - first: {x: 3, y: 0, z: 0}
    second:
      serializedVersion: 2
      m_TileIndex: 33
      m_TileSpriteIndex: 26
      m_TileMatrixIndex: 0
      m_TileColorIndex: 0
      m_TileObjectToInstantiateIndex: 65535
      m_AllTileFlags: 1073741825
  - first: {x: 4, y: 0, z: 0}
    second:
      serializedVersion: 2
      m_TileIndex: 32
      m_TileSpriteIndex: 25
      m_TileMatrixIndex: 0
      m_TileColorIndex: 0
      m_TileObjectToInstantiateIndex: 65535
      m_AllTileFlags: 1073741825
  - first: {x: 5, y: 0, z: 0}
    second:
      serializedVersion: 2
      m_TileIndex: 31
      m_TileSpriteIndex: 20
      m_TileMatrixIndex: 0
      m_TileColorIndex: 0
      m_TileObjectToInstantiateIndex: 65535
      m_AllTileFlags: 1073741825
  - first: {x: -2, y: 1, z: 0}
    second:
      serializedVersion: 2
      m_TileIndex: 0
      m_TileSpriteIndex: 4
      m_TileMatrixIndex: 0
      m_TileColorIndex: 0
      m_TileObjectToInstantiateIndex: 65535
      m_AllTileFlags: 1073741825
  - first: {x: -1, y: 1, z: 0}
    second:
      serializedVersion: 2
      m_TileIndex: 1
      m_TileSpriteIndex: 1
      m_TileMatrixIndex: 0
      m_TileColorIndex: 0
      m_TileObjectToInstantiateIndex: 65535
      m_AllTileFlags: 1073741825
  - first: {x: 0, y: 1, z: 0}
    second:
      serializedVersion: 2
      m_TileIndex: 2
      m_TileSpriteIndex: 2
      m_TileMatrixIndex: 0
      m_TileColorIndex: 0
      m_TileObjectToInstantiateIndex: 65535
      m_AllTileFlags: 1073741825
  - first: {x: 1, y: 1, z: 0}
    second:
      serializedVersion: 2
      m_TileIndex: 3
      m_TileSpriteIndex: 3
      m_TileMatrixIndex: 0
      m_TileColorIndex: 0
      m_TileObjectToInstantiateIndex: 65535
      m_AllTileFlags: 1073741825
  - first: {x: 2, y: 1, z: 0}
    second:
      serializedVersion: 2
      m_TileIndex: 4
      m_TileSpriteIndex: 0
      m_TileMatrixIndex: 0
      m_TileColorIndex: 0
      m_TileObjectToInstantiateIndex: 65535
      m_AllTileFlags: 1073741825
  - first: {x: 3, y: 1, z: 0}
    second:
      serializedVersion: 2
      m_TileIndex: 19
      m_TileSpriteIndex: 19
      m_TileMatrixIndex: 0
      m_TileColorIndex: 0
      m_TileObjectToInstantiateIndex: 65535
      m_AllTileFlags: 1073741825
  - first: {x: 4, y: 1, z: 0}
    second:
      serializedVersion: 2
      m_TileIndex: 18
      m_TileSpriteIndex: 18
      m_TileMatrixIndex: 0
      m_TileColorIndex: 0
      m_TileObjectToInstantiateIndex: 65535
      m_AllTileFlags: 1073741825
  - first: {x: 5, y: 1, z: 0}
    second:
      serializedVersion: 2
      m_TileIndex: 17
      m_TileSpriteIndex: 17
      m_TileMatrixIndex: 0
      m_TileColorIndex: 0
      m_TileObjectToInstantiateIndex: 65535
      m_AllTileFlags: 1073741825
  m_AnimatedTiles: {}
  m_TileAssetArray:
  - m_RefCount: 1
    m_Data: {fileID: 11400000, guid: 8bff382a85028d64988c3c077a7d64c2, type: 2}
  - m_RefCount: 1
    m_Data: {fileID: 11400000, guid: 594e20b9741de2845ab9e9ca0cb80a18, type: 2}
  - m_RefCount: 1
    m_Data: {fileID: 11400000, guid: 6e5887afb2b820f43839f5d3c230f33d, type: 2}
  - m_RefCount: 1
    m_Data: {fileID: 11400000, guid: f926f8b135df136409d8c2fa72b8f5d9, type: 2}
  - m_RefCount: 1
    m_Data: {fileID: 11400000, guid: fa563387f13016943b373b99fc0618c2, type: 2}
  - m_RefCount: 1
    m_Data: {fileID: 11400000, guid: 87e1458bc2965784eb667ed56212eebf, type: 2}
  - m_RefCount: 1
    m_Data: {fileID: 11400000, guid: 813d137dca1c3e142a6344e51f3f6a45, type: 2}
  - m_RefCount: 1
    m_Data: {fileID: 11400000, guid: 4b3df3e5cc1c2c34abd8987742a87482, type: 2}
  - m_RefCount: 1
    m_Data: {fileID: 11400000, guid: 1d44b2800d60c7d4aab524f7164eca92, type: 2}
  - m_RefCount: 1
    m_Data: {fileID: 11400000, guid: 9a0e5023eb8279a47a365835e0ee0191, type: 2}
  - m_RefCount: 1
    m_Data: {fileID: 11400000, guid: a259c624f77a69e44b1eba8c7016b728, type: 2}
  - m_RefCount: 1
    m_Data: {fileID: 11400000, guid: 42ac0aa91602236449293371dac135c4, type: 2}
  - m_RefCount: 1
    m_Data: {fileID: 11400000, guid: 8a7a5af70ce8a6d46aa337812cb7720d, type: 2}
  - m_RefCount: 1
    m_Data: {fileID: 11400000, guid: cb15a410a6534ae4d801194fc36de508, type: 2}
  - m_RefCount: 1
    m_Data: {fileID: 11400000, guid: d73a00f392a868f49a2e3ac641912fa8, type: 2}
  - m_RefCount: 1
    m_Data: {fileID: 11400000, guid: f30430314200aac448f3f245357a2af1, type: 2}
  - m_RefCount: 1
    m_Data: {fileID: 11400000, guid: 7124ef16d8bbaa14a9a7f0900f8d8e10, type: 2}
  - m_RefCount: 1
    m_Data: {fileID: 11400000, guid: 2c5a39f80e00800448b2cd27bbee0f30, type: 2}
  - m_RefCount: 1
    m_Data: {fileID: 11400000, guid: c5910b3d791b5a44cadacb5d2b16af3d, type: 2}
  - m_RefCount: 1
    m_Data: {fileID: 11400000, guid: 129268f6f3e1d5848859dfd6860ec763, type: 2}
  - m_RefCount: 1
    m_Data: {fileID: 11400000, guid: 293d03d1d2d95dd449dab886dc005335, type: 2}
  - m_RefCount: 1
    m_Data: {fileID: 11400000, guid: 40879429104d5ef42bb13b8cce73ad6e, type: 2}
  - m_RefCount: 1
    m_Data: {fileID: 11400000, guid: ad0f4866a7804f8439462fa6abffbf07, type: 2}
  - m_RefCount: 1
    m_Data: {fileID: 11400000, guid: 520eb1eb7f90e3e48bcf576c808fafed, type: 2}
  - m_RefCount: 1
    m_Data: {fileID: 11400000, guid: 50c620a0560dfc64fa731b50f81a1e1c, type: 2}
  - m_RefCount: 1
    m_Data: {fileID: 11400000, guid: ec858bd5289e17343902750d19747393, type: 2}
  - m_RefCount: 1
    m_Data: {fileID: 11400000, guid: 348c6a88deb600440b3112148bff9885, type: 2}
  - m_RefCount: 1
    m_Data: {fileID: 11400000, guid: e2dcf41eacce29944a005d37db8adfc2, type: 2}
  - m_RefCount: 1
    m_Data: {fileID: 11400000, guid: 3dfaef60f79acdc498078ffa7787b4c4, type: 2}
  - m_RefCount: 1
    m_Data: {fileID: 11400000, guid: aabc0cf5b5c1227478c8adbda85686e5, type: 2}
  - m_RefCount: 1
    m_Data: {fileID: 11400000, guid: 37272cfc68bf93243b5d435f8e1f2ea5, type: 2}
  - m_RefCount: 1
    m_Data: {fileID: 11400000, guid: 1acd0f4a8a8f9594398d6511e579818a, type: 2}
  - m_RefCount: 1
    m_Data: {fileID: 11400000, guid: 3ceba9e56c669dd44a49d274dd333ddd, type: 2}
  - m_RefCount: 1
    m_Data: {fileID: 11400000, guid: f9bb46590008ffd469ada6364b81efa4, type: 2}
  - m_RefCount: 1
    m_Data: {fileID: 11400000, guid: a9939ae8cbe270848bc9c719556a7fc4, type: 2}
  - m_RefCount: 1
    m_Data: {fileID: 11400000, guid: 94cdb288c0d8dde4686eee32276895fd, type: 2}
  - m_RefCount: 1
    m_Data: {fileID: 11400000, guid: dac3a4bc08a9f1345a315202f35f6fd5, type: 2}
  - m_RefCount: 1
    m_Data: {fileID: 11400000, guid: bd461bd79c850bd4aa0b523ea85b1207, type: 2}
  - m_RefCount: 1
    m_Data: {fileID: 11400000, guid: 1eb474c207f50fe438faee50ab2b6b1a, type: 2}
  - m_RefCount: 1
    m_Data: {fileID: 11400000, guid: 0dded2356e579f648b4ab1e7e81c87e1, type: 2}
  - m_RefCount: 1
    m_Data: {fileID: 11400000, guid: 4b540d82890a4a04d99dd72753ec3050, type: 2}
  - m_RefCount: 1
    m_Data: {fileID: 11400000, guid: dbdb0c9fcab880c498ce77503cb2c693, type: 2}
  - m_RefCount: 1
    m_Data: {fileID: 11400000, guid: df923694a732f154e8f53424f4a3625e, type: 2}
  - m_RefCount: 1
    m_Data: {fileID: 11400000, guid: 5b03e89d799aff84e9adf745412d7789, type: 2}
  - m_RefCount: 1
    m_Data: {fileID: 11400000, guid: 379af1effb1285a41aaf4bb97f815dfb, type: 2}
  - m_RefCount: 1
    m_Data: {fileID: 11400000, guid: e1c5a2d8f64275d4e80f602eedf44544, type: 2}
  - m_RefCount: 1
    m_Data: {fileID: 11400000, guid: 3e557a4497698b4439a0040f0b589eae, type: 2}
  - m_RefCount: 1
    m_Data: {fileID: 11400000, guid: 9cf7dc6686de1b647bd2e4ec032e73e2, type: 2}
  - m_RefCount: 1
    m_Data: {fileID: 11400000, guid: 384da2115260b854dba0f280704ee4fc, type: 2}
  - m_RefCount: 1
    m_Data: {fileID: 11400000, guid: 78e96eeb0c748cb4da44a019cc8ee456, type: 2}
  - m_RefCount: 1
    m_Data: {fileID: 11400000, guid: 9808e905b0a165c4f9567b63d69a8c17, type: 2}
  - m_RefCount: 1
    m_Data: {fileID: 11400000, guid: 8c7f2328b89039349be6e4fb31d9df1a, type: 2}
  - m_RefCount: 1
    m_Data: {fileID: 11400000, guid: a0697545604cc5549aa08ef7086ef15a, type: 2}
  - m_RefCount: 1
    m_Data: {fileID: 11400000, guid: 55c00bb743530b44bbdfa678dacb92c8, type: 2}
  - m_RefCount: 1
    m_Data: {fileID: 11400000, guid: 147c265fcae643641b2cee3cf5215165, type: 2}
  - m_RefCount: 1
    m_Data: {fileID: 11400000, guid: 06208a6c4bea85042ac14966bfbe0b73, type: 2}
  - m_RefCount: 1
    m_Data: {fileID: 11400000, guid: 4146321aa745a514685c832d759f3d9f, type: 2}
  - m_RefCount: 1
    m_Data: {fileID: 11400000, guid: 880ea11906c521a41b9fe46b9eb9b26a, type: 2}
  - m_RefCount: 1
    m_Data: {fileID: 11400000, guid: f2d15001811ce24468dd97d2ee482934, type: 2}
  - m_RefCount: 1
    m_Data: {fileID: 11400000, guid: 24d41dbe5af6c304292cf94b847dd582, type: 2}
  - m_RefCount: 1
    m_Data: {fileID: 11400000, guid: 3c8459b671336bb47bb9cc312f7e2475, type: 2}
  - m_RefCount: 1
    m_Data: {fileID: 11400000, guid: 6dbc0bcd0395520469dfebca972a7609, type: 2}
  - m_RefCount: 1
    m_Data: {fileID: 11400000, guid: da3eaabe4debd8f429f840cb9f7f8284, type: 2}
  - m_RefCount: 1
    m_Data: {fileID: 11400000, guid: 74926ca2c5e6d0545999db3bb584a73d, type: 2}
  - m_RefCount: 1
    m_Data: {fileID: 11400000, guid: d485bf9f0c9dbc44ebaf4d8fa5de10e7, type: 2}
  - m_RefCount: 1
    m_Data: {fileID: 11400000, guid: 2c0e78eb1ff0eac49b3891642fdb1d09, type: 2}
  - m_RefCount: 1
    m_Data: {fileID: 11400000, guid: c31c8565e51852b4b8be3ef9a22743b7, type: 2}
  - m_RefCount: 1
    m_Data: {fileID: 11400000, guid: e3853718a3c2cbf44b59c9861c367d9d, type: 2}
  - m_RefCount: 1
    m_Data: {fileID: 11400000, guid: ba82a3eacb4d550458323dfd73bc96d0, type: 2}
  - m_RefCount: 1
    m_Data: {fileID: 11400000, guid: 1eac79b9dcbcebf4f9003a05c3842976, type: 2}
  - m_RefCount: 1
    m_Data: {fileID: 11400000, guid: 34af4082a1075b04c88bbed28a1e5681, type: 2}
  - m_RefCount: 1
    m_Data: {fileID: 11400000, guid: 6779082b3b8db6a4b9415fc6bb19598c, type: 2}
  - m_RefCount: 1
    m_Data: {fileID: 11400000, guid: f92aac217bfe9c74a8285fa4cb5e496d, type: 2}
  - m_RefCount: 1
    m_Data: {fileID: 11400000, guid: 59458b5e9bc1f1c408296d87acaf386b, type: 2}
  - m_RefCount: 1
    m_Data: {fileID: 11400000, guid: 9f6ceb99ea448624d8c71d07be1cdbaf, type: 2}
  - m_RefCount: 1
    m_Data: {fileID: 11400000, guid: 144f75138d8dbd24ab78dfb5d7851b4e, type: 2}
  - m_RefCount: 1
    m_Data: {fileID: 11400000, guid: 2ca7001f8f9771049a165158fa1559e8, type: 2}
  - m_RefCount: 1
    m_Data: {fileID: 11400000, guid: 3ef5c1d02c9075147aed17ffb709b45e, type: 2}
  - m_RefCount: 1
    m_Data: {fileID: 11400000, guid: e8c7be61156ed064a937f5e1e24bedd7, type: 2}
  - m_RefCount: 1
    m_Data: {fileID: 11400000, guid: 87ee45a48b20a9f4386146653a6d74d1, type: 2}
  - m_RefCount: 1
    m_Data: {fileID: 11400000, guid: 2f45ac9965010b34999b54763af28f98, type: 2}
  - m_RefCount: 1
    m_Data: {fileID: 11400000, guid: 1e86e09fc66367d4cbcb230834162c1e, type: 2}
  - m_RefCount: 1
    m_Data: {fileID: 11400000, guid: 307b99a24b339924fbf67120bae1ec71, type: 2}
  - m_RefCount: 1
    m_Data: {fileID: 11400000, guid: f3e2f35a2032f56439bdb57d710a15b7, type: 2}
  - m_RefCount: 1
    m_Data: {fileID: 11400000, guid: 340c012133afd3c419de5f398974e50c, type: 2}
  - m_RefCount: 1
    m_Data: {fileID: 11400000, guid: bd7471bc833d88d4f820e5290e40f18a, type: 2}
  - m_RefCount: 1
    m_Data: {fileID: 11400000, guid: ecfda7403ad0a524b8abf79bfe4856cd, type: 2}
  - m_RefCount: 1
    m_Data: {fileID: 11400000, guid: 7c042599e62458b4fbedcdd55634ac75, type: 2}
  - m_RefCount: 1
    m_Data: {fileID: 11400000, guid: 8b854c8a017523949aa790587a0c5d63, type: 2}
  - m_RefCount: 1
    m_Data: {fileID: 11400000, guid: 6082de387e610d14da066734feda0bde, type: 2}
  - m_RefCount: 1
    m_Data: {fileID: 11400000, guid: a2151a4014a050244be93dca61e1893c, type: 2}
  - m_RefCount: 1
    m_Data: {fileID: 11400000, guid: 62d5e27fec6643e498c310343762e13f, type: 2}
  - m_RefCount: 1
    m_Data: {fileID: 11400000, guid: 4b342300a6263474b98376d38e39e382, type: 2}
  - m_RefCount: 1
    m_Data: {fileID: 11400000, guid: e627c42427e35814f9fecd01613e4bad, type: 2}
  - m_RefCount: 1
    m_Data: {fileID: 11400000, guid: 18dece54bfd48804ba97b0eef0fca6ac, type: 2}
  - m_RefCount: 1
    m_Data: {fileID: 11400000, guid: b2a28fd3fc2b7da49967d51d1e37b334, type: 2}
  - m_RefCount: 1
    m_Data: {fileID: 11400000, guid: eaaccf9f8b2c01a48ac5b957e5b5cca0, type: 2}
  - m_RefCount: 1
    m_Data: {fileID: 11400000, guid: 54ba5d1bd4be34a4aba0884a57659c79, type: 2}
  - m_RefCount: 1
    m_Data: {fileID: 11400000, guid: b4e84530803fa4846adada3b180b9b75, type: 2}
  - m_RefCount: 1
    m_Data: {fileID: 11400000, guid: 43f23fe00e627384889bba7becbcbeeb, type: 2}
  m_TileSpriteArray:
  - m_RefCount: 1
    m_Data: {fileID: 5332249522412507371, guid: 407cc2834e8299f4ea0515dae3449050, type: 3}
  - m_RefCount: 1
    m_Data: {fileID: -2026256278235901037, guid: 407cc2834e8299f4ea0515dae3449050, type: 3}
  - m_RefCount: 1
    m_Data: {fileID: -1352499700559850798, guid: 407cc2834e8299f4ea0515dae3449050, type: 3}
  - m_RefCount: 1
    m_Data: {fileID: 3794164194016075295, guid: 407cc2834e8299f4ea0515dae3449050, type: 3}
  - m_RefCount: 1
    m_Data: {fileID: -2859780572457394231, guid: 407cc2834e8299f4ea0515dae3449050, type: 3}
  - m_RefCount: 1
    m_Data: {fileID: 6022029295489149638, guid: 407cc2834e8299f4ea0515dae3449050, type: 3}
  - m_RefCount: 1
    m_Data: {fileID: 4403392902661641300, guid: 407cc2834e8299f4ea0515dae3449050, type: 3}
  - m_RefCount: 1
    m_Data: {fileID: 6635298163485367835, guid: 407cc2834e8299f4ea0515dae3449050, type: 3}
  - m_RefCount: 1
    m_Data: {fileID: 4937319496268482739, guid: 407cc2834e8299f4ea0515dae3449050, type: 3}
  - m_RefCount: 1
    m_Data: {fileID: 4418331483566358912, guid: 407cc2834e8299f4ea0515dae3449050, type: 3}
  - m_RefCount: 1
    m_Data: {fileID: 7117000872589464183, guid: 407cc2834e8299f4ea0515dae3449050, type: 3}
  - m_RefCount: 1
    m_Data: {fileID: -3259822411896908418, guid: 407cc2834e8299f4ea0515dae3449050, type: 3}
  - m_RefCount: 1
    m_Data: {fileID: 5299867679164976930, guid: 407cc2834e8299f4ea0515dae3449050, type: 3}
  - m_RefCount: 1
    m_Data: {fileID: 21300000, guid: 52f361c0381f77348ae8d06b6cd9ce4f, type: 3}
  - m_RefCount: 1
    m_Data: {fileID: -2389876295145016741, guid: b186f8dd94c36d44ea23850d3638960d, type: 3}
  - m_RefCount: 1
    m_Data: {fileID: 21300000, guid: 6e6f1e9b3946e7b49be5e86e7edf0688, type: 3}
  - m_RefCount: 1
    m_Data: {fileID: 21300000, guid: 1f4d445d037c13b48b12323cb028fe3e, type: 3}
  - m_RefCount: 1
    m_Data: {fileID: 7796813979969460460, guid: b186f8dd94c36d44ea23850d3638960d, type: 3}
  - m_RefCount: 1
    m_Data: {fileID: -2958659623025188344, guid: b186f8dd94c36d44ea23850d3638960d, type: 3}
  - m_RefCount: 1
    m_Data: {fileID: -5248192612404262650, guid: b186f8dd94c36d44ea23850d3638960d, type: 3}
  - m_RefCount: 1
    m_Data: {fileID: 2839754994072920557, guid: b186f8dd94c36d44ea23850d3638960d, type: 3}
  - m_RefCount: 1
    m_Data: {fileID: 990025809419137772, guid: b186f8dd94c36d44ea23850d3638960d, type: 3}
  - m_RefCount: 1
    m_Data: {fileID: 1069303077912786636, guid: b186f8dd94c36d44ea23850d3638960d, type: 3}
  - m_RefCount: 1
    m_Data: {fileID: 21300000, guid: ac5993266b9526040ada67e2594e4b94, type: 3}
  - m_RefCount: 1
    m_Data: {fileID: 7369071303901023420, guid: b186f8dd94c36d44ea23850d3638960d, type: 3}
  - m_RefCount: 1
    m_Data: {fileID: -7691987321792851857, guid: b186f8dd94c36d44ea23850d3638960d, type: 3}
  - m_RefCount: 1
    m_Data: {fileID: -4436593357158913613, guid: b186f8dd94c36d44ea23850d3638960d, type: 3}
  - m_RefCount: 1
    m_Data: {fileID: 32770349898902088, guid: b186f8dd94c36d44ea23850d3638960d, type: 3}
  - m_RefCount: 1
    m_Data: {fileID: 9030342044550483957, guid: b186f8dd94c36d44ea23850d3638960d, type: 3}
  - m_RefCount: 1
    m_Data: {fileID: -343469823704793960, guid: b186f8dd94c36d44ea23850d3638960d, type: 3}
  - m_RefCount: 1
    m_Data: {fileID: -3247358118455070188, guid: b186f8dd94c36d44ea23850d3638960d, type: 3}
  - m_RefCount: 1
    m_Data: {fileID: 8961039527777400664, guid: b186f8dd94c36d44ea23850d3638960d, type: 3}
  - m_RefCount: 1
    m_Data: {fileID: -5925129943918867917, guid: b186f8dd94c36d44ea23850d3638960d, type: 3}
  - m_RefCount: 1
    m_Data: {fileID: 2635385044751919179, guid: b186f8dd94c36d44ea23850d3638960d, type: 3}
  - m_RefCount: 1
    m_Data: {fileID: -2544805552484276444, guid: b186f8dd94c36d44ea23850d3638960d, type: 3}
  - m_RefCount: 1
    m_Data: {fileID: 6185217534436377780, guid: b186f8dd94c36d44ea23850d3638960d, type: 3}
  - m_RefCount: 1
    m_Data: {fileID: -6321300151572308110, guid: b186f8dd94c36d44ea23850d3638960d, type: 3}
  - m_RefCount: 1
    m_Data: {fileID: 8366746712855639788, guid: b186f8dd94c36d44ea23850d3638960d, type: 3}
  - m_RefCount: 1
    m_Data: {fileID: 3626104175240421255, guid: b186f8dd94c36d44ea23850d3638960d, type: 3}
  - m_RefCount: 1
    m_Data: {fileID: 7645323078649656086, guid: b186f8dd94c36d44ea23850d3638960d, type: 3}
  - m_RefCount: 1
    m_Data: {fileID: 5577083723499013569, guid: b186f8dd94c36d44ea23850d3638960d, type: 3}
  - m_RefCount: 1
    m_Data: {fileID: -222075940610035684, guid: b186f8dd94c36d44ea23850d3638960d, type: 3}
  - m_RefCount: 1
    m_Data: {fileID: -8631970993867226047, guid: b186f8dd94c36d44ea23850d3638960d, type: 3}
  - m_RefCount: 1
    m_Data: {fileID: -5158657471636769541, guid: b186f8dd94c36d44ea23850d3638960d, type: 3}
  - m_RefCount: 1
    m_Data: {fileID: 5145537949313771107, guid: b186f8dd94c36d44ea23850d3638960d, type: 3}
  - m_RefCount: 1
    m_Data: {fileID: -3769607138642421822, guid: b186f8dd94c36d44ea23850d3638960d, type: 3}
  - m_RefCount: 1
    m_Data: {fileID: -1527586134629194483, guid: b186f8dd94c36d44ea23850d3638960d, type: 3}
  - m_RefCount: 1
    m_Data: {fileID: 1943933534051880037, guid: b186f8dd94c36d44ea23850d3638960d, type: 3}
  - m_RefCount: 1
    m_Data: {fileID: 8799703238021141360, guid: b186f8dd94c36d44ea23850d3638960d, type: 3}
  - m_RefCount: 1
    m_Data: {fileID: -6998083352109793311, guid: b186f8dd94c36d44ea23850d3638960d, type: 3}
  - m_RefCount: 1
    m_Data: {fileID: 8969116026467092428, guid: fa2023353e473a148b15579d7648cf4f, type: 3}
  - m_RefCount: 1
    m_Data: {fileID: 8462802284405011460, guid: fa2023353e473a148b15579d7648cf4f, type: 3}
  - m_RefCount: 1
    m_Data: {fileID: -8973401228322379885, guid: fa2023353e473a148b15579d7648cf4f, type: 3}
  - m_RefCount: 1
    m_Data: {fileID: 6127191440536314963, guid: fa2023353e473a148b15579d7648cf4f, type: 3}
  - m_RefCount: 1
    m_Data: {fileID: 2862122844398406230, guid: fa2023353e473a148b15579d7648cf4f, type: 3}
  - m_RefCount: 1
    m_Data: {fileID: 5892135564488324679, guid: fa2023353e473a148b15579d7648cf4f, type: 3}
  - m_RefCount: 1
    m_Data: {fileID: -8501702417017368714, guid: fa2023353e473a148b15579d7648cf4f, type: 3}
  - m_RefCount: 1
    m_Data: {fileID: -5860635281184384958, guid: fa2023353e473a148b15579d7648cf4f, type: 3}
  - m_RefCount: 1
    m_Data: {fileID: -7528790381566618016, guid: fa2023353e473a148b15579d7648cf4f, type: 3}
  - m_RefCount: 1
    m_Data: {fileID: 2823455414106422400, guid: 645c4a01f487a5643b68cfea1c190646, type: 3}
  - m_RefCount: 1
    m_Data: {fileID: 6168832952985720803, guid: 3105e08b8eaa25642994765e511d6ad1, type: 3}
  - m_RefCount: 1
    m_Data: {fileID: 3518826541581588111, guid: 3105e08b8eaa25642994765e511d6ad1, type: 3}
  - m_RefCount: 1
    m_Data: {fileID: -1290240999381114117, guid: 12e99f07082e3fc448e9f1a7c245093d, type: 3}
  - m_RefCount: 1
    m_Data: {fileID: -5821992063286662571, guid: 12e99f07082e3fc448e9f1a7c245093d, type: 3}
  - m_RefCount: 1
    m_Data: {fileID: 6248396334602650815, guid: a0d6fe5ba5500314dbd7697f2ee2eb96, type: 3}
  - m_RefCount: 1
    m_Data: {fileID: 4677418689308248608, guid: a0d6fe5ba5500314dbd7697f2ee2eb96, type: 3}
  - m_RefCount: 1
    m_Data: {fileID: 3945957249677428465, guid: a0d6fe5ba5500314dbd7697f2ee2eb96, type: 3}
  - m_RefCount: 1
    m_Data: {fileID: 2210507726860433550, guid: a0d6fe5ba5500314dbd7697f2ee2eb96, type: 3}
  - m_RefCount: 1
    m_Data: {fileID: -913772826499381203, guid: a0d6fe5ba5500314dbd7697f2ee2eb96, type: 3}
  - m_RefCount: 1
    m_Data: {fileID: -1400174247109982687, guid: a0d6fe5ba5500314dbd7697f2ee2eb96, type: 3}
  - m_RefCount: 1
    m_Data: {fileID: -7166855607949075561, guid: a0d6fe5ba5500314dbd7697f2ee2eb96, type: 3}
  - m_RefCount: 1
    m_Data: {fileID: 5177015605215710059, guid: a0d6fe5ba5500314dbd7697f2ee2eb96, type: 3}
  - m_RefCount: 1
    m_Data: {fileID: 3371668880335979476, guid: a0d6fe5ba5500314dbd7697f2ee2eb96, type: 3}
  - m_RefCount: 1
    m_Data: {fileID: 4584064299685053114, guid: a0d6fe5ba5500314dbd7697f2ee2eb96, type: 3}
  - m_RefCount: 1
    m_Data: {fileID: 5371270140892878697, guid: a0d6fe5ba5500314dbd7697f2ee2eb96, type: 3}
  - m_RefCount: 1
    m_Data: {fileID: 2552257393182373573, guid: a0d6fe5ba5500314dbd7697f2ee2eb96, type: 3}
  - m_RefCount: 1
    m_Data: {fileID: 2279665415139426691, guid: a0d6fe5ba5500314dbd7697f2ee2eb96, type: 3}
  - m_RefCount: 1
    m_Data: {fileID: 8189333309369765710, guid: a0d6fe5ba5500314dbd7697f2ee2eb96, type: 3}
  - m_RefCount: 1
    m_Data: {fileID: 1427710709295187143, guid: a0d6fe5ba5500314dbd7697f2ee2eb96, type: 3}
  - m_RefCount: 1
    m_Data: {fileID: 6390497881796298959, guid: c473ba9a6472c6e4e999b2bf4cd90540, type: 3}
  - m_RefCount: 1
    m_Data: {fileID: -4189626326811757553, guid: d810013c8aea1124981aecdf60c4f90c, type: 3}
  - m_RefCount: 1
    m_Data: {fileID: -8541085448320218362, guid: c473ba9a6472c6e4e999b2bf4cd90540, type: 3}
  - m_RefCount: 1
    m_Data: {fileID: 554689966961208478, guid: c473ba9a6472c6e4e999b2bf4cd90540, type: 3}
  - m_RefCount: 1
    m_Data: {fileID: -372957418792742918, guid: d810013c8aea1124981aecdf60c4f90c, type: 3}
  - m_RefCount: 1
    m_Data: {fileID: -4492498602819357366, guid: c473ba9a6472c6e4e999b2bf4cd90540, type: 3}
  - m_RefCount: 1
    m_Data: {fileID: 7313050782650914405, guid: c473ba9a6472c6e4e999b2bf4cd90540, type: 3}
  - m_RefCount: 1
    m_Data: {fileID: 3184180266821781785, guid: c473ba9a6472c6e4e999b2bf4cd90540, type: 3}
  - m_RefCount: 1
    m_Data: {fileID: -803735722257622312, guid: c473ba9a6472c6e4e999b2bf4cd90540, type: 3}
  - m_RefCount: 1
    m_Data: {fileID: 1005062960001369018, guid: 087eea026e2f4884f9062629d92e562f, type: 3}
  - m_RefCount: 1
    m_Data: {fileID: 3219206800748829104, guid: 087eea026e2f4884f9062629d92e562f, type: 3}
  - m_RefCount: 1
    m_Data: {fileID: -5874142860908507532, guid: 087eea026e2f4884f9062629d92e562f, type: 3}
  - m_RefCount: 1
    m_Data: {fileID: -8094463241211442379, guid: 087eea026e2f4884f9062629d92e562f, type: 3}
  - m_RefCount: 1
    m_Data: {fileID: -4560323746144723486, guid: 087eea026e2f4884f9062629d92e562f, type: 3}
  - m_RefCount: 1
    m_Data: {fileID: -4368216362886080945, guid: 087eea026e2f4884f9062629d92e562f, type: 3}
  - m_RefCount: 1
    m_Data: {fileID: -1138795725206236619, guid: 087eea026e2f4884f9062629d92e562f, type: 3}
  - m_RefCount: 1
    m_Data: {fileID: -4762853671781125340, guid: 087eea026e2f4884f9062629d92e562f, type: 3}
  - m_RefCount: 1
    m_Data: {fileID: 1271766197913458244, guid: 087eea026e2f4884f9062629d92e562f, type: 3}
  - m_RefCount: 1
    m_Data: {fileID: 9095343244706930336, guid: 087eea026e2f4884f9062629d92e562f, type: 3}
  - m_RefCount: 1
    m_Data: {fileID: 8958948580095279561, guid: 087eea026e2f4884f9062629d92e562f, type: 3}
  - m_RefCount: 1
    m_Data: {fileID: -925444748031481869, guid: 087eea026e2f4884f9062629d92e562f, type: 3}
  m_TileMatrixArray:
  - m_RefCount: 100
    m_Data:
      e00: 1
      e01: 0
      e02: 0
      e03: 0
      e10: 0
      e11: 1
      e12: 0
      e13: 0
      e20: 0
      e21: 0
      e22: 1
      e23: 0
      e30: 0
      e31: 0
      e32: 0
      e33: 1
  m_TileColorArray:
  - m_RefCount: 100
    m_Data: {r: 1, g: 1, b: 1, a: 1}
  m_TileObjectToInstantiateArray: []
  m_AnimationFrameRate: 1
  m_Color: {r: 1, g: 1, b: 1, a: 1}
  m_Origin: {x: -3, y: -13, z: 0}
  m_Size: {x: 11, y: 15, z: 1}
  m_TileAnchor: {x: 0.5, y: 0.5, z: 0}
  m_TileOrientation: 0
  m_TileOrientationMatrix:
    e00: 1
    e01: 0
    e02: 0
    e03: 0
    e10: 0
    e11: 1
    e12: 0
    e13: 0
    e20: 0
    e21: 0
    e22: 1
    e23: 0
    e30: 0
    e31: 0
    e32: 0
    e33: 1
--- !u!483693784 &144621025497580525
TilemapRenderer:
  m_ObjectHideFlags: 0
  m_CorrespondingSourceObject: {fileID: 0}
  m_PrefabInstance: {fileID: 0}
  m_PrefabAsset: {fileID: 0}
  m_GameObject: {fileID: 6021099215924150576}
  m_Enabled: 1
  m_CastShadows: 0
  m_ReceiveShadows: 0
  m_DynamicOccludee: 0
  m_MotionVectors: 1
  m_LightProbeUsage: 0
  m_ReflectionProbeUsage: 0
  m_RayTracingMode: 0
  m_RayTraceProcedural: 0
  m_RenderingLayerMask: 1
  m_RendererPriority: 0
  m_Materials:
  - {fileID: 10754, guid: 0000000000000000f000000000000000, type: 0}
  m_StaticBatchInfo:
    firstSubMesh: 0
    subMeshCount: 0
  m_StaticBatchRoot: {fileID: 0}
  m_ProbeAnchor: {fileID: 0}
  m_LightProbeVolumeOverride: {fileID: 0}
  m_ScaleInLightmap: 1
  m_ReceiveGI: 1
  m_PreserveUVs: 0
  m_IgnoreNormalsForChartDetection: 0
  m_ImportantGI: 0
  m_StitchLightmapSeams: 1
  m_SelectedEditorRenderState: 0
  m_MinimumChartSize: 4
  m_AutoUVMaxDistance: 0.5
  m_AutoUVMaxAngle: 89
  m_LightmapParameters: {fileID: 0}
  m_SortingLayerID: 0
  m_SortingLayer: 0
  m_SortingOrder: 0
  m_ChunkSize: {x: 32, y: 32, z: 32}
  m_ChunkCullingBounds: {x: 0, y: 0, z: 0}
  m_MaxChunkCount: 16
  m_MaxFrameAge: 16
  m_SortOrder: 0
  m_Mode: 0
  m_DetectChunkCullingBounds: 0
  m_MaskInteraction: 0
--- !u!114 &6766703922051916290
MonoBehaviour:
  m_ObjectHideFlags: 0
  m_CorrespondingSourceObject: {fileID: 0}
  m_PrefabInstance: {fileID: 0}
  m_PrefabAsset: {fileID: 0}
  m_GameObject: {fileID: 0}
  m_Enabled: 1
  m_EditorHideFlags: 0
  m_Script: {fileID: 12395, guid: 0000000000000000e000000000000000, type: 0}
  m_Name: Palette Settings
  m_EditorClassIdentifier: 
  cellSizing: 0
