%YAML 1.1
%TAG !u! tag:unity3d.com,2011:
--- !u!1001 &3074381424707005163
PrefabInstance:
  m_ObjectHideFlags: 0
  serializedVersion: 2
  m_Modification:
    m_TransformParent: {fileID: 0}
    m_Modifications:
    - target: {fileID: 5867899666418647451, guid: e9cd523c9b8213b449f5ada8c3aabe1c, type: 3}
      propertyPath: whatIsAffected.m_Bits
      value: 262144
      objectReference: {fileID: 0}
    - target: {fileID: 5867899666418647451, guid: e9cd523c9b8213b449f5ada8c3aabe1c, type: 3}
      propertyPath: timeUntilActivated
      value: 0
      objectReference: {fileID: 0}
    - target: {fileID: 5867899666418647451, guid: e9cd523c9b8213b449f5ada8c3aabe1c, type: 3}
      propertyPath: orbGravity
      value: 15
      objectReference: {fileID: 0}
    - target: {fileID: 8464741489622406490, guid: e9cd523c9b8213b449f5ada8c3aabe1c, type: 3}
      propertyPath: m_Color.r
      value: 1
      objectReference: {fileID: 0}
    - target: {fileID: 8464741489622406490, guid: e9cd523c9b8213b449f5ada8c3aabe1c, type: 3}
      propertyPath: m_Color.g
      value: 1
      objectReference: {fileID: 0}
    - target: {fileID: 8464741489622406490, guid: e9cd523c9b8213b449f5ada8c3aabe1c, type: 3}
      propertyPath: m_Color.b
      value: 1
      objectReference: {fileID: 0}
    - target: {fileID: 8464741489622406491, guid: e9cd523c9b8213b449f5ada8c3aabe1c, type: 3}
      propertyPath: m_LocalPosition.x
      value: 0
      objectReference: {fileID: 0}
    - target: {fileID: 8464741489622406491, guid: e9cd523c9b8213b449f5ada8c3aabe1c, type: 3}
      propertyPath: m_LocalPosition.y
      value: 0
      objectReference: {fileID: 0}
    - target: {fileID: 8464741489622406491, guid: e9cd523c9b8213b449f5ada8c3aabe1c, type: 3}
      propertyPath: m_LocalPosition.z
      value: 0
      objectReference: {fileID: 0}
    - target: {fileID: 8464741489622406491, guid: e9cd523c9b8213b449f5ada8c3aabe1c, type: 3}
      propertyPath: m_LocalRotation.x
      value: 0
      objectReference: {fileID: 0}
    - target: {fileID: 8464741489622406491, guid: e9cd523c9b8213b449f5ada8c3aabe1c, type: 3}
      propertyPath: m_LocalRotation.y
      value: 0
      objectReference: {fileID: 0}
    - target: {fileID: 8464741489622406491, guid: e9cd523c9b8213b449f5ada8c3aabe1c, type: 3}
      propertyPath: m_LocalRotation.z
      value: 0
      objectReference: {fileID: 0}
    - target: {fileID: 8464741489622406491, guid: e9cd523c9b8213b449f5ada8c3aabe1c, type: 3}
      propertyPath: m_LocalRotation.w
      value: 1
      objectReference: {fileID: 0}
    - target: {fileID: 8464741489622406491, guid: e9cd523c9b8213b449f5ada8c3aabe1c, type: 3}
      propertyPath: m_RootOrder
      value: 0
      objectReference: {fileID: 0}
    - target: {fileID: 8464741489622406491, guid: e9cd523c9b8213b449f5ada8c3aabe1c, type: 3}
      propertyPath: m_LocalEulerAnglesHint.x
      value: 0
      objectReference: {fileID: 0}
    - target: {fileID: 8464741489622406491, guid: e9cd523c9b8213b449f5ada8c3aabe1c, type: 3}
      propertyPath: m_LocalEulerAnglesHint.y
      value: 0
      objectReference: {fileID: 0}
    - target: {fileID: 8464741489622406491, guid: e9cd523c9b8213b449f5ada8c3aabe1c, type: 3}
      propertyPath: m_LocalEulerAnglesHint.z
      value: 0
      objectReference: {fileID: 0}
    - target: {fileID: 8464741489622406493, guid: e9cd523c9b8213b449f5ada8c3aabe1c, type: 3}
      propertyPath: m_Name
      value: PlayerOrb
      objectReference: {fileID: 0}
    m_RemovedComponents: []
  m_SourcePrefab: {fileID: 100100000, guid: e9cd523c9b8213b449f5ada8c3aabe1c, type: 3}
