{
    "name": "Controls",
    "maps": [
        {
            "name": "PlayerMovement",
            "id": "5503296d-61cc-47d5-9c29-9886f79d666c",
            "actions": [
                {
                    "name": "Walk",
                    "type": "Value",
                    "id": "1975b073-6fbe-49f3-bf70-174e08f9a711",
                    "expectedControlType": "Vector2",
                    "processors": "",
                    "interactions": ""
                },
                {
                    "name": "Jump",
                    "type": "Button",
                    "id": "813310ba-22f8-484e-9539-429df6b712eb",
                    "expectedControlType": "Button",
                    "processors": "",
                    "interactions": ""
                },
                {
                    "name": "ThrowEnvironmentOrb",
                    "type": "Button",
                    "id": "3d0d60df-c1f6-4906-928b-3472cf0494b1",
                    "expectedControlType": "Button",
                    "processors": "",
                    "interactions": ""
                },
                {
                    "name": "ThrowDirectionController",
                    "type": "PassThrough",
                    "id": "ab18e743-a63a-489b-8017-6208ea33262d",
                    "expectedControlType": "Vector2",
                    "processors": "",
                    "interactions": ""
                },
                {
                    "name": "DestroyOrb",
                    "type": "Button",
                    "id": "e2724d2b-915a-46b1-98cf-f44f051d6f73",
                    "expectedControlType": "Button",
                    "processors": "",
                    "interactions": ""
                },
                {
                    "name": "ThrowPlayerOrb",
                    "type": "Button",
                    "id": "3c6e636e-15fb-4c0e-a0cb-9e5111d0dd40",
                    "expectedControlType": "Button",
                    "processors": "",
                    "interactions": ""
                },
                {
                    "name": "Reset",
                    "type": "Button",
                    "id": "424b1b32-08b3-43c5-a5cd-39418e324229",
                    "expectedControlType": "Button",
                    "processors": "",
                    "interactions": ""
                },
                {
                    "name": "ThrowDirectionKeyboardMouse",
                    "type": "PassThrough",
                    "id": "f4ae60a8-5bf5-4373-b415-5e7f329e9349",
                    "expectedControlType": "Vector2",
                    "processors": "",
                    "interactions": ""
                }
            ],
            "bindings": [
                {
                    "name": "Controller DPad",
                    "id": "6afda3cb-7ef2-478c-b667-04770267247f",
                    "path": "2DVector",
                    "interactions": "",
                    "processors": "",
                    "groups": "",
                    "action": "Walk",
                    "isComposite": true,
                    "isPartOfComposite": false
                },
                {
                    "name": "up",
                    "id": "6f5508c1-cca8-4273-ad72-6758d0692cd9",
                    "path": "",
                    "interactions": "",
                    "processors": "",
                    "groups": "Controller",
                    "action": "Walk",
                    "isComposite": false,
                    "isPartOfComposite": true
                },
                {
                    "name": "down",
                    "id": "b414f46e-7ad7-4aa2-8f48-c2530db9fde4",
                    "path": "",
                    "interactions": "",
                    "processors": "",
                    "groups": "Controller",
                    "action": "Walk",
                    "isComposite": false,
                    "isPartOfComposite": true
                },
                {
                    "name": "left",
                    "id": "0eff19b6-6b72-4c3a-99a7-798b18937e86",
                    "path": "<Gamepad>/dpad/left",
                    "interactions": "",
                    "processors": "",
                    "groups": "Controller",
                    "action": "Walk",
                    "isComposite": false,
                    "isPartOfComposite": true
                },
                {
                    "name": "right",
                    "id": "76c6fdb5-c69b-4eb2-994e-f9288c4b51e8",
                    "path": "<Gamepad>/dpad/right",
                    "interactions": "",
                    "processors": "",
                    "groups": "Controller",
                    "action": "Walk",
                    "isComposite": false,
                    "isPartOfComposite": true
                },
                {
                    "name": "Controller Stick",
                    "id": "e79af44f-3821-41e2-8472-99ca611df3f9",
                    "path": "2DVector",
                    "interactions": "",
                    "processors": "",
                    "groups": "",
                    "action": "Walk",
                    "isComposite": true,
                    "isPartOfComposite": false
                },
                {
                    "name": "up",
                    "id": "de34ce98-f993-4b44-a4ef-376ec3aaa797",
                    "path": "",
                    "interactions": "",
                    "processors": "",
                    "groups": "Controller",
                    "action": "Walk",
                    "isComposite": false,
                    "isPartOfComposite": true
                },
                {
                    "name": "down",
                    "id": "2ef03a4d-58f5-4114-8ab9-ce903696d4d6",
                    "path": "",
                    "interactions": "",
                    "processors": "",
                    "groups": "Controller",
                    "action": "Walk",
                    "isComposite": false,
                    "isPartOfComposite": true
                },
                {
                    "name": "left",
                    "id": "fff792db-33b3-4fc4-867b-eca1e95640af",
                    "path": "<Gamepad>/leftStick/left",
                    "interactions": "",
                    "processors": "",
                    "groups": "Controller",
                    "action": "Walk",
                    "isComposite": false,
                    "isPartOfComposite": true
                },
                {
                    "name": "right",
                    "id": "171e3bfc-2301-4502-9fc2-07d3ccb75b47",
                    "path": "<Gamepad>/leftStick/right",
                    "interactions": "",
                    "processors": "",
                    "groups": "Controller",
                    "action": "Walk",
                    "isComposite": false,
                    "isPartOfComposite": true
                },
                {
                    "name": "2D Vector",
                    "id": "f778b7ac-2b69-4549-ac08-9ab78814c2a1",
                    "path": "2DVector",
                    "interactions": "",
                    "processors": "",
                    "groups": "",
                    "action": "Walk",
                    "isComposite": true,
                    "isPartOfComposite": false
                },
                {
                    "name": "up",
                    "id": "006073a4-b279-4759-8a4b-01dee27b7f27",
                    "path": "",
                    "interactions": "",
                    "processors": "",
                    "groups": "KeyboardMouse",
                    "action": "Walk",
                    "isComposite": false,
                    "isPartOfComposite": true
                },
                {
                    "name": "down",
                    "id": "b21e0334-05be-42e6-9c07-473a0b720bac",
                    "path": "",
                    "interactions": "",
                    "processors": "",
                    "groups": "KeyboardMouse",
                    "action": "Walk",
                    "isComposite": false,
                    "isPartOfComposite": true
                },
                {
                    "name": "left",
                    "id": "0a74bc33-781e-478d-9b17-bdfeb6946317",
                    "path": "<Keyboard>/a",
                    "interactions": "",
                    "processors": "",
                    "groups": "KeyboardMouse",
                    "action": "Walk",
                    "isComposite": false,
                    "isPartOfComposite": true
                },
                {
                    "name": "right",
                    "id": "703e8587-061b-48f8-b4ea-0ddfd6f42aa2",
                    "path": "<Keyboard>/d",
                    "interactions": "",
                    "processors": "",
                    "groups": "KeyboardMouse",
                    "action": "Walk",
                    "isComposite": false,
                    "isPartOfComposite": true
                },
                {
                    "name": "",
                    "id": "9d869033-eea8-4241-849e-c4ab09d021d2",
                    "path": "<Gamepad>/buttonSouth",
                    "interactions": "Press",
                    "processors": "",
                    "groups": "Controller",
                    "action": "Jump",
                    "isComposite": false,
                    "isPartOfComposite": false
                },
                {
                    "name": "",
                    "id": "5da2a157-b51d-4a8f-b506-9d56b87c47f4",
                    "path": "<Keyboard>/space",
                    "interactions": "",
                    "processors": "",
                    "groups": "KeyboardMouse",
                    "action": "Jump",
                    "isComposite": false,
                    "isPartOfComposite": false
                },
                {
                    "name": "",
                    "id": "9e1351b3-8aa9-4657-ae71-222a29225b71",
                    "path": "<Gamepad>/rightTrigger",
                    "interactions": "Tap",
                    "processors": "",
                    "groups": "Controller",
                    "action": "ThrowEnvironmentOrb",
                    "isComposite": false,
                    "isPartOfComposite": false
                },
                {
                    "name": "",
                    "id": "1c6f8523-23e0-4b3e-bb36-f761d8dfed31",
                    "path": "<Mouse>/rightButton",
                    "interactions": "",
                    "processors": "",
                    "groups": "KeyboardMouse",
                    "action": "ThrowEnvironmentOrb",
                    "isComposite": false,
                    "isPartOfComposite": false
                },
                {
                    "name": "",
                    "id": "d9be277d-57c9-44a6-91fb-3dd470bcf60f",
                    "path": "<Gamepad>/rightStick",
                    "interactions": "",
                    "processors": "",
                    "groups": "Controller",
                    "action": "ThrowDirectionController",
                    "isComposite": false,
                    "isPartOfComposite": false
                },
                {
                    "name": "",
                    "id": "075fce7c-5c58-47a3-8023-79637f80d2ef",
                    "path": "<Gamepad>/buttonEast",
                    "interactions": "Press",
                    "processors": "",
                    "groups": "Controller",
                    "action": "DestroyOrb",
                    "isComposite": false,
                    "isPartOfComposite": false
                },
                {
                    "name": "",
                    "id": "370db92c-e3a7-4516-9ae3-4ad7798c29d4",
                    "path": "<Mouse>/middleButton",
                    "interactions": "",
                    "processors": "",
                    "groups": "KeyboardMouse",
                    "action": "DestroyOrb",
                    "isComposite": false,
                    "isPartOfComposite": false
                },
                {
                    "name": "",
                    "id": "b87889a0-2a9a-49ea-8787-34a20799b30b",
                    "path": "<Gamepad>/leftTrigger",
                    "interactions": "",
                    "processors": "",
                    "groups": "Controller",
                    "action": "ThrowPlayerOrb",
                    "isComposite": false,
                    "isPartOfComposite": false
                },
                {
                    "name": "",
                    "id": "b10f1651-f624-460d-8448-ad46390a9037",
                    "path": "<Mouse>/leftButton",
                    "interactions": "",
                    "processors": "",
                    "groups": "KeyboardMouse",
                    "action": "ThrowPlayerOrb",
                    "isComposite": false,
                    "isPartOfComposite": false
                },
                {
                    "name": "",
                    "id": "5f70e34c-1f08-46f1-abbe-c984d61f7c14",
                    "path": "<Gamepad>/buttonNorth",
                    "interactions": "Press(behavior=1)",
                    "processors": "",
                    "groups": "Controller",
                    "action": "Reset",
                    "isComposite": false,
                    "isPartOfComposite": false
                },
                {
                    "name": "",
                    "id": "610b4cc1-5b17-4239-ad08-e3ad09d241e9",
                    "path": "<Keyboard>/r",
                    "interactions": "",
                    "processors": "",
                    "groups": "KeyboardMouse",
                    "action": "Reset",
                    "isComposite": false,
                    "isPartOfComposite": false
                },
                {
                    "name": "",
                    "id": "86d3b9a8-b008-4a9d-b937-9492bcf04b60",
                    "path": "<Mouse>/position",
                    "interactions": "",
                    "processors": "",
                    "groups": "KeyboardMouse",
                    "action": "ThrowDirectionKeyboardMouse",
                    "isComposite": false,
                    "isPartOfComposite": false
                }
            ]
        }
    ],
    "controlSchemes": [
        {
            "name": "Controller",
            "bindingGroup": "Controller",
            "devices": [
                {
                    "devicePath": "<Gamepad>",
                    "isOptional": false,
                    "isOR": false
                }
            ]
        },
        {
            "name": "KeyboardMouse",
            "bindingGroup": "KeyboardMouse",
            "devices": [
                {
                    "devicePath": "<Keyboard>",
                    "isOptional": false,
                    "isOR": false
                },
                {
                    "devicePath": "<Mouse>",
                    "isOptional": false,
                    "isOR": false
                }
            ]
        }
    ]
}