<?xml version="1.0" encoding="UTF-8"?>
<svg width="24px" height="24px" viewBox="0 0 24 24" version="1.1" xmlns="http://www.w3.org/2000/svg" xmlns:xlink="http://www.w3.org/1999/xlink">
    <title>DE115161-3D65-4AF6-A424-AA07EC239E24mdpi/</title>
    <g id="Design" stroke="none" stroke-width="1" fill="none" fill-rule="evenodd">
        <g id="1.-Home" transform="translate(-1170.000000, -13.000000)">
            <g id="bxl:facebook" transform="translate(1170.000000, 13.000000)">
                <rect id="ViewBox" x="0" y="0" width="24" height="24"></rect>
                <path d="M13.397,20.997 L13.397,12.801 L16.162,12.801 L16.573,9.592 L13.397,9.592 L13.397,7.548 C13.397,6.622 13.655,5.988 14.984,5.988 L16.668,5.988 L16.668,3.127 C15.848639,3.03919097 15.0250465,2.99679282 14.201,2.99983083 C11.757,2.99983083 10.079,4.492 10.079,7.231 L10.079,9.586 L7.332,9.586 L7.332,12.795 L10.085,12.795 L10.085,20.997 L13.397,20.997 Z" id="Path" fill="#FFFFFF" fill-rule="nonzero"></path>
            </g>
        </g>
    </g>
</svg>