13:36:45	 De  Fernando Ocampo : Ocampo Fernando
13:36:49	 De  Facundo Román : Facundo Román
13:36:50	 De  Nicolas M. Brito : ok
13:36:58	 De  Rojas Emiliano : lol
13:37:04	 De  Fernando Ocampo : uwu
13:37:04	 De  Nicolas M. Brito : xd
13:37:04	 De  Julián Merchán : Julián Merchán
13:37:09	 De  Julián Merchán : uwu
13:37:22	 De  Nicolas M. Brito : jojos
13:37:29	 De  Morena Mansilla : Morena Mansilla 
13:37:32	 De  Morena Mansilla : uwu
13:39:09	 De  Gabriel Casas : https://www.tinkercad.com/things/bspZ9jK4Uwu-20210618-marchaimperialvectores5b
13:41:46	 De  Claudio Leonel Masia Miguez : Gracias
