12:48:47	 De  Alejo Herz : Alejo Herz
12:48:50	 De  Facundo Maroño : Facundo Maroño
12:48:55	 De  joaquin Arredondo : Joaquin Arredondo
12:48:56	 De  Facundo Suarez : Suarez Facundo
12:48:57	 De  Franco Araya : Franco Araya
12:48:59	 De  Cersar Santiago : Cesar Santiago
12:49:00	 De  Tomas Llorente : Tomas Llorente
12:49:04	 De  Facundo Bermudez : Bermúdez Facundo
12:49:07	 De  lautarouhrich :                       Uhrich lautro 
12:49:09	 De  Facundo Román : Román Facundo
12:49:12	 De  Di Pasquo, Agustín : Di Pasquo, Agustín 
12:49:13	 De  Noguera Mougel Juan Lautaro : Noguera Mougel Juan Lautaro
12:49:13	 De  Leandro Perez : Perez Leandro
12:49:13	 De  PirisFacundo : Piris Facundo
12:49:16	 De  Tomás Melian : Tomás Melian
12:49:17	 De  Rojas Emiliano : Emiliano Rojas
12:49:18	 De  Máximo Andino : Máximo Andino
12:58:39	 De  PirisFacundo : es decir que solo necesitamos acordarnos de los primeros 4?
12:59:27	 De  Leandro Perez : 4 de aiken 0101 y de bcd es 0100
12:59:28	 De  PirisFacundo : orofe lo que dijo Cesar es que el 4 del bcd no tiene que ser igual?
13:03:43	 De  Matias de los Rios : Matias de los Rios
13:03:44	 De  Facundo Pizarro : Facundo Pizarro
13:03:59	 De  joaquin Arredondo : Joaquin arredondo
13:06:07	 De  Santino Marco Rafael Silba Aleman : Santino Marco Rafael Silba Aleman
13:07:56	 De  PirisFacundo : 0101
13:08:04	 De  PirisFacundo : también se puede?
13:10:52	 De  Sebastián Erazo : Sebastián Erazo
13:11:26	 De  Leandro Perez : 1111
13:11:33	 De  PirisFacundo : 1111 el 9?
13:16:28	 De  PirisFacundo : todos con ceros y unos?
