19:49:44	 De  Di Pasquo, Agustín : Rb=10.8KiloRc1=185; valor comercial 180 
19:56:15	 De  Nicolas M. Brito : 👍
19:59:53	 De  Di Pasquo, Agustín : Saludos
20:00:02	 De  Máximo Andino : /salir
20:00:02	 De  Facundo Román : Saludos
