16:08:18	 De  Deheza Erik : Deheza Erik
16:08:20	 De  Joaquin Marrocco : Joaquín Marrocco
16:08:21	 De  Juan Manuel Saiz Laurens : Saiz Laurens Juan Manuel
16:08:24	 De  Nahuel Labarque : Labarque Nahuel
16:08:25	 De  Tomás Sosa : Tomas Sosa
16:08:25	 De  Acosta Joel : Acosta Joel
16:08:25	 De  Tobías Bravo : Tobías Bravo
16:08:28	 De  Lucas Sanguino : Sanguino Lucas
16:08:36	 De  Acosta Joel : Ludovico Arias
16:08:41	 De  Deheza Erik : Deheza Erik
16:09:04	 De  Lucas Bonet : Lucas Bonet
16:09:05	 De  Lautaro Barros : Lautaro Barros
16:10:43	 De  Arroyo Kevin : Arroyo Kevin
16:14:08	 De  Douglas Deheza : Deheza Douglas
