15:32:24	 De  emanuel rodriguez : Rodriguez Emanuel
15:32:28	 De  emanuel rodriguez : yo estbaa pero no se si me había tomado profe
15:33:15	 De  German Reimers : Reimers German
15:33:34	 De  German Reimers : yo llegue tarde
15:33:43	 De  Baliner Ivan : Mal por vos
15:34:22	 De  jonathan corrosa : escriba lo profe
15:35:39	 De  Nicolas Diaz : Buenas tardes profe
15:35:43	 De  Nicolas Diaz : Estamos en el medico con Cornaglia
15:35:56	 De  Nicolas Diaz : Nos pasamos de la hora
15:36:10	 De  Baliner Ivan : Que mal
15:36:32	 De  Homero (Orlando) : mandale un saludo a lara
15:36:53	 De  Nicolas Diaz : Tenia turno para control
15:37:01	 De  Nicolas Diaz : Y me pidió si la acompaño
15:37:04	 De  Nicolas Diaz : Nono
15:37:06	 De  Nicolas Diaz : Por suerte no
15:44:36	 De  Homero (Orlando) : ubuntu
16:00:44	 De  Maximo Camacho : bill gates y su vacuna un poroto
16:00:48	 De  Maximo Camacho : (?
16:01:00	 De  Gabriel Barros : a CASAS
16:04:00	 De  Homero (Orlando) : como el combustible del delorean?
