20:07:58	 De  Agustin Altamirano : Agustín Altamirano
20:08:01	 De  Nieto Maira : Nieto Maira
20:08:02	 De  Soraya Nahir Amarilla : Soraya Nahir Amarilla
20:08:06	 De  Dante Conti : Conti Dante
20:08:14	 De  Chiara Ayala : Ayala Chiara
20:08:14	 De  Mateo Romito : Romito Mateo
20:08:18	 De  Agustín Bentivegna : Agustín Bentivegna
20:08:21	 De  Gonzalo Martín Rojas : Rojas Gonzalo Martín
20:08:55	 De  Ariel Ojeda : FLORES. Nicolás
20:09:05	 De  Soraya Nahir Amarilla : asi d tranquila era la burbuja 2?
20:09:11	 De  Ariel Ojeda : GALLICHE, Cristian
20:09:19	 De  Ariel Ojeda : GARCÍA, Matías
20:09:29	 De  Ariel Ojeda : GONZÁLEZ, Lucila
20:09:46	 De  Ariel Ojeda : MARTÍN SÁNCHEZ, Galo
20:09:59	 De  Ariel Ojeda : MERELE, Dylan
20:10:09	 De  Ariel Ojeda : MIRANDA, Jazmín
20:10:21	 De  Ariel Ojeda : MORENO, Agustín
20:10:26	 De  Ariel Ojeda : NIETO, Maira
20:10:31	 De  Ariel Ojeda : OJEDA, Ariel
20:10:36	 De  Ariel Ojeda : ROJAS, Gonzalo
20:10:42	 De  Ariel Ojeda : ROMITO, Mateo
20:10:54	 De  Caterina Matías : Caterina Matias
20:12:27	 De  Galo : Martín Sánchez, Galo
20:14:44	 De  Miranda Jazmín : Miranda Jazmín
20:14:52	 De  Miranda Jazmín : merele dylan
20:27:02	 De  Iara Albarracín : Albarracin Christian
