launch_status failed=4 1655057884000000000
launch_status broken=0 1655057884000000000
launch_status passed=4 1655057884000000000
launch_status skipped=0 1655057884000000000
launch_status unknown=0 1655057884000000000
launch_time duration=6410655 1655057884000000000
launch_time min_duration=0 1655057884000000000
launch_time max_duration=8 1655057884000000000
launch_time sum_duration=11 1655057884000000000
launch_problems product_defects=4 1655057884000000000
launch_retries retries=28 1655057884000000000
launch_retries run=8 1655057884000000000
