3 t 2
3 t 2
3 t 2
3 t 2
3 t 2
3 t 2
4 t 1
3 t 2
3 t 2
3 t 2
3 t 2
3 t 2
3 t 2
4 t 1
1 t 5
5 n 6
7 t 1
1 t 5
5 n 6
7 t 1
1 t 5
5 n 6
7 t 1
1 t 5
5 n 6
7 t 1
1 t 5
5 n 6
7 t 1
1 t 5
5 n 6
7 t 1
1 t 9
9 n 10
9 t 11
11 t 9
9 n 10
9 t 11
11 t 9
9 n 10
9 t 11
11 t 9
9 n 10
9 t 11
11 t 9
9 n 10
9 t 11
11 t 9
9 n 10
9 t 11
11 t 9
9 n 10
11 t 9
9 n 10
11 t 9
9 n 10
11 t 9
9 n 10
11 t 9
9 n 10
11 t 9
9 n 10
11 t 9
9 n 10
9 t 1