Starting the run of the project cycle time 3
iverilog Simulation run on Mon Mar  6 21:36:29 PST 2017
011481587 on coe-ee-cad37.sjsuad.sjsu.edu
icarus Verilog finishedicarus Verilog completed OK
vcs Simulation run on Mon Mar  6 21:36:47 PST 2017
 simulation OK
NCverilog
NCverilog Simulation run on Mon Mar  6 21:36:56 PST 2017
 simulation OK
synthesis ran
Design synthesized OK
Linux coe-ee-cad37.sjsuad.sjsu.edu 4.9.13-100.fc24.x86_64 #1 SMP Mon Feb 27 16:57:22 UTC 2017 x86_64 x86_64 x86_64 GNU/Linux

Completed Mon Mar  6 21:40:27 PST 2017

3c928e94a6d93a4772e465e5df77eda8  - 011481587 coe-ee-cad37.sjsuad.sjsu.edu
uid=747613870(011481587) gid=1341200513(Domain Users) groups=1341200513(Domain Users),467803384(Electrical Engineering),467929871(COE-LAB-STUDENTS),467943028(ITS-ACL-VDI-ADM255),467943029(ITS-ACL-VDI-ATH-Gadway),467943031(ITS-ACL-VDI-ATH-Shared),467943032(ITS-ACL-VDI-CL505),467943034(ITS-ACL-VDI-CVB-LAB),467943035(ITS-ACL-VDI-SSC-Kiosks),467943036(ITS-ACL-VDI-ENG392),467943037(ITS-ACL-VDI-GP),467943038(ITS-ACL-VDI-DEMO),747647215(Students),747647744(Employees),905744754(ITS-Print-CC2F420i-ACL) context=unconfined_u:unconfined_r:unconfined_t:s0-s0:c0.c1023

Completed Mon Mar  6 21:40:27 PST 2017
