Copyright 1986-2016 Xilinx, Inc. All Rights Reserved.
-------------------------------------------------------------------------------------------
| Tool Version : Vivado v.2016.2 (win64) Build 1577090 Thu Jun  2 16:32:40 MDT 2016
| Date         : Mon Nov 07 11:48:17 2016
| Host         : RohitDhage running 64-bit major release  (build 9200)
| Command      : report_control_sets -verbose -file fpmul_fpga_top_control_sets_placed.rpt
| Design       : fpmul_fpga_top
| Device       : xc7a100t
-------------------------------------------------------------------------------------------

Control Set Information

Table of Contents
-----------------
1. Summary
2. Flip-Flop Distribution
3. Detailed Control Set Information

1. Summary
----------

+----------------------------------------------------------+-------+
|                          Status                          | Count |
+----------------------------------------------------------+-------+
| Number of unique control sets                            |    75 |
| Unused register locations in slices containing registers |   264 |
+----------------------------------------------------------+-------+


2. Flip-Flop Distribution
-------------------------

+--------------+-----------------------+------------------------+-----------------+--------------+
| Clock Enable | Synchronous Set/Reset | Asynchronous Set/Reset | Total Registers | Total Slices |
+--------------+-----------------------+------------------------+-----------------+--------------+
| No           | No                    | No                     |             330 |           90 |
| No           | No                    | Yes                    |             126 |           42 |
| No           | Yes                   | No                     |              76 |           27 |
| Yes          | No                    | No                     |             171 |           49 |
| Yes          | No                    | Yes                    |             170 |           33 |
| Yes          | Yes                   | No                     |             287 |           72 |
+--------------+-----------------------+------------------------+-----------------+--------------+


3. Detailed Control Set Information
-----------------------------------

+---------------------------+--------------------------------------------------------------------------------------------------------------------------------------------------------------------------------------------------------------+-------------------------------------------------------------------------------------------------------------------------------------------------------------------------------------------------------+------------------+----------------+
|        Clock Signal       |                                                                                                 Enable Signal                                                                                                |                                                                                            Set/Reset Signal                                                                                           | Slice Load Count | Bel Load Count |
+---------------------------+--------------------------------------------------------------------------------------------------------------------------------------------------------------------------------------------------------------+-------------------------------------------------------------------------------------------------------------------------------------------------------------------------------------------------------+------------------+----------------+
|  dcm/inst/clk             |                                                                                                                                                                                                              | dbg_hub/inst/CORE_XSDB.UUT_MASTER/U_XSDB_BUS_CONTROLLER/clr_rd_req                                                                                                                                    |                1 |              1 |
|  dcm/inst/clk             |                                                                                                                                                                                                              | dbg_hub/inst/CORE_XSDB.UUT_MASTER/U_ICON_INTERFACE/U_CMD6_WR/U_WR_FIFO/SUBCORE_FIFO.xsdbm_v1_1_3_wrfifo_inst/inst_fifo_gen/gconvfifo.rf/grf.rf/rstblk/rst_rd_reg2                                     |                1 |              1 |
|  dbg_hub/inst/idrck       |                                                                                                                                                                                                              | dbg_hub/inst/CORE_XSDB.UUT_MASTER/U_ICON_INTERFACE/U_CMD6_RD/U_RD_FIFO/SUBCORE_FIFO.xsdbm_v1_1_3_rdfifo_inst/inst_fifo_gen/gconvfifo.rf/grf.rf/rstblk/rst_rd_reg2                                     |                1 |              1 |
|  dcm/inst/clk             |                                                                                                                                                                                                              | dbg_hub/inst/CORE_XSDB.UUT_MASTER/U_XSDB_BUS_CONTROLLER/clr_abort_rd                                                                                                                                  |                1 |              1 |
|  dbg_hub/inst/idrck       |                                                                                                                                                                                                              | dbg_hub/inst/CORE_XSDB.UUT_MASTER/U_ICON_INTERFACE/U_CMD6_WR/U_WR_FIFO/SUBCORE_FIFO.xsdbm_v1_1_3_wrfifo_inst/inst_fifo_gen/gconvfifo.rf/grf.rf/rstblk/rst_wr_reg2                                     |                1 |              1 |
|  dcm/inst/clk             |                                                                                                                                                                                                              | dbg_hub/inst/CORE_XSDB.UUT_MASTER/U_ICON_INTERFACE/U_CMD6_RD/U_RD_FIFO/SUBCORE_FIFO.xsdbm_v1_1_3_rdfifo_inst/inst_fifo_gen/gconvfifo.rf/grf.rf/rstblk/rst_wr_reg2                                     |                1 |              1 |
|  dcm/inst/clk             | dbg_hub/inst/CORE_XSDB.UUT_MASTER/U_ICON_INTERFACE/U_CMD7_STAT/stat_reg_ld[1]                                                                                                                                |                                                                                                                                                                                                       |                1 |              1 |
|  dbg_hub/inst/UPDATE_temp |                                                                                                                                                                                                              | dbg_hub/inst/N_EXT_BSCAN.bscan_inst/AR[0]                                                                                                                                                             |                1 |              1 |
|  dcm/inst/clk             |                                                                                                                                                                                                              | vio/inst/DECODER_INST/SR[0]                                                                                                                                                                           |                1 |              2 |
|  dcm/inst/clk             |                                                                                                                                                                                                              | dbg_hub/inst/CORE_XSDB.UUT_MASTER/U_ICON_INTERFACE/U_CMD6_WR/U_WR_FIFO/SUBCORE_FIFO.xsdbm_v1_1_3_wrfifo_inst/inst_fifo_gen/gconvfifo.rf/grf.rf/rstblk/ngwrdrst.grst.g7serrst.rd_rst_reg[2]_i_1_n_0    |                1 |              2 |
|  dcm/inst/clk             |                                                                                                                                                                                                              | dbg_hub/inst/CORE_XSDB.UUT_MASTER/U_ICON_INTERFACE/U_CMD6_WR/U_WR_FIFO/SUBCORE_FIFO.xsdbm_v1_1_3_wrfifo_inst/inst_fifo_gen/gconvfifo.rf/grf.rf/rstblk/Q[1]                                            |                1 |              2 |
|  dbg_hub/inst/idrck       | dbg_hub/inst/CORE_XSDB.U_ICON/U_CMD/control_icon2xsdb[0]                                                                                                                                                     |                                                                                                                                                                                                       |                1 |              2 |
|  dcm/inst/clk             |                                                                                                                                                                                                              | dbg_hub/inst/CORE_XSDB.UUT_MASTER/U_ICON_INTERFACE/U_CMD6_RD/U_RD_FIFO/SUBCORE_FIFO.xsdbm_v1_1_3_rdfifo_inst/inst_fifo_gen/gconvfifo.rf/grf.rf/rstblk/ngwrdrst.grst.g7serrst.wr_rst_reg[1]_i_1__0_n_0 |                1 |              2 |
|  dbg_hub/inst/idrck       |                                                                                                                                                                                                              | dbg_hub/inst/CORE_XSDB.UUT_MASTER/U_ICON_INTERFACE/U_CMD6_WR/U_WR_FIFO/SUBCORE_FIFO.xsdbm_v1_1_3_wrfifo_inst/inst_fifo_gen/gconvfifo.rf/grf.rf/rstblk/ngwrdrst.grst.g7serrst.wr_rst_reg[1]_i_1_n_0    |                1 |              2 |
|  dbg_hub/inst/idrck       | dbg_hub/inst/CORE_XSDB.U_ICON/U_CMD/control_icon2xsdb[2]                                                                                                                                                     |                                                                                                                                                                                                       |                2 |              3 |
|  dbg_hub/inst/idrck       |                                                                                                                                                                                                              | dbg_hub/inst/CORE_XSDB.UUT_MASTER/U_ICON_INTERFACE/U_CMD6_RD/U_RD_FIFO/SUBCORE_FIFO.xsdbm_v1_1_3_rdfifo_inst/inst_fifo_gen/gconvfifo.rf/grf.rf/rstblk/ngwrdrst.grst.g7serrst.rd_rst_reg[2]_i_1__0_n_0 |                1 |              3 |
|  dcm/inst/clk             |                                                                                                                                                                                                              | dbg_hub/inst/CORE_XSDB.UUT_MASTER/U_XSDB_BUS_CONTROLLER/sl_iport0_o[0]                                                                                                                                |                1 |              3 |
|  dcm/inst/clk             | dbg_hub/inst/CORE_XSDB.UUT_MASTER/U_ICON_INTERFACE/U_CMD3/stat_reg_ld[1]                                                                                                                                     |                                                                                                                                                                                                       |                1 |              3 |
|  dbg_hub/inst/idrck       | dbg_hub/inst/CORE_XSDB.U_ICON/U_CMD/control_icon2xsdb[5]                                                                                                                                                     |                                                                                                                                                                                                       |                1 |              3 |
|  dbg_hub/inst/idrck       | dbg_hub/inst/CORE_XSDB.U_ICON/U_CMD/control_icon2xsdb[5]                                                                                                                                                     | dbg_hub/inst/CORE_XSDB.UUT_MASTER/U_ICON_INTERFACE/U_CMD1/AR[0]                                                                                                                                       |                1 |              3 |
|  dcm/inst/clk             |                                                                                                                                                                                                              | vio/inst/DECODER_INST/Bus_data_out[10]_i_1_n_0                                                                                                                                                        |                1 |              4 |
|  dcm/inst/clk             |                                                                                                                                                                                                              | vio/inst/PROBE_OUT_ALL_INST/G_PROBE_OUT[2].PROBE_OUT0_INST/probe_out2[1]                                                                                                                              |                3 |              4 |
|  dbg_hub/inst/idrck       | dbg_hub/inst/CORE_XSDB.U_ICON/U_CMD/control_icon2xsdb[1]                                                                                                                                                     |                                                                                                                                                                                                       |                2 |              4 |
|  dbg_hub/inst/idrck       |                                                                                                                                                                                                              | dbg_hub/inst/CORE_XSDB.U_ICON/U_CMD/shift_bit_count_reg[0]_0[0]                                                                                                                                       |                1 |              4 |
|  dcm/inst/clk             |                                                                                                                                                                                                              | dbg_hub/inst/CORE_XSDB.U_ICON/U_CMD/ngwrdrst.grst.g7serrst.rst_wr_reg1_reg[0]                                                                                                                         |                2 |              4 |
|  dbg_hub/inst/idrck       |                                                                                                                                                                                                              | dbg_hub/inst/CORE_XSDB.UUT_MASTER/U_ICON_INTERFACE/U_CMD5/SR[0]                                                                                                                                       |                1 |              4 |
|  dbg_hub/inst/idrck       |                                                                                                                                                                                                              | dbg_hub/inst/CORE_XSDB.U_ICON/U_CMD/ngwrdrst.grst.g7serrst.rst_wr_reg1_reg[0]                                                                                                                         |                2 |              4 |
|  dcm/inst/clk             | dbg_hub/inst/CORE_XSDB.UUT_MASTER/U_ICON_INTERFACE/U_CMD2/stat_reg_ld[1]                                                                                                                                     |                                                                                                                                                                                                       |                1 |              4 |
|  dcm/inst/clk             | vio/inst/DECODER_INST/wr_control_reg                                                                                                                                                                         | dbg_hub/inst/CORE_XSDB.UUT_MASTER/U_XSDB_BUS_CONTROLLER/sl_iport0_o[0]                                                                                                                                |                1 |              4 |
|  dcm/inst/clk             |                                                                                                                                                                                                              | vio/inst/U_XSDB_SLAVE/reg_do[15]_i_1_n_0                                                                                                                                                              |                1 |              5 |
|  dcm/inst/clk             | vio/inst/PROBE_IN_INST/Read_int                                                                                                                                                                              | vio/inst/PROBE_IN_INST/addr_count_reg0                                                                                                                                                                |                1 |              5 |
|  dbg_hub/inst/idrck       |                                                                                                                                                                                                              | dbg_hub/inst/CORE_XSDB.U_ICON/U_CMD/SR[0]                                                                                                                                                             |                1 |              6 |
|  dbg_hub/inst/idrck       |                                                                                                                                                                                                              | dbg_hub/inst/CORE_XSDB.UUT_MASTER/U_ICON_INTERFACE/U_CMD6_RD/U_RD_FIFO/SUBCORE_FIFO.xsdbm_v1_1_3_rdfifo_inst/inst_fifo_gen/gconvfifo.rf/grf.rf/rstblk/Q[2]                                            |                1 |              6 |
|  dcm/inst/clk             | fpmul/cu/eap_reg[6]_1                                                                                                                                                                                        | fpmul/dp/eap[6]_i_1_n_0                                                                                                                                                                               |                3 |              7 |
|  dbg_hub/inst/idrck       |                                                                                                                                                                                                              | dbg_hub/inst/CORE_XSDB.U_ICON/U_CMD/stat_addr_bit_cnt_reg[6][0]                                                                                                                                       |                2 |              7 |
|  dcm/inst/clk             |                                                                                                                                                                                                              | vio/inst/U_XSDB_SLAVE/reg_do[10]_i_1_n_0                                                                                                                                                              |                2 |              7 |
|  dcm/inst/clk             | dbg_hub/inst/CORE_XSDB.UUT_MASTER/U_XSDB_BUS_CONTROLLER/gpr1.dout_i_reg[15][0]                                                                                                                               | dbg_hub/inst/CORE_XSDB.UUT_MASTER/U_ICON_INTERFACE/U_CMD6_WR/U_WR_FIFO/SUBCORE_FIFO.xsdbm_v1_1_3_wrfifo_inst/inst_fifo_gen/gconvfifo.rf/grf.rf/rstblk/Q[1]                                            |                2 |              8 |
|  dcm/inst/clk             |                                                                                                                                                                                                              | dbg_hub/inst/CORE_XSDB.UUT_MASTER/U_XSDB_BUS_CONTROLLER/timer_rst                                                                                                                                     |                2 |              8 |
|  dbg_hub/inst/idrck       |                                                                                                                                                                                                              | dbg_hub/inst/CORE_XSDB.U_ICON/U_SYNC/SR[0]                                                                                                                                                            |                2 |              8 |
|  dbg_hub/inst/idrck       | dbg_hub/inst/CORE_XSDB.UUT_MASTER/U_ICON_INTERFACE/U_CMD6_RD/U_RD_FIFO/SUBCORE_FIFO.xsdbm_v1_1_3_rdfifo_inst/inst_fifo_gen/gconvfifo.rf/grf.rf/gntv_or_sync_fifo.gl0.rd/gr1.rfwft/gc0.count_d1_reg[3][0]     | dbg_hub/inst/CORE_XSDB.UUT_MASTER/U_ICON_INTERFACE/U_CMD6_RD/U_RD_FIFO/SUBCORE_FIFO.xsdbm_v1_1_3_rdfifo_inst/inst_fifo_gen/gconvfifo.rf/grf.rf/rstblk/Q[2]                                            |                2 |              8 |
|  dcm/inst/clk             | fpmul/cu/ld_inputs                                                                                                                                                                                           | fpmul/cu/clr_flags                                                                                                                                                                                    |                2 |              9 |
|  dbg_hub/inst/idrck       | dbg_hub/inst/N_EXT_BSCAN.bscan_inst/iTARGET_reg[6][0]                                                                                                                                                        | dbg_hub/inst/N_EXT_BSCAN.bscan_inst/AR[0]                                                                                                                                                             |                2 |             10 |
|  dbg_hub/inst/idrck       |                                                                                                                                                                                                              |                                                                                                                                                                                                       |                8 |             11 |
|  dcm/inst/clk             | dbg_hub/inst/CORE_XSDB.UUT_MASTER/U_XSDB_BUS_CONTROLLER/E[0]                                                                                                                                                 | dbg_hub/inst/CORE_XSDB.UUT_MASTER/U_ICON_INTERFACE/U_CMD6_RD/U_RD_FIFO/SUBCORE_FIFO.xsdbm_v1_1_3_rdfifo_inst/inst_fifo_gen/gconvfifo.rf/grf.rf/rstblk/gic0.gc0.count_d2_reg[0][1]                     |                2 |             12 |
|  dbg_hub/inst/idrck       | dbg_hub/inst/CORE_XSDB.UUT_MASTER/U_ICON_INTERFACE/U_CMD6_WR/U_WR_FIFO/SUBCORE_FIFO.xsdbm_v1_1_3_wrfifo_inst/inst_fifo_gen/gconvfifo.rf/grf.rf/gntv_or_sync_fifo.gl0.wr/gwas.wsts/E[0]                       | dbg_hub/inst/CORE_XSDB.UUT_MASTER/U_ICON_INTERFACE/U_CMD6_WR/U_WR_FIFO/SUBCORE_FIFO.xsdbm_v1_1_3_wrfifo_inst/inst_fifo_gen/gconvfifo.rf/grf.rf/rstblk/gic0.gc0.count_reg[0][1]                        |                4 |             12 |
|  dcm/inst/clk             |                                                                                                                                                                                                              | fpmul/cu/clr_flags                                                                                                                                                                                    |               10 |             14 |
|  dcm/inst/clk             | dbg_hub/inst/CORE_XSDB.UUT_MASTER/U_XSDB_BUS_CONTROLLER/gpr1.dout_i_reg[15][0]                                                                                                                               |                                                                                                                                                                                                       |                2 |             16 |
|  dcm/inst/clk             | vio/inst/U_XSDB_SLAVE/reg_test0                                                                                                                                                                              |                                                                                                                                                                                                       |                3 |             16 |
|  dcm/inst/clk             |                                                                                                                                                                                                              | dbg_hub/inst/CORE_XSDB.UUT_MASTER/U_ICON_INTERFACE/U_CMD6_WR/U_WR_FIFO/SUBCORE_FIFO.xsdbm_v1_1_3_wrfifo_inst/inst_fifo_gen/gconvfifo.rf/grf.rf/rstblk/Q[0]                                            |                3 |             16 |
|  dbg_hub/inst/idrck       |                                                                                                                                                                                                              | dbg_hub/inst/CORE_XSDB.UUT_MASTER/U_ICON_INTERFACE/U_CMD6_RD/U_RD_FIFO/SUBCORE_FIFO.xsdbm_v1_1_3_rdfifo_inst/inst_fifo_gen/gconvfifo.rf/grf.rf/rstblk/Q[1]                                            |                3 |             16 |
|  dbg_hub/inst/idrck       | dbg_hub/inst/CORE_XSDB.UUT_MASTER/U_ICON_INTERFACE/U_CMD6_RD/U_RD_FIFO/SUBCORE_FIFO.xsdbm_v1_1_3_rdfifo_inst/inst_fifo_gen/gconvfifo.rf/grf.rf/gntv_or_sync_fifo.gl0.rd/gr1.rfwft/goreg_dm.dout_i_reg[15][0] |                                                                                                                                                                                                       |                2 |             16 |
|  dbg_hub/inst/idrck       | dbg_hub/inst/CORE_XSDB.U_ICON/U_CMD/E[0]                                                                                                                                                                     | dbg_hub/inst/CORE_XSDB.U_ICON/U_CMD/ngwrdrst.grst.g7serrst.rst_wr_reg1_reg[0]                                                                                                                         |                4 |             16 |
|  dcm/inst/clk             | vio/inst/DECODER_INST/wr_probe_out_modified                                                                                                                                                                  | vio/inst/DECODER_INST/SR[0]                                                                                                                                                                           |                4 |             16 |
|  dbg_hub/inst/idrck       | dbg_hub/inst/CORE_XSDB.U_ICON/U_CMD/shift_reg_in_reg[15][0]                                                                                                                                                  | dbg_hub/inst/CORE_XSDB.U_ICON/U_CMD/ngwrdrst.grst.g7serrst.rst_wr_reg1_reg[0]                                                                                                                         |                2 |             16 |
|  dbg_hub/inst/idrck       | dbg_hub/inst/CORE_XSDB.UUT_MASTER/U_ICON_INTERFACE/U_CMD6_RD/U_RD_FIFO/SUBCORE_FIFO.xsdbm_v1_1_3_rdfifo_inst/inst_fifo_gen/gconvfifo.rf/grf.rf/gntv_or_sync_fifo.gl0.rd/gr1.rfwft/E[0]                       |                                                                                                                                                                                                       |                3 |             16 |
|  dcm/inst/clk             | dbg_hub/inst/CORE_XSDB.UUT_MASTER/U_XSDB_BUS_CONTROLLER/burst_wd_reg[16]                                                                                                                                     | dbg_hub/inst/CORE_XSDB.UUT_MASTER/U_ICON_INTERFACE/U_CMD1/AR[0]                                                                                                                                       |                5 |             17 |
|  dbg_hub/inst/idrck       |                                                                                                                                                                                                              | dbg_hub/inst/CORE_XSDB.UUT_MASTER/U_ICON_INTERFACE/U_CMD6_WR/U_WR_FIFO/SUBCORE_FIFO.xsdbm_v1_1_3_wrfifo_inst/inst_fifo_gen/gconvfifo.rf/grf.rf/rstblk/gic0.gc0.count_reg[0][0]                        |                4 |             17 |
|  dcm/inst/clk             | dbg_hub/inst/CORE_XSDB.UUT_MASTER/U_XSDB_BUS_CONTROLLER/addr_reg[0]                                                                                                                                          | dbg_hub/inst/CORE_XSDB.UUT_MASTER/U_ICON_INTERFACE/U_CMD1/AR[0]                                                                                                                                       |                5 |             17 |
|  dcm/inst/clk             |                                                                                                                                                                                                              | dbg_hub/inst/CORE_XSDB.UUT_MASTER/U_ICON_INTERFACE/U_CMD6_RD/U_RD_FIFO/SUBCORE_FIFO.xsdbm_v1_1_3_rdfifo_inst/inst_fifo_gen/gconvfifo.rf/grf.rf/rstblk/gic0.gc0.count_d2_reg[0][0]                     |                4 |             18 |
|  dcm/inst/clk             | dbg_hub/inst/CORE_XSDB.UUT_MASTER/U_ICON_INTERFACE/U_CMD5/ctl_reg[17]_i_1_n_0                                                                                                                                | dbg_hub/inst/CORE_XSDB.UUT_MASTER/U_ICON_INTERFACE/U_CMD1/AR[0]                                                                                                                                       |                3 |             18 |
|  dbg_hub/inst/idrck       | dbg_hub/inst/CORE_XSDB.U_ICON/U_CMD/control_icon2xsdb[4]                                                                                                                                                     | dbg_hub/inst/CORE_XSDB.UUT_MASTER/U_ICON_INTERFACE/U_CMD1/AR[0]                                                                                                                                       |                3 |             18 |
|  dcm/inst/clk             | fpmul/cu/map0[0]                                                                                                                                                                                             |                                                                                                                                                                                                       |                9 |             24 |
|  dcm/inst/clk             | fpmul/cu/E[0]                                                                                                                                                                                                |                                                                                                                                                                                                       |               11 |             24 |
|  dbg_hub/inst/idrck       | dbg_hub/inst/CORE_XSDB.UUT_MASTER/U_ICON_INTERFACE/U_CMD6_WR/U_WR_FIFO/SUBCORE_FIFO.xsdbm_v1_1_3_wrfifo_inst/inst_fifo_gen/gconvfifo.rf/grf.rf/gntv_or_sync_fifo.gl0.wr/gwas.wsts/E[0]                       |                                                                                                                                                                                                       |                3 |             24 |
|  dcm/inst/clk             | dbg_hub/inst/CORE_XSDB.UUT_MASTER/U_XSDB_BUS_CONTROLLER/E[0]                                                                                                                                                 |                                                                                                                                                                                                       |                3 |             24 |
|  dcm/inst/clk             |                                                                                                                                                                                                              | dbg_hub/inst/CORE_XSDB.UUT_MASTER/U_ICON_INTERFACE/U_CMD1/AR[0]                                                                                                                                       |               10 |             27 |
|  dbg_hub/inst/idrck       | dbg_hub/inst/CORE_XSDB.U_ICON/U_CMD/control_icon2xsdb[3]                                                                                                                                                     | dbg_hub/inst/CORE_XSDB.UUT_MASTER/U_ICON_INTERFACE/U_CMD1/AR[0]                                                                                                                                       |                4 |             28 |
|  dcm/inst/clk             | dbg_hub/inst/CORE_XSDB.UUT_MASTER/U_ICON_INTERFACE/U_CMD4/ctl_reg[27]_i_1_n_0                                                                                                                                | dbg_hub/inst/CORE_XSDB.UUT_MASTER/U_ICON_INTERFACE/U_CMD1/AR[0]                                                                                                                                       |                5 |             28 |
|  dcm/inst/clk             | vio/inst/PROBE_OUT_ALL_INST/G_PROBE_OUT[1].wr_probe_out_reg                                                                                                                                                  | vio/inst/DECODER_INST/SR[0]                                                                                                                                                                           |                6 |             32 |
|  dcm/inst/clk             | vio/inst/PROBE_OUT_ALL_INST/G_PROBE_OUT[0].wr_probe_out_reg                                                                                                                                                  | vio/inst/DECODER_INST/SR[0]                                                                                                                                                                           |                9 |             32 |
|  dcm/inst/clk             | fpmul/cu/p_zf_reg[0]                                                                                                                                                                                         | fpmul/cu/clr_flags                                                                                                                                                                                    |                9 |             36 |
|  dcm/inst/clk             | vio/inst/DECODER_INST/E[0]                                                                                                                                                                                   |                                                                                                                                                                                                       |               10 |             39 |
|  dcm/inst/clk             | fpmul/cu/done                                                                                                                                                                                                | vio/inst/PROBE_OUT_ALL_INST/G_PROBE_OUT[2].PROBE_OUT0_INST/probe_out2[1]                                                                                                                              |                7 |             39 |
|  dcm/inst/clk             | vio/inst/PROBE_OUT_ALL_INST/Committ_2                                                                                                                                                                        | vio/inst/DECODER_INST/SR[0]                                                                                                                                                                           |               19 |             66 |
|  dcm/inst/clk             |                                                                                                                                                                                                              |                                                                                                                                                                                                       |               82 |            319 |
+---------------------------+--------------------------------------------------------------------------------------------------------------------------------------------------------------------------------------------------------------+-------------------------------------------------------------------------------------------------------------------------------------------------------------------------------------------------------+------------------+----------------+


