<?xml version="1.0" encoding="utf-8"?>
<!-- Generator: Adobe Illustrator 22.1.0, SVG Export Plug-In . SVG Version: 6.00 Build 0)  -->
<svg version="1.1" id="Layer_1" xmlns="http://www.w3.org/2000/svg" xmlns:xlink="http://www.w3.org/1999/xlink" x="0px" y="0px"
	 viewBox="0 0 80 80" style="enable-background:new 0 0 80 80;" xml:space="preserve">
<title>Asset 10</title>
<g id="Layer_2_1_">
	<g id="Layer_1-2">
		<path d="M40,77.2c-1.2,0-2.4-0.4-3.4-1C32.8,74,0,53.3,0,29.8c0-16.1,10.7-27,26.7-27c5,0.1,9.8,2.2,13.3,5.7
			c3.6-3.5,8.3-5.6,13.3-5.7c15.9,0,26.7,10.9,26.7,27c0,23.5-32.8,44.1-36.6,46.4C42.4,76.8,41.2,77.2,40,77.2z"/>
	</g>
</g>
</svg>
