['h_提供未到帳資訊']	9点18分，20500	 B-TIM I-TIM I-TIM I-TIM I-TIM O B-MON I-MON I-MON I-MON I-MON
['h_提供未到帳資訊', 'h_充值']	13点28分充100	 B-TIM I-TIM I-TIM I-TIM I-TIM I-TIM O B-MON I-MON I-MON
['h_提供未到帳資訊']	11：21分，500元	 B-TIM I-TIM I-TIM I-TIM I-TIM I-TIM O B-MON I-MON I-MON O
['h_提供未到帳資訊']	100。13点08分	 B-MON I-MON I-MON O B-TIM I-TIM I-TIM I-TIM I-TIM I-TIM
['h_提供未到帳資訊']	时间是13点31分	 O O O B-TIM I-TIM I-TIM I-TIM I-TIM I-TIM
['h_提供未到帳資訊']	时间19.57分	 O O B-TIM I-TIM I-TIM I-TIM I-TIM I-TIM
['h_提供未到帳資訊']	时间11.58	 O O B-TIM I-TIM I-TIM I-TIM I-TIM
['h_提供未到帳資訊']	一笔，22点59分	 O O O B-TIM I-TIM I-TIM I-TIM I-TIM I-TIM
['h_提供未到帳資訊']	5月30日10点16分	 B-DATE I-DATE I-DATE I-DATE I-DATE B-TIM I-TIM I-TIM I-TIM I-TIM I-TIM
['h_提供未到帳資訊']	2点28分3000元	 B-TIM I-TIM I-TIM I-TIM I-TIM B-MON I-MON I-MON I-MON I-MON
['h_提供未到帳資訊']	22点59分左右	 B-TIM I-TIM I-TIM I-TIM I-TIM I-TIM I-TIM I-TIM
['h_提供未到帳資訊', 'h_转账']	20点17分到帐	 B-TIM I-TIM I-TIM I-TIM I-TIM I-TIM O O
['h_提供未到帳資訊']	14点10分53秒	 B-TIM I-TIM I-TIM I-TIM I-TIM I-TIM I-TIM I-TIM I-TIM
['h_提供未到帳資訊']	13:22分51秒	 B-TIM I-TIM I-TIM I-TIM I-TIM I-TIM I-TIM I-TIM I-TIM
['h_提供未到帳資訊']	11:33分微信	 B-TIM I-TIM I-TIM I-TIM I-TIM I-TIM B-CHA I-CHA
['h_提供未到帳資訊']	时间4点55	 O O B-TIM I-TIM I-TIM I-TIM
['h_提供未到帳資訊']	9点20左右	 B-TIM I-TIM I-TIM I-TIM I-TIM I-TIM
['h_提供未到帳資訊']	6月1号04:45分	 B-DATE I-DATE I-DATE I-DATE B-TIM I-TIM I-TIM I-TIM I-TIM I-TIM
['h_提供未到帳資訊']	50元7点02分	 B-MON I-MON I-MON B-TIM I-TIM I-TIM I-TIM I-TIM
['h_提供未到帳資訊']	3点08，50元	 B-TIM I-TIM I-TIM I-TIM O B-MON I-MON I-MON
['h_提供未到帳資訊']	23:03分	 B-TIM I-TIM I-TIM I-TIM I-TIM I-TIM
['h_提供未到帳資訊']	22点18呢	 B-TIM I-TIM I-TIM I-TIM I-TIM O
['h_提供未到帳資訊']	21点12	 B-TIM I-TIM I-TIM I-TIM I-TIM
['h_提供未到帳資訊']	20点40	 B-TIM I-TIM I-TIM I-TIM I-TIM
['h_提供未到帳資訊']	18点28	 B-TIM I-TIM I-TIM I-TIM I-TIM
['h_提供未到帳資訊']	17点32	 B-TIM I-TIM I-TIM I-TIM I-TIM
['h_提供未到帳資訊']	16点50分	 B-TIM I-TIM I-TIM I-TIM I-TIM I-TIM
['h_提供未到帳資訊']	14点52分	 B-TIM I-TIM I-TIM I-TIM I-TIM I-TIM
['h_提供未到帳資訊']	14点12分	 B-TIM I-TIM I-TIM I-TIM I-TIM I-TIM
['h_提供未到帳資訊']	12点38分	 B-TIM I-TIM I-TIM I-TIM I-TIM I-TIM
['h_提供未到帳資訊']	12点12分47秒	 B-TIM I-TIM I-TIM I-TIM I-TIM I-TIM I-TIM I-TIM I-TIM
['h_提供未到帳資訊']	11点46分	 B-TIM I-TIM I-TIM I-TIM I-TIM I-TIM
['h_提供未到帳資訊']	11点40分	 B-TIM I-TIM I-TIM I-TIM I-TIM I-TIM
['h_提供未到帳資訊']	11点39到的账	 B-TIM I-TIM I-TIM I-TIM I-TIM O O O
['h_提供未到帳資訊']	11点10分	 B-TIM I-TIM I-TIM I-TIM I-TIM I-TIM
['h_提供未到帳資訊']	10点43	 B-TIM I-TIM I-TIM I-TIM I-TIM
['h_提供未到帳資訊']	10点21分	 B-TIM I-TIM I-TIM I-TIM I-TIM I-TIM
['h_提供未到帳資訊']	8点26	 B-TIM I-TIM I-TIM I-TIM
['h_提供未到帳資訊']	4点25分	 B-TIM I-TIM I-TIM I-TIM I-TIM
['h_提供未到帳資訊']	4点10分	 B-TIM I-TIM I-TIM I-TIM I-TIM
['h_提供未到帳資訊']	2点45	 B-TIM I-TIM I-TIM I-TIM
['h_提供未到帳資訊']	23点	 B-TIM I-TIM I-TIM
['h_提供未到帳資訊']	1点46	 B-TIM I-TIM I-TIM I-TIM
['h_提供未到帳資訊']	12点12	 B-TIM I-TIM I-TIM I-TIM I-TIM
['h_已提供QQ憑證資訊']	我已经发了呀	 O O O O O O
['h_已提供QQ憑證資訊']	已经提供了	 O O O O O
['h_已提供QQ憑證資訊']	载图发了	 O O O O
['h_已提供QQ憑證資訊']	提供了，	 O O O O
['h_已提供QQ憑證資訊']	提供了啊	 O O O O
['h_已提供QQ憑證資訊']	提供了	 O O O
['h_已提供QQ憑證資訊']	截图已发	 O O O O
['h_已提供QQ憑證資訊']	我提供了	 O O O O
['h_已提供QQ憑證資訊']	我发好了	 O O O O
['h_已提供QQ憑證資訊']	已经发了	 O O O O
['h_已提供QQ憑證資訊']	已发截图	 O O O O
['h_已提供QQ憑證資訊']	已发了	 O O O
['h_已提供QQ憑證資訊', 'h_催促']	发了速度	 O O O O
['h_已提供QQ憑證資訊']	全部都发了	 O O O O O
['h_已提供QQ憑證資訊']	QQ发了	 O O O O
['h_已提供QQ憑證資訊']	都发送了	 O O O O
['h_已提供QQ憑證資訊']	我提供过了	 O O O O O
['h_已提供QQ憑證資訊']	发过了	 O O O
['h_已提供QQ憑證資訊']	发完了	 O O O
['h_已提供QQ憑證資訊']	发了啊	 O O O
['h_已提供QQ憑證資訊']	发了	 O O
['h_已提供QQ憑證資訊']	也发了	 O O O
['h_提供未到帳資訊', 'h_未到帳']	2019-06-0111:25:10。。支付方式。。零钱。。交易单号。。4200000296201906011538017125。。商户单号。。7895255475410474。。这是第二次没到	 B-DATE I-DATE I-DATE I-DATE I-DATE I-DATE I-DATE I-DATE I-DATE I-DATE B-TIM I-TIM I-TIM I-TIM I-TIM I-TIM I-TIM I-TIM O O O O O O O O O O O O O O O O O O B-order I-order I-order I-order I-order I-order I-order I-order I-order I-order I-order I-order I-order I-order I-order I-order I-order I-order I-order I-order I-order I-order I-order I-order I-order I-order I-order I-order O O O O O O O O B-order I-order I-order I-order I-order I-order I-order I-order I-order I-order I-order I-order I-order I-order I-order I-order O O O O O O O O O
['h_提供未到帳資訊']	2019-06-0111:25:10。。支付方式。。零钱。。交易单号。。4200000296201906011538017125。。商户单号。。7895255475410474。。这是第一次到了	 B-DATE I-DATE I-DATE I-DATE I-DATE I-DATE I-DATE I-DATE I-DATE I-DATE B-TIM I-TIM I-TIM I-TIM I-TIM I-TIM I-TIM I-TIM O O O O O O O O O O O O O O O O O O B-order I-order I-order I-order I-order I-order I-order I-order I-order I-order I-order I-order I-order I-order I-order I-order I-order I-order I-order I-order I-order I-order I-order I-order I-order I-order I-order I-order O O O O O O O O B-order I-order I-order I-order I-order I-order I-order I-order I-order I-order I-order I-order I-order I-order I-order I-order O O O O O O O O O
['h_提供未到帳資訊', 'h_转账']	22567。。支付方式。。零钱。。转账时间。。2019-06-0111:39:32。。转账单号。。10000499012019060100080082239209。。只有这个了	 O O O O O O O O O O O O O O O O O O O O O O O B-DATE I-DATE I-DATE I-DATE I-DATE I-DATE I-DATE I-DATE I-DATE I-DATE B-TIM I-TIM I-TIM I-TIM I-TIM I-TIM I-TIM I-TIM O O O O O O O O B-order I-order I-order I-order I-order I-order I-order I-order I-order I-order I-order I-order I-order I-order I-order I-order I-order I-order I-order I-order I-order I-order I-order I-order I-order I-order I-order I-order I-order I-order I-order I-order O O O O O O O
['h_提供未到帳資訊']	2019-06-0111:25:10。。支付方式。。零钱。。交易单号。。4200000296201906011538017125。。商户单号。。7895255475410474	 B-DATE I-DATE I-DATE I-DATE I-DATE I-DATE I-DATE I-DATE I-DATE I-DATE B-TIM I-TIM I-TIM I-TIM I-TIM I-TIM I-TIM I-TIM O O O O O O O O O O O O O O O O O O B-order I-order I-order I-order I-order I-order I-order I-order I-order I-order I-order I-order I-order I-order I-order I-order I-order I-order I-order I-order I-order I-order I-order I-order I-order I-order I-order I-order O O O O O O O O B-order I-order I-order I-order I-order I-order I-order I-order I-order I-order I-order I-order I-order I-order I-order I-order
['h_提供未到帳資訊', 'h_转账']	。转账时间。2019-06-0102:05:37。到账时间。2019-06-0102:05:41。支付方式。	 O O O O O O B-DATE I-DATE I-DATE I-DATE I-DATE I-DATE I-DATE I-DATE I-DATE I-DATE B-TIM I-TIM I-TIM I-TIM I-TIM I-TIM I-TIM I-TIM O O O O O O O O O O O O O O O O B-TIM I-TIM I-TIM I-TIM I-TIM I-TIM I-TIM I-TIM O O O O O O
['h_提供未到帳資訊']	名字，不阿，时间2019-06-0118:37，金额50，	 O O O O O O O O B-DATE I-DATE I-DATE I-DATE I-DATE I-DATE I-DATE I-DATE I-DATE I-DATE B-TIM I-TIM I-TIM I-TIM I-TIM O O O B-MON I-MON O
['h_提供未到帳資訊']	银行卡兌换1950元2015年5月31号1点18分	 B-CHA I-CHA I-CHA O O B-MON I-MON I-MON I-MON I-MON B-DATE I-DATE I-DATE I-DATE I-DATE I-DATE I-DATE I-DATE I-DATE I-DATE B-TIM I-TIM I-TIM I-TIM I-TIM
['h_提供未到帳資訊', 'h_兌換']	兑换金币19521。时间2019-5，31	 O O B-GOLD I-GOLD I-GOLD I-GOLD I-GOLD I-GOLD I-GOLD O O O B-DATE I-DATE I-DATE I-DATE I-DATE I-DATE I-DATE I-DATE I-DATE
['h_兌換']	兑换时间是5月31日1点13分42秒。现金250元	 O O O O O B-DATE I-DATE I-DATE I-DATE I-DATE B-TIM I-TIM I-TIM I-TIM I-TIM I-TIM I-TIM I-TIM O O O B-MON I-MON I-MON I-MON
['h_兌換']	兑换32689时间2016-5-30	 O O B-MON I-MON I-MON I-MON I-MON O O B-DATE I-DATE I-DATE I-DATE I-DATE I-DATE I-DATE I-DATE I-DATE
['h_提供未到帳資訊']	2019。61。到账时间11:50	 B-DATE I-DATE I-DATE I-DATE I-DATE I-DATE I-DATE O O O O O B-TIM I-TIM I-TIM I-TIM I-TIM
['h_提供未到帳資訊']	银行卡。金币11990，时间6.1，8.30	 B-CHA I-CHA I-CHA O B-GOLD I-GOLD I-GOLD I-GOLD I-GOLD I-GOLD I-GOLD O O O B-DATE I-DATE I-DATE O B-TIM I-TIM I-TIM I-TIM
['h_提供未到帳資訊']	时间是2019,年5月30日，22点15分	 O O O B-DATE I-DATE I-DATE I-DATE I-DATE I-DATE I-DATE I-DATE I-DATE I-DATE I-DATE O B-TIM I-TIM I-TIM I-TIM I-TIM I-TIM
['h_提供未到帳資訊']	时间13.05.58金额1000	 O O B-TIM I-TIM I-TIM I-TIM I-TIM I-TIM I-TIM I-TIM O O B-MON I-MON I-MON I-MON
['h_提供未到帳資訊']	支付宝时间10.21金额200	 B-CHA I-CHA I-CHA O O B-TIM I-TIM I-TIM I-TIM I-TIM O O B-MON I-MON I-MON
['h_提供未到帳資訊', 'h_充值']	华夏总代理充值100时间14:39	 B-NAME1 I-NAME1 I-NAME1 I-NAME1 I-NAME1 O O B-MON I-MON I-MON O O B-TIM I-TIM I-TIM I-TIM I-TIM
['h_提供未到帳資訊']	500元。2019年6月1号16点50分44秒	 B-MON I-MON I-MON I-MON O B-DATE I-DATE I-DATE I-DATE I-DATE I-DATE I-DATE I-DATE I-DATE B-TIM I-TIM I-TIM I-TIM I-TIM I-TIM I-TIM I-TIM I-TIM
['h_提供未到帳資訊']	金额300时间，下午13点22	 O O B-MON I-MON I-MON O O O B-TIM I-TIM I-TIM I-TIM I-TIM I-TIM I-TIM
['h_提供未到帳資訊']	金额1000，时间21点11。	 O O B-MON I-MON I-MON I-MON O O O B-TIM I-TIM I-TIM I-TIM I-TIM O
['h_提供未到帳資訊']	时间5月30日金额11468	 O O B-DATE I-DATE I-DATE I-DATE I-DATE O O B-MON I-MON I-MON I-MON I-MON
['h_提供未到帳資訊', 'h_兌換']	时间3：04：19兑换512	 O O B-TIM I-TIM I-TIM I-TIM I-TIM I-TIM I-TIM O O B-MON I-MON I-MON
['h_提供未到帳資訊', 'h_兌換']	兑换时间5月30日金额11486	 O O O O B-DATE I-DATE I-DATE I-DATE I-DATE O O B-MON I-MON I-MON I-MON I-MON
['h_提供未到帳資訊']	5月30号凌晨一点36金额100	 B-DATE I-DATE I-DATE I-DATE I-DATE B-TIM I-TIM I-TIM I-TIM I-TIM I-TIM O O B-MON I-MON I-MON
['h_提供未到帳資訊']	雪，金额2000，时间1.35分	 O O O O B-MON I-MON I-MON I-MON O O O B-TIM I-TIM I-TIM I-TIM I-TIM
['h_提供未到帳資訊', 'h_转账']	转账时间15.28分，500元	 O O O O B-TIM I-TIM I-TIM I-TIM I-TIM I-TIM O B-MON I-MON I-MON I-MON
['h_提供未到帳資訊']	时间：17:06，支付方式：支付宝	 O O O B-TIM I-TIM I-TIM I-TIM I-TIM O O O O O O B-CHA I-CHA I-CHA
['h_提供未到帳資訊']	时间18点57金额199	 O O B-TIM I-TIM I-TIM I-TIM I-TIM O O B-MON I-MON I-MON
['h_提供未到帳資訊']	名称妮妮。时间06:7，200元	 O O B-NAME1 I-NAME1 O O O B-TIM I-TIM I-TIM I-TIM O B-MON I-MON I-MON O
['h_提供未到帳資訊']	付款成功是21.20到账成功是21:22分	 O O O O O B-TIM I-TIM I-TIM I-TIM I-TIM O O O O O B-TIM I-TIM I-TIM I-TIM I-TIM I-TIM
['h_提供未到帳資訊']	17点06分金额是100.03	 B-TIM I-TIM I-TIM I-TIM I-TIM I-TIM O O O B-MON I-MON I-MON I-MON I-MON I-MON
['h_提供未到帳資訊', 'h_兌換']	银行卡时间是3.29。提现3487	 O O O O O O B-TIM I-TIM I-TIM I-TIM O O O B-MON I-MON I-MON I-MON
['h_提供未到帳資訊']	时间1.55金额999.96	 O O B-TIM I-TIM I-TIM I-TIM O O B-MON I-MON I-MON I-MON I-MON I-MON
['h_提供未到帳資訊']	收款人冯双微时间16点59分	 O O O O O O O O B-TIM I-TIM I-TIM I-TIM I-TIM I-TIM
['h_提供未到帳資訊']	到账时间是5月30号，01:23	 O O O O O B-DATE I-DATE I-DATE I-DATE I-DATE O B-TIM I-TIM I-TIM I-TIM I-TIM
['h_提供未到帳資訊']	500元时间是16点40	 B-MON I-MON I-MON I-MON O O O B-TIM I-TIM I-TIM I-TIM I-TIM
['h_提供未到帳資訊']	23点.55.分52秒对方名子，彦文	 B-TIM I-TIM I-TIM I-TIM I-TIM I-TIM I-TIM I-TIM I-TIM I-TIM I-TIM O O O O O B-NAME1 I-NAME1
['h_提供未到帳資訊']	20点43金额50.11	 B-TIM I-TIM I-TIM I-TIM I-TIM O O B-MON I-MON I-MON I-MON I-MON
['h_提供未到帳資訊', 'h_兌換']	12:40:36兑换24000	 B-TIM I-TIM I-TIM I-TIM I-TIM I-TIM I-TIM I-TIM O O B-MON I-MON I-MON I-MON I-MON
['h_提供未到帳資訊', 'h_兌換']	12.51.兑换300	 B-TIM I-TIM I-TIM I-TIM I-TIM O O O B-MON I-MON I-MON
['h_提供未到帳資訊', 'h_转账']	转账时间15点08分	 O O O O B-TIM I-TIM I-TIM I-TIM I-TIM I-TIM
['h_提供未到帳資訊']	时间6月1号，5点37分，金额50	 O O B-DATE I-DATE I-DATE I-DATE O B-TIM I-TIM I-TIM I-TIM I-TIM O O O B-MON I-MON
['h_提供未到帳資訊', 'h_充值']	充值时间是03.73	 O O O O O B-TIM I-TIM I-TIM I-TIM I-TIM
['h_提供未到帳資訊']	500时间6.39	 B-MON I-MON I-MON O O B-TIM I-TIM I-TIM I-TIM
['h_提供未到帳資訊', 'h_转账']	15:46分转账郑黎柯	 B-TIM I-TIM I-TIM I-TIM I-TIM I-TIM O O O O O
['h_提供未到帳資訊']	时间是19.05	 O O O B-TIM I-TIM I-TIM I-TIM I-TIM
['h_提供未到帳資訊']	5月19号，金额50	 B-DATE I-DATE I-DATE I-DATE I-DATE O O O B-MON I-MON
['h_已提供QQ憑證資訊']	21点的凭证已发送	 B-TIM I-TIM I-TIM O O O O O O
['h_提供未到帳資訊', 'h_充值', 'h_未到帳']	支付宝充值2800怎么还没到账啊	 B-CHA I-CHA I-CHA O O B-MON I-MON I-MON I-MON O O O O O O O
['h_提供未到帳資訊', 'h_充值', 'h_未到帳']	支付宝转账充值怎么还没到账	 B-CHA I-CHA I-CHA O O O O O O O O O O
['h_提供未到帳資訊', 'h_充值', 'h_未到帳']	支付宝充值怎么还没到账	 B-CHA I-CHA I-CHA O O O O O O O O
['h_兌換', 'h_詢問處理方式']	提现支付宝必须和登录号一样吗？为什么我一直支付宝提现不了？	 O O B-CHA I-CHA I-CHA O O O O O O O O O O O O O O O O O O O O O O O O
['h_充值', 'h_詢問處理方式']	怎么样充值才行支付宝不行，微信好不好	 O O O O O O O B-CHA I-CHA I-CHA O O O B-CHA I-CHA O O O
['h_提供未到帳資訊', 'h_充值', 'h_未到帳']	刚刚支付宝充值为什么没到账	 O O B-CHA I-CHA I-CHA O O O O O O O O
['h_提供未到帳資訊', 'h_充值', 'h_未到帳']	支付宝定额充值50怎么没到账	 B-CHA I-CHA I-CHA I-CHA I-CHA O O B-MON I-MON O O O O O
['h_提供未到帳資訊', 'h_充值', 'h_未到帳']	支付宝充值怎么没有到账	 B-CHA I-CHA I-CHA O O O O O O O O
['h_提供未到帳資訊', 'h_充值', 'h_未到帳']	支付宝充值到银行卡怎么还没有到	 B-CHA I-CHA I-CHA O O O B-CHA I-CHA I-CHA O O O O O O
['h_詢問處理方式']	我支付宝绑定错误了，提款提错了，怎么办	 O B-CHA I-CHA I-CHA O O O O O O O O O O O O O O O
['h_詢問處理方式']	要绑定银行卡。为什么支付宝不行吗	 O O O B-CHA I-CHA I-CHA O O O O B-CHA I-CHA I-CHA O O O
['h_提供未到帳資訊', 'h_充值', 'h_未到帳']	支付宝充值为什么不到账	 B-CHA I-CHA I-CHA O O O O O O O O
['h_充值', 'h_咒罵']	支付宝不能充值什么情况狗日的	 B-CHA I-CHA I-CHA O O O O O O O O O O O
['h_充值']	怎么没有支付宝充值了？	 O O O O B-CHA I-CHA I-CHA O O O O
['h_充值', 'h_詢問處理時間']	微信什么时候能充，别的充值方式太麻烦	 B-CHA I-CHA O O O O O O O O O O O O O O O O
['h_提供未到帳資訊', 'h_充值', 'h_未到帳']	充了2000怎么还没收到？支付宝定额	 O O B-MON I-MON I-MON I-MON O O O O O O O B-CHA I-CHA I-CHA I-CHA I-CHA
['h_提供未到帳資訊', 'h_未到帳', 'h_兌換']	3.37支付宝兑换835怎么不到账	 B-TIM I-TIM I-TIM I-TIM B-CHA I-CHA I-CHA O O B-MON I-MON I-MON O O O O O
['h_提供未到帳資訊', 'h_充值', 'h_转账', 'h_未到帳']	用支付宝转账怎么还没充进去	 O B-CHA I-CHA I-CHA O O O O O O O O O
['h_提供未到帳資訊', 'h_转账', 'h_未到帳']	支付宝转账怎么还没到	 B-CHA I-CHA I-CHA O O O O O O O
['h_充值', 'h_转账', 'h_未到帳']	支付宝转账充值怎么不到账	 B-CHA I-CHA I-CHA O O O O O O O O O
['h_提供未到帳資訊', 'h_兌換']	支付宝账号梆了银行卡，怎么兑换不成功	 B-CHA I-CHA I-CHA O O O O B-CHA I-CHA I-CHA O O O O O O O O
['h_提供未到帳資訊', 'h_充值', 'h_要求回覆']	支付宝花呗充值的，你查询清楚了吗	 B-CHA I-CHA I-CHA B-CHA I-CHA O O O O O O O O O O O
['h_充值']	支付宝微信都不能充值了	 B-CHA I-CHA I-CHA B-CHA I-CHA O O O O O O
['h_提供未到帳資訊', 'h_充值', 'h_未到帳']	尊享闪付，充值了，不认账，怎么处理	 B-CHA I-CHA I-CHA I-CHA O O O O O O O O O O O O O
['h_充值', 'h_詢問處理時間']	刚刚微信充值的多久到账啊？	 O O B-CHA I-CHA O O O O O O O O O
['h_兌換']	银行卡提现和支付宝提现手续费是一样的吗	 B-CHA I-CHA I-CHA O O O B-CHA I-CHA I-CHA O O O O O O O O O O
['h_詢問處理方式', 'h_咒罵']	艹你妈个逼绑定的支付宝怎么注销	 O O O O O O O O B-CHA I-CHA I-CHA O O O O
['h_提供未到帳資訊', 'h_充值', 'h_未到帳']	支付宝账号充值怎么没到	 B-CHA I-CHA I-CHA O O O O O O O O
['h_提供未到帳資訊', 'h_充值']	支付宝定额、在哪里充值的	 B-CHA I-CHA I-CHA I-CHA I-CHA O O O O O O O
['h_詢問處理方式']	支付宝和银行卡的帐号可以修改吗？	 B-CHA I-CHA I-CHA O B-CHA I-CHA I-CHA O O O O O O O O O
['h_詢問處理方式']	支付宝取钱需要绑定银行卡？	 B-CHA I-CHA I-CHA O O O O O O B-CHA I-CHA I-CHA O
['h_提供未到帳資訊', 'h_充值', 'h_未到帳']	支付宝充值怎么到不了	 B-CHA I-CHA I-CHA O O O O O O O
['h_詢問處理時間']	支付宝充值多久到账	 B-CHA I-CHA I-CHA O O O O O O
['h_抱怨等候太久']	微信充值怎么到账这么慢	 B-CHA I-CHA O O O O O O O O O
['h_詢問處理時間']	微信什么时候开，支付宝麻烦	 B-CHA I-CHA O O O O O O B-CHA I-CHA I-CHA O O
['h_兌換']	只能绑定银行卡才能提现？	 O O O O B-CHA I-CHA I-CHA O O O O O
['h_詢問處理方式']	为什么银联支付怎么付不了？	 O O O B-CHA I-CHA O O O O O O O O
['h_詢問處理方式']	为什么绑定银行卡弄不了	 O O O O O B-CHA I-CHA I-CHA O O O
['h_詢問處理方式']	为什么支付宝充不了钱	 O O O B-CHA I-CHA I-CHA O O O O
['h_兌換', 'h_詢問處理方式']	为什么支付宝不能兑换	 O O O B-CHA I-CHA I-CHA O O O O
['h_詢問處理方式']	邮政储蓄为什么绑定不了	 B-CHA I-CHA I-CHA I-CHA O O O O O O O
['h_詢問處理方式']	支付宝怎么取消绑定	 B-CHA I-CHA I-CHA O O O O O O
['h_充值', 'h_抱怨投訴']	支付宝怎么充值不好用	 B-CHA I-CHA I-CHA O O O O O O O
['h_兌換']	支付宝怎么不能兑换	 B-CHA I-CHA I-CHA O O O O O O
['h_催促', 'h_兌換']	支付宝兑换是不是要快些	 B-CHA I-CHA I-CHA O O O O O O O O
['h_詢問處理方式']	怎样用支付宝充值	 O O O B-CHA I-CHA I-CHA O O
['h_充值']	怎么支付宝不充了	 O O B-CHA I-CHA I-CHA O O O
['h_詢問處理方式']	怎么微信支付充不了	 O O B-CHA I-CHA O O O O O
['h_詢問處理方式']	微信怎么充值不了	 B-CHA I-CHA O O O O O O
['h_抱怨投訴']	微信充值额度太高了！	 B-CHA I-CHA O O O O O O O O
['h_詢問處理方式']	微信充值怎么取消了	 B-CHA I-CHA O O O O O O O
['h_充值', 'h_詢問處理方式']	充值的截图怎么发给你	 O O O O O O O O O O
['h_詢問處理方式']	云闪付密码忘了，怎么办	 B-CHA I-CHA I-CHA O O O O O O O O
['h_詢問處理方式']	为什么支付宝不跳转	 O O O B-CHA I-CHA I-CHA O O O
['h_兌換']	不绑定银行卡可以提现吗？	 O O O B-CHA I-CHA I-CHA O O O O O O
['h_詢問處理方式']	闪付为啥没有二维码	 B-CHA I-CHA O O O O O O O
['h_詢問處理方式']	银行卡绑定为啥无效	 B-CHA I-CHA I-CHA O O O O O O
['h_兌換']	银行卡提现怎么这么慢？	 B-CHA I-CHA I-CHA O O O O O O O O
['h_詢問處理方式']	银行卡怎样解除绑定	 B-CHA I-CHA I-CHA O O O O O O
['h_兌換']	银行卡一次能提现五万吗	 B-CHA I-CHA I-CHA O O O O O B-MON I-MON O
['h_詢問處理方式']	是银联的啊怎么绑定不起	 O B-CHA I-CHA O O O O O O O O
['h_詢問處理方式']	无法安装支付宝助:	 O O O O B-CHA I-CHA I-CHA O O
['h_充值', 'h_詢問處理方式']	支付宝怎样充值	 B-CHA I-CHA I-CHA O O O O
['h_兌換']	支付宝不能提现吗？	 B-CHA I-CHA I-CHA O O O O O O
['h_兌換']	支付宝不能提现	 B-CHA I-CHA I-CHA O O O O
['h_詢問處理方式']	怎么银行卡绑定不了	 O O B-CHA I-CHA I-CHA O O O O
['h_詢問處理方式']	微信支付宝怎么冲	 B-CHA I-CHA B-CHA I-CHA I-CHA O O O
['h_充值']	微信不能充值吗	 B-CHA I-CHA O O O O O
['h_詢問處理方式']	。银行卡解绑换卡怎么换	 O B-CHA I-CHA I-CHA O O O O O O O
['h_充值']	花呗可以充值吗	 B-CHA I-CHA O O O O O
['h_詢問處理方式']	绑定朋友的可以么？	 O O O O O O O O O
['h_詢問處理方式']	绑定不了银行卡	 O O O O B-CHA I-CHA I-CHA
['h_兌換']	支付宝能兑换吗	 B-CHA I-CHA I-CHA O O O O
['h_詢問處理方式']	怎样更换银行卡？	 O O O O B-CHA I-CHA I-CHA O
['h_提供未到帳資訊', 'h_未到帳']	微信支付不到帐？	 B-CHA I-CHA O O O O O O
['h_充值']	微信可以充值吗？	 B-CHA I-CHA O O O O O O
['h_詢問處理方式']	怎么换银行卡	 O O O B-CHA I-CHA I-CHA
['h_抱怨投訴']	支付宝银行卡什么都不好使什么情况	 B-CHA I-CHA I-CHA B-CHA I-CHA I-CHA O O O O O O O O O O
['h_詢問處理時間']	支付宝充值可以立马到账嘛？	 B-CHA I-CHA I-CHA I-CHA I-CHA O O O O O O O O
['h_提供未到帳資訊', 'h_充值', 'h_未到帳']	ID41485400订单号4200000332201905304715002665帮我查一下11:28分充值一千没到账	 O O O O O O O O O O O O O B-order I-order I-order I-order I-order I-order I-order I-order I-order I-order I-order I-order I-order I-order I-order I-order I-order I-order I-order I-order I-order I-order I-order I-order I-order I-order I-order I-order O O O O O B-TIM I-TIM I-TIM I-TIM I-TIM I-TIM O O B-MON I-MON O O O
['h_提供未到帳資訊', 'h_充值', 'h_未到帳', 'h_感謝']	订单号：20190601200040011100280068088406充值时间：2019-06-0115:58充值300没到账麻烦查询处理下谢谢了	 O O O O B-order I-order I-order I-order I-order I-order I-order I-order I-order I-order I-order I-order I-order I-order I-order I-order I-order I-order I-order I-order I-order I-order I-order I-order I-order I-order I-order I-order I-order I-order I-order I-order O O O O O B-DATE I-DATE I-DATE I-DATE I-DATE I-DATE I-DATE I-DATE I-DATE I-DATE B-TIM I-TIM I-TIM I-TIM I-TIM O O B-MON I-MON I-MON O O O O O O O O O O O O O
['h_提供未到帳資訊']	零钱。。交易单号。。4200000294201905309731220047。。商户单号。。WJRCB_WP_1559190647808XC7WPE	 O O O O O O O O O O B-order I-order I-order I-order I-order I-order I-order I-order I-order I-order I-order I-order I-order I-order I-order I-order I-order I-order I-order I-order I-order I-order I-order I-order I-order I-order I-order I-order O O O O O O O O O O O O O O O O O O O O O O O O O O O O O O O O O O O O
['h_提供未到帳資訊', 'h_充值', 'h_未到帳']	支付宝201905302000400111009700741100015月30号01:24分充值的现在未到账	 B-CHA I-CHA I-CHA B-order I-order I-order I-order I-order I-order I-order I-order I-order I-order I-order I-order I-order I-order I-order I-order I-order I-order I-order I-order I-order I-order I-order I-order I-order I-order I-order I-order I-order I-order I-order B-DATE I-DATE I-DATE I-DATE I-DATE I-DATE B-TIM I-TIM I-TIM I-TIM I-TIM I-TIM O O O O O O O O
['h_提供未到帳資訊', 'h_充值']	20190530200040011100170074425587支付宝充值500元17点28充值的	 B-order I-order I-order I-order I-order I-order I-order I-order I-order I-order I-order I-order I-order I-order I-order I-order I-order I-order I-order I-order I-order I-order I-order I-order I-order I-order I-order I-order I-order I-order I-order I-order B-CHA I-CHA I-CHA O O B-MON I-MON I-MON I-MON B-TIM I-TIM I-TIM I-TIM I-TIM O O O
['h_提供未到帳資訊']	2019-06-0109:42。订单号。2019060122001104900500097422。商家订单号。T100P466579329815947460	 B-TIM I-TIM I-TIM I-TIM I-TIM I-TIM I-TIM I-TIM I-TIM I-TIM B-TIM I-TIM I-TIM I-TIM I-TIM O O O O O B-order I-order I-order I-order I-order I-order I-order I-order I-order I-order I-order I-order I-order I-order I-order I-order I-order I-order I-order I-order I-order I-order I-order I-order I-order I-order I-order I-order O O O O O O O O O O O O O O O O O O O O O O O O O O O O O O
['h_提供未到帳資訊']	订单编号：190530-640335217311098订单号：20190530-22001478731040919475她叫：芸儿	 O O O O O B-order I-order I-order I-order I-order I-order I-order I-order I-order I-order I-order I-order I-order I-order I-order I-order I-order I-order I-order I-order I-order I-order O O O O B-order I-order I-order I-order I-order I-order I-order I-order I-order I-order I-order I-order I-order I-order I-order I-order I-order I-order I-order I-order I-order I-order I-order I-order I-order I-order I-order I-order I-order O O O B-NAME1 I-NAME1
['h_提供未到帳資訊']	时间2019-06-0118:37，，2019060122001423790572779241订单号，名字，不阿	 O O B-DATE I-DATE I-DATE I-DATE I-DATE I-DATE I-DATE I-DATE I-DATE I-DATE B-TIM I-TIM I-TIM I-TIM I-TIM O O B-order I-order I-order I-order I-order I-order I-order I-order I-order I-order I-order I-order I-order I-order I-order I-order I-order I-order I-order I-order I-order I-order I-order I-order I-order I-order I-order I-order O O O O O O O B-NAME1 I-NAME1
['h_提供未到帳資訊']	2019-05-3017:29。订单号。20190530200040011100670073279249	 B-DATE I-DATE I-DATE I-DATE I-DATE I-DATE I-DATE I-DATE I-DATE I-DATE B-TIM I-TIM I-TIM I-TIM I-TIM O O O O O B-order I-order I-order I-order I-order I-order I-order I-order I-order I-order I-order I-order I-order I-order I-order I-order I-order I-order I-order I-order I-order I-order I-order I-order I-order I-order I-order I-order I-order I-order I-order I-order
['h_提供未到帳資訊']	20190601200040011100880078133913这是单号支付宝转的收款人是晓军时间是今天13点24分	 B-order I-order I-order I-order I-order I-order I-order I-order I-order I-order I-order I-order I-order I-order I-order I-order I-order I-order I-order I-order I-order I-order I-order I-order I-order I-order I-order I-order I-order I-order I-order I-order O O O O B-CHA I-CHA I-CHA O O O O O O B-NAME1 I-NAME1 O O O B-DATE I-DATE B-TIM I-TIM I-TIM I-TIM I-TIM I-TIM
['h_提供未到帳資訊']	用微信付的单号4200000296201906011538017125。。商户单号。。7895255475410474	 O B-CHA I-CHA O O O O B-order I-order I-order I-order I-order I-order I-order I-order I-order I-order I-order I-order I-order I-order I-order I-order I-order I-order I-order I-order I-order I-order I-order I-order I-order I-order I-order I-order O O O O O O O O O O O O O O O O O O O O O O O O
['h_提供未到帳資訊']	支付宝订单号20190530200040011100100075181939	 B-CHA I-CHA I-CHA O O O B-order I-order I-order I-order I-order I-order I-order I-order I-order I-order I-order I-order I-order I-order I-order I-order I-order I-order I-order I-order I-order I-order I-order I-order I-order I-order I-order I-order I-order I-order I-order I-order
['h_提供未到帳資訊']	2019-05-3100:21。订单号。20190531200040011100630071235292	 B-DATE I-DATE I-DATE I-DATE I-DATE I-DATE I-DATE I-DATE I-DATE I-DATE B-TIM I-TIM I-TIM I-TIM I-TIM O O O O O B-order I-order I-order I-order I-order I-order I-order I-order I-order I-order I-order I-order I-order I-order I-order I-order I-order I-order I-order I-order I-order I-order I-order I-order I-order I-order I-order I-order I-order I-order I-order I-order
['h_提供未到帳資訊']	订单号20190530100040011100060029373868	 O O O B-order I-order I-order I-order I-order I-order I-order I-order I-order I-order I-order I-order I-order I-order I-order I-order I-order I-order I-order I-order I-order I-order I-order I-order I-order I-order I-order I-order I-order I-order I-order I-order
['h_提供未到帳資訊']	我的订单号20190530200040011100970074110001	 O O O O O B-order I-order I-order I-order I-order I-order I-order I-order I-order I-order I-order I-order I-order I-order I-order I-order I-order I-order I-order I-order I-order I-order I-order I-order I-order I-order I-order I-order I-order I-order I-order I-order
['h_提供未到帳資訊', 'h_問候']	您好，我的支付订单。20190530200040011100970074110001	 O O O O O O O O O O B-order I-order I-order I-order I-order I-order I-order I-order I-order I-order I-order I-order I-order I-order I-order I-order I-order I-order I-order I-order I-order I-order I-order I-order I-order I-order I-order I-order I-order I-order I-order I-order
['h_提供未到帳資訊']	7:01。订单号20190530200040011100400067342006	 B-TIM I-TIM I-TIM I-TIM O O O O B-order I-order I-order I-order I-order I-order I-order I-order I-order I-order I-order I-order I-order I-order I-order I-order I-order I-order I-order I-order I-order I-order I-order I-order I-order I-order I-order I-order I-order I-order I-order I-order
['h_提供未到帳資訊']	20190530200040011100970074110001这是订单号	 B-order I-order I-order I-order I-order I-order I-order I-order I-order I-order I-order I-order I-order I-order I-order I-order I-order I-order I-order I-order I-order I-order I-order I-order I-order I-order I-order I-order I-order I-order I-order I-order O O O O O
['h_提供未到帳資訊']	20190530200040011100760066793462，，20190530，，18:42，，100支付宝	 B-DATE I-DATE I-DATE I-DATE I-DATE I-DATE I-DATE I-DATE I-order I-order I-order I-order I-order I-order I-order I-order I-order I-order I-order I-order I-order I-order I-order I-order I-order I-order I-order I-order I-order I-order I-order I-order O O O O O O O O O O O O B-TIM I-TIM I-TIM I-TIM I-TIM O O O O O B-CHA I-CHA I-CHA
['h_提供未到帳資訊']	2019-05-3022:00。20190530200040011100160073931318	 B-DATE I-DATE I-DATE I-DATE I-DATE I-DATE I-DATE I-DATE I-DATE I-DATE B-TIM I-TIM I-TIM I-TIM I-TIM O B-order I-order I-order I-order I-order I-order I-order I-order I-order I-order I-order I-order I-order I-order I-order I-order I-order I-order I-order I-order I-order I-order I-order I-order I-order I-order I-order I-order I-order I-order I-order I-order
['h_提供未到帳資訊', 'h_充值']	这个就是我充值的2019060122001423790572779241	 O O O O O O O O B-order I-order I-order I-order I-order I-order I-order I-order I-order I-order I-order I-order I-order I-order I-order I-order I-order I-order I-order I-order I-order I-order I-order I-order I-order I-order I-order I-order
['h_提供未到帳資訊']	5月31号15:58订单号20190531110075001506670000984950	 B-DATE I-DATE I-DATE I-DATE I-DATE B-TIM I-TIM I-TIM I-TIM I-TIM O O O B-order I-order I-order I-order I-order I-order I-order I-order I-order I-order I-order I-order I-order I-order I-order I-order I-order I-order I-order I-order I-order I-order I-order I-order I-order I-order I-order I-order I-order I-order I-order I-order
['h_提供未到帳資訊']	20190601200040011100520069153278这是订单号，对方叫丁香	 B-order I-order I-order I-order I-order I-order I-order I-order I-order I-order I-order I-order I-order I-order I-order I-order I-order I-order I-order I-order I-order I-order I-order I-order I-order I-order I-order I-order I-order I-order I-order I-order O O O O O O O O O B-NAME1 I-NAME1
['h_提供未到帳資訊']	20190531200040011100500065185896订单号	 B-order I-order I-order I-order I-order I-order I-order I-order I-order I-order I-order I-order I-order I-order I-order I-order I-order I-order I-order I-order I-order I-order I-order I-order I-order I-order I-order I-order I-order I-order I-order I-order O O O
['h_提供未到帳資訊']	2019-05-3020:20订单号是20190530200040011100990075683761	 B-DATE I-DATE I-DATE I-DATE I-DATE I-DATE I-DATE I-DATE I-DATE I-DATE B-TIM I-TIM I-TIM I-TIM I-TIM O O O O B-order I-order I-order I-order I-order I-order I-order I-order I-order I-order I-order I-order I-order I-order I-order I-order I-order I-order I-order I-order I-order I-order I-order I-order I-order I-order I-order I-order I-order I-order I-order I-order
['h_提供未到帳資訊']	订单号20190531110075001506490000464548	 O O O B-order I-order I-order I-order I-order I-order I-order I-order I-order I-order I-order I-order I-order I-order I-order I-order I-order I-order I-order I-order I-order I-order I-order I-order I-order I-order I-order I-order I-order I-order I-order I-order
['h_提供未到帳資訊']	20190531110075001506270000097062订单号	 B-order I-order I-order I-order I-order I-order I-order I-order I-order I-order I-order I-order I-order I-order I-order I-order I-order I-order I-order I-order I-order I-order I-order I-order I-order I-order I-order I-order I-order I-order I-order I-order O O O
['h_提供未到帳資訊']	20190530200040011100760066881203，，，20190530，，18:41，，100	 B-DATE I-DATE I-DATE I-DATE I-DATE I-DATE I-DATE I-DATE I-order I-order I-order I-order I-order I-order I-order I-order I-order B-MON I-MON I-MON I-order I-order I-order I-order I-order I-order I-order I-order I-order I-order I-order I-order O O O O O O O O O O O O O B-TIM I-TIM I-TIM I-TIM I-TIM O O O O O
['h_提供未到帳資訊']	20190530200040011100160073931318	 B-order I-order I-order I-order I-order I-order I-order I-order I-order I-order I-order I-order I-order I-order I-order I-order I-order I-order I-order I-order I-order I-order I-order I-order I-order I-order I-order I-order I-order I-order I-order I-order
['h_提供未到帳資訊']	20190531110075001506580000335178	 B-order I-order I-order I-order I-order I-order I-order I-order I-order I-order I-order I-order I-order I-order I-order I-order I-order I-order I-order I-order I-order I-order I-order I-order I-order I-order I-order I-order I-order I-order I-order I-order
['h_提供未到帳資訊']	2019053000015227订单编号	 B-order I-order I-order I-order I-order I-order I-order I-order I-order I-order I-order I-order I-order I-order I-order I-order O O O O
['h_提供未到帳資訊']	2019-06-0110:22，。2019060122001443540550804932是不是这个凭证就可以	 B-DATE I-DATE I-DATE I-DATE I-DATE I-DATE I-DATE I-DATE I-DATE I-DATE B-TIM I-TIM I-TIM I-TIM I-TIM O O B-order I-order I-order I-order I-order I-order I-order I-order I-order I-order I-order I-order I-order I-order I-order I-order I-order I-order I-order I-order I-order I-order I-order I-order I-order I-order I-order I-order O O O O O O O O O O
['h_提供未到帳資訊']	20190531200040011100990076010034我的订单号	 B-order I-order I-order I-order I-order I-order I-order I-order I-order I-order I-order I-order I-order I-order I-order I-order I-order I-order I-order I-order I-order I-order I-order I-order I-order I-order I-order I-order I-order I-order I-order I-order O O O O O
['h_提供未到帳資訊']	2019060122001443540550804932我的订单号	 B-order I-order I-order I-order I-order I-order I-order I-order I-order I-order I-order I-order I-order I-order I-order I-order I-order I-order I-order I-order I-order I-order I-order I-order I-order I-order I-order I-order O O O O O
['h_提供未到帳資訊']	20190601200040011100540065396774这是定单号100元	 B-order I-order I-order I-order I-order I-order I-order I-order I-order I-order I-order I-order I-order I-order I-order I-order I-order I-order I-order I-order I-order I-order I-order I-order I-order I-order I-order I-order I-order I-order I-order I-order O O O O O B-MON I-MON I-MON I-MON
['h_提供未到帳資訊']	20190531082716061763这个是订单	 B-order I-order I-order I-order I-order I-order I-order I-order I-order I-order I-order I-order I-order I-order I-order I-order I-order I-order I-order I-order O O O O O
['h_提供未到帳資訊']	2019053100032209	 B-order I-order I-order I-order I-order I-order I-order I-order I-order I-order I-order I-order I-order I-order I-order I-order
['h_提供未到帳資訊']	20190601200040011100880078133913	 B-order I-order I-order I-order I-order I-order I-order I-order I-order I-order I-order I-order I-order I-order I-order I-order I-order I-order I-order I-order I-order I-order I-order I-order I-order I-order I-order I-order I-order I-order I-order I-order
['h_提供未到帳資訊']	10000499012019060100143266934243	 B-order I-order I-order I-order I-order I-order I-order I-order I-order I-order I-order I-order I-order I-order I-order I-order I-order I-order I-order I-order I-order I-order I-order I-order I-order I-order I-order I-order I-order I-order I-order I-order
['h_問候']	宝贝你好	 O O O O
['h_問候']	你好!	 O O O
['h_問候']	你好	 O O
['h_詢問處理方式', 'h_問候']	您好？我的订单已经几天了还不解决吗？难道进了你们的帐就不认了，今天处理明天处理。就没完了吗	 O O O O O O O O O B-PER I-PER O O O O O O O O O O O O O O O O O O O O B-DATE I-DATE O O B-DATE I-DATE O O O O O O O O
['h_未到帳', 'h_兌換', 'h_詢問處理方式', 'h_感謝', 'h_問候']	帮我查一下10点46分兑换的3000怎么还没到账？谢谢	 O O O O O B-TIM I-TIM I-TIM I-TIM I-TIM I-TIM O O O B-MON I-MON I-MON I-MON O O O O O O O O O
['h_未到帳', 'h_詢問處理方式', 'h_問候', 'h_問_遊戲進不去']	你好，怎么我的账号‭13106248746‬提款怎么不到账而且禁止登陆的？。	 O O O O O O O O O O O O O O O O O O O O O O O O O O O O O O O O O O O O O O
['h_未到帳', 'h_兌換', 'h_詢問處理方式', 'h_問候']	你好帮我查一下凌晨45分兑换的400怎么还没到账	 O O O O O O O B-TIM I-TIM I-TIM I-TIM I-TIM O O O B-MON I-MON I-MON O O O O O O
['h_提供未到帳資訊', 'h_充值', 'h_未到帳', 'h_詢問處理方式', 'h_問候']	你好.刚刚找尊享充值的590金币没给我.什么情况。	 O O O O O O B-CHA I-CHA O O O B-GOLD I-GOLD I-GOLD I-GOLD I-GOLD O O O O O O O O O
['h_未到帳']	还是没到账，麻烦你们找核实人员帮我核对一下好吗	 O O O O O O O O O O O O O O O O O O O O O O O
['h_充值', 'h_未到帳', 'h_詢問處理時間']	请问一下，我充值的100什么时候可以到账	 O O O O O O O O O B-MON I-MON I-MON O O O O O O O O
['h_未到帳', 'h_詢問處理方式', 'h_抱怨等候太久', 'h_問候']	你好请问查好了吗，我还没有遇到过这么久没到账的情况	 O O O O O O O O O O O O O O O O O O O O O O O O O
['h_未到帳', 'h_兌換']	我的兑换到现在还没到账客服您那边可以解决一下吗	 O O O O O O O O O O O O O O O O O O O O O O O
['h_催促', 'h_詢問處理方式']	好几次了，一直不给到账，什么情况，帮我催一下啊	 O O O O O O O O O O O O O O O O O O O O O O O
['h_提供未到帳資訊', 'h_充值', 'h_詢問處理時間']	我想知道5000块钱什么时候给我充值？	 O O O O B-MON I-MON I-MON I-MON I-MON I-MON O O O O O O O O O
['h_已提供QQ憑證資訊', 'h_詢問處理方式']	客服，昨天QQ资料都传送给你们了，查询的怎么样了呀	 O O O O O O O O O O O O O O O O O O O O O O O O O
['h_提供未到帳資訊', 'h_感謝']	刚才我发给你的订单号麻烦您给我查一下，谢谢	 O O O O O O O O O O O O O O O O O O O O O
['h_充值', 'h_詢問處理時間']	信息我已经提交了，什么时候能充值到账呢？	 O O O O O O O O O O O O O O O O O O O O
['h_詢問處理時間', 'h_問候']	你好，请问下分到银行卡最慢多少时间到账	 O O O O O O O O O O O O O O O O O O O
['h_未到帳', 'h_問候']	你好，我最近有个订单您看一下，但是您还没给我豆豆	 O O O O O O O O O O O O O O O O O O O O O O O O
['h_未到帳', 'h_詢問處理方式', 'h_問候']	你好，我在15-10-28下分怎么还没到账呢	 O O O O O B-TIM I-TIM I-TIM I-TIM I-TIM I-TIM I-TIM I-TIM O O O O O O O O O
['h_未到帳', 'h_兌換', 'h_詢問處理方式', 'h_問候']	你好，帮查一下兑换怎么还没有到账啊	 O O O O O O O O O O O O O O O O O
['h_充值', 'h_未到帳', 'h_問候']	你好！我那充值没到账的还没处理好吗？你们有客服电话吗？	 O O O O O O O O O O O O O O O O O O O O O O O O O O O
['h_未到帳', 'h_問候']	你好客服，我刚才提了7200没到账	 O O O O O O O O O O B-MON I-MON I-MON I-MON O O O
['h_未到帳', 'h_詢問處理時間']	麻烦问下我那5000没到账的，啥时候能有回复	 O O O O O O B-MON I-MON I-MON I-MON O O O O O O O O O O O O
['h_充值', 'h_詢問處理時間']	请问我15.28分钟转账500什么可以到啊	 O O O B-TIM I-TIM I-TIM I-TIM I-TIM I-TIM I-TIM O O B-MON I-MON I-MON O O O O O O
['h_未到帳', 'h_兌換', 'h_詢問處理方式']	怎么提现没到账呢，麻烦处理一下	 O O O O O O O O O O O O O O O
['h_充值', 'h_未到帳', 'h_問候']	你好，能帮我看看，我充值的钱去哪了吗，到现在还没到账	 O O O O O O O O O O O O O O O O O O O O O O O O O O
['h_詢問處理方式', 'h_問候']	你好，你给我查查15776385884的密码怎么不对	 O O O O O O O O O O O O O O O O O O O O O O O O O O
['h_未到帳', 'h_問候']	你好！我那个昨晚没到账的，核实怎么样了？	 O O O O O O B-TIM I-TIM O O O O O O O O O O O O
['h_充值', 'h_未到帳', 'h_問候']	你好！我昨天凌晨充值没到账的核实通过了吗？	 O O O O B-DATE I-DATE B-TIM I-TIM O O O O O O O O O O O O O
['h_詢問處理方式']	能不能查一下支付宝帐号是多少？	 O O O O O O B-CHA I-CHA I-CHA O O O O O O
['h_詢問處理方式']	给查询的怎么样了，我这需要资金玩游戏啊	 O O O O O O O O O O O O O O O O O O O
['h_詢問處理時間']	我刚把举报信息发了多久能给我回复	 O O O O O O O O O O O O O O O O
['h_充值', 'h_未到帳', 'h_感謝']	我充的钱怎么没有到账啊！帮看看谢谢	 O O O O O O O O O O O O O O O O O
['h_未到帳']	帮我查一下，500金币没到账	 O O O O O O B-GOLD I-GOLD I-GOLD I-GOLD I-GOLD O O O
['h_感謝']	已经到账了谢谢。有时候会不会到账时间晚一会	 O O O O O O O O O O O O O O O O O O O O O
['h_詢問處理方式', 'h_充值人員未回覆', 'h_問_聲請代理']	对了，我想开代理，怎么一直没人联系我呢？	 O O O O O O O O O O O O O O O O O O O O
['h_詢問處理方式', 'h_詢問處理時間']	处理好了没，东西都发了啥时候给我结果	 O O O O O O O O O O O O O O O O O O
['h_充值', 'h_未到帳']	你给个准确回复，我充值没到账查清楚没有	 O O O O O O O O O O O O O O O O O O O
['h_問候']	你好，我绑定的信息有误，提不出来钱，可以更改嘛？	 O O O O O O O O O O O O O O O O O O O O O O O O
['h_充值', 'h_未到帳', 'h_抱怨等候太久', 'h_問候']	你好，充值没到账的，都几天了，还没处理好吗	 O O O O O O O O O O O B-PER I-PER O O O O O O O O
['h_充值', 'h_詢問處理時間']	你们系统充值问题什么时候能解决	 O O O O O O O O O O O O O O O
['h_詢問處理方式']	你们可以查一下订单号不就完了吗	 O O O O O O O O O O O O O O O
['h_提供未到帳資訊']	支付宝！麻烦有没有专员加一下！	 B-CHA I-CHA I-CHA O O O O O O O O O O O O
['h_未到帳']	我刚刚查了没有收到你在看下	 O O O O O O O O O O O O O
['h_催促', 'h_詢問處理方式']	怎么还没有帮我设置啊	 O O O O O O O O O O
['h_詢問處理方式']	怎么我不能主动联系？不能沟通一下？	 O O O O O O O O O O O O O O O O O
['h_兌換']	帮忙查一下是不是兑换到银行卡了？	 O O O O O O O O O O O O O O O O
['h_充值', 'h_詢問處理方式']	客服姐姐，充值信息核对完了吗？	 O O O O O O O O O O O O O O O
['h_提供未到帳資訊', 'h_已提供QQ憑證資訊']	发的订单截图已经发了没有人回答我	 O O O O O O O O O O O O O O O O
['h_詢問處理方式']	加了QQ3350648762怎么不帮我解决啊	 O O O O O O O O O O O O O O O O O O O O O O
['h_問候']	你好，需要什么样的凭证我发给你	 O O O O O O O O O O O O O O O
['h_未到帳']	金币没到账，麻烦解决下	 O O O O O O O O O O O
['h_詢問處理方式']	请问这个要怎么设置密保？	 O O O O O O O O O O O O
['h_已提供QQ憑證資訊']	我资料提交了你看下呢那里有问题	 O O O O O O O O O O O O O O O
['h_詢問處理方式']	我怎么提供，又不能上传图片	 O O O O O O O O O O O O O
['h_已提供QQ憑證資訊', 'h_催促']	已经发送，能帮我尽快处理吗	 O O O O O O O O O O O O O
['h_詢問處理方式']	客服姐姐，信息核对完了吗？	 O O O O O O O O O O O O O
['h_充值', 'h_感謝', 'h_問候']	谢谢啦理解下你看下你转账退回了吗	 O O O O O O O O O O O O O O O O
['h_充值']	请问现在还能充值吗	 O O O O O O O O O
['h_已提供QQ憑證資訊', 'h_充值人員未回覆']	提交过了，有QQ没有回复呀。	 O O O O O O O O O O O O O O
['h_未到帳']	我的钱到账了没有啊	 O O O O O O O O O
['h_詢問處理方式']	怎么联系我不知道	 O O O O O O O O
['h_充值']	帮我查一下能充值吗？	 O O O O O O O O O O
['h_催促', 'h_感謝']	帮我弄到账啊，着急，谢谢	 O O O O O O O O O O O O
['h_詢問處理方式', 'h_問候']	你好，怎么更换。绑定的卡。	 O O O O O O O O O O O O O
['h_詢問處理方式', 'h_問候']	你好进度怎么样了	 O O O O O O O O
['h_詢問處理方式', 'h_問候']	你好请问查的怎么样了	 O O O O O O O O O O
['h_充值']	请问现在能充值吗	 O O O O O O O O
['h_詢問處理方式']	请问查询到了吗	 O O O O O O O
['h_已提供QQ憑證資訊', 'h_充值人員未回覆']	我已提交，没人回复呢？	 O O O O O O O O O O O
['h_問候']	刚刚到账了，谢谢	 O O O O O O O O
['h_提供未到帳資訊']	3000	 B-MON I-MON I-MON I-MON
['h_提供未到帳資訊']	2000	 B-MON I-MON I-MON I-MON
['h_提供未到帳資訊']	1001	 B-MON I-MON I-MON I-MON
['h_提供未到帳資訊']	尊亨	 B-CHA I-CHA