﻿[
  {
    "ReservationID": {
      "Value": "adb7e5a0-f05d-48d9-92ff-3aefdf21f1cd"
    },
    "CustomerID": {
      "Value": "232d8dee-72bd-4f8c-8898-68acdecfb123"
    },
    "CheckInDate": "2023-12-27T00:00:00Z",
    "CreatedAt": "2023-12-27T19:29:47.9442486+01:00",
    "NumberOfNights": 2,
    "Status": 2,
    "RoomType": 1
  },
  {
    "ReservationID": {
      "Value": "6fc3e533-7a54-4886-a080-a19d361d0c37"
    },
    "CustomerID": {
      "Value": "232d8dee-72bd-4f8c-8898-68acdecfb123"
    },
    "CheckInDate": "2023-12-30T00:00:00Z",
    "CreatedAt": "2023-12-27T21:12:57.2071837+01:00",
    "NumberOfNights": 5,
    "Status": 2,
    "RoomType": 2
  }
]