{
    "players": [
      {
        "id": "1001",
        "firstName": "Sachin",
        "lastName": "Tendulkar",
        "sportsId": "1",
        "age": 47
       
      },
      {
        "id": "1002",
        "firstName": "Serena",
        "lastName": "Williams",
        "sportsId": "2",
        "age": 39
        
      },
      {
        "id": "1003",
        "firstName": "Steve",
        "lastName": "Smith",
        "sportsId": "1",
        "age": 31
        
      },
      {
        "id": "1004",
        "firstName": "Roger",
        "lastName": "Fedrer",
        "sportsId": "2",
        "age": 39
        
      }
    ],
    "sports": [
      {
        "id":1,
        "name": "Cricket"
      },
      {
        "id":2,
        "name": "Tennis"
      }
      ]
  }