[INFO] Scanning for projects...
[INFO] 
[INFO] ----------------< com.gaurav.example:SimpleMavenPlugin >----------------
[INFO] Building SimpleMavenPlugin 1.0-SNAPSHOT
[INFO] ----------------------------[ maven-plugin ]----------------------------
[INFO] 
[INFO] --- SimpleMavenPlugin:1.0-SNAPSHOT:version (default-cli) @ SimpleMavenPlugin ---
[INFO] Git hash: 20e52a4
[INFO] Building Client
[INFO] Built
[INFO] ------------------------------------------------------------------------
[INFO] BUILD SUCCESS
[INFO] ------------------------------------------------------------------------
[INFO] Total time:  8.376 s
[INFO] Finished at: 2020-12-02T20:40:42Z
[INFO] ------------------------------------------------------------------------
