{
  "settingsVersion": "1.8.01",
  "makeOfflineCompatible": false,
  "inlineAssets": false,
  "includePluginCSS": "",
  "includeSvelteCSS": true,
  "titleProperty": "title",
  "customHeadContentPath": "",
  "faviconPath": "",
  "documentWidth": "40em",
  "sidebarWidth": "20em",
  "minOutlineCollapse": 2,
  "startOutlineCollapsed": false,
  "allowFoldingHeadings": true,
  "allowFoldingLists": true,
  "allowResizingSidebars": true,
  "logLevel": "warning",
  "minifyHTML": true,
  "makeNamesWebStyle": true,
  "onlyExportModified": false,
  "deleteOldFiles": true,
  "addThemeToggle": true,
  "addOutline": true,
  "addFileNav": true,
  "addSearchBar": true,
  "addGraphView": true,
  "addTitle": true,
  "addRSSFeed": true,
  "siteURL": "",
  "authorName": "",
  "vaultTitle": "doc",
  "exportPreset": "website",
  "openAfterExport": false,
  "graphAttractionForce": 1,
  "graphLinkLength": 10,
  "graphRepulsionForce": 150,
  "graphCentralForce": 3,
  "graphEdgePruning": 100,
  "graphMinNodeSize": 3,
  "graphMaxNodeSize": 7,
  "showDefaultTreeIcons": false,
  "emojiStyle": "Native",
  "defaultFileIcon": "lucide//file",
  "defaultFolderIcon": "lucide//folder",
  "defaultMediaIcon": "lucide//file-image",
  "exportPath": "/home/gaura/git/gaurapanasenko/eegzen/export_doc",
  "filesToExport": [
    [
      "all"
    ]
  ]
}