{
  "manager": {
    "username": "manager",
    "password": "manager"
  },
  "coach": {
    "username": "coach@email.com",
    "password": "Hamdi$98"
  },
  "password": {
    "mdp": "Ilhem$98"
  },
  "player": {
    "username": "gassem.ilhem@gmail.com",
    "password": "Ilhem$98"
  },
  "admin": {
    "username": "admin",
    "password": "admin"
  },
  "role": {
    "manager": "Organization Manager",
    "coach": "Coach",
    "player": "Player",
    "admin": "Super Admin"
  },
  "forgetPasswordVariable": {
    "serverID": "bhhfvbcm",
    "emailDomain": "sum-wife@ej4qncwh.mailosaur.net",
    "emailAddress": "person-with@bhhfvbcm.mailosaur.net"
  },
  "invalidManager": {
    "username": "lerokid125@meidecn.com",
    "password": "Hamdi$87"
  },
  "invalidEmail": {
    "username": "lerokid125@meidecn.com",
    "password": "Hamdi$98"
  },
  "invalidPassword": {
    "username": "lerokid367@meidecn.com",
    "password": "Hamdi$87"
  },
  "usernameWithEspace": {
    "username": "lerokid125@meidecn.com  ",
    "password": "Hamdi$98"
  },
  "passwordWithEspace": {
    "username": "lerokid125@meidecn.com",
    "password": "Hamdi$98  "
  },
  "userDesactivated": {
    "username": "gassem.ilhem612@gmail.com",
    "password": "Hamdi$98  "
  },
  "emptyEmail": {
    "password": "Hamdi$98"
  },
  "emptyPassword": {
    "username": "lerokid367@meidecn.com"
  },
  "forgetPassword": {
    "username": "person-with@bhhfvbcm.mailosaur.net"
  },
  "forgetPasswordLogin": {
    "username": "person-with@bhhfvbcm.mailosaur.net",
    "password": "Hamdi$98"
  },
  "forgetPasswordInv": {
    "username": "gassemilhem6"
  },
  "ResetPasswordShort": {
    "plainPassword": "gas"
  },
  "ResetPassword6Char": {
    "plainPassword": "gassem12"
  },

  "ResetPasswordCharSep": {
    "plainPassword": "gassem12$"
  },
  "ResetPasswordStrong": {
    "plainPassword": "Hamdi$98"
  },
  "confirmPlainPasswordWrong": {
    "plainPassword": "Hamdi123"
  },
  "confirmPlainPassword": {
    "plainPassword": "Hamdi$98"
  },

  "fieldRequired": {
    "msg": "This field is required"
  },
  "invalidOrLoginPass": {
    "msg": "Invalid Login or password."
  },
  "invalidEmailForget": {
    "msg": "email must be a valid email"
  },
  "sixCharacteres": {
    "msg": "Password should contain at least 6 characters."
  },
  "TooWeak": {
    "msg": "Too weak"
  },
  "CouldBeStronger": {
    "msg": "Could be stronger"
  },
  "StrongerPassword": {
    "msg": "Strong password"
  },
  "PasswordDoNotMatch": {
    "msg": "Passwords do not match"
  }
}
