{
  "organizationCreate": {
    "type": "standard",
    "subDomain": "test",
    "projectevalSuccessThreshold": 65,
    "codeevalSuccessThreshold": 100,
    "quizSuccessThreshold": 65,
    "displayName": "test"
  },
  "organizationUpdate": {
    "displayName": "test16"
  },
  "organizationConfig": {
    "displayName": "1"
  }
  }
  