{
    "type": "training",
    "discriminator": "quiz",
    "image": null,
    "prerequisites": [],
    "attachments": [{}],
    "description": "<p>Hello world</p>",
    "difficulty": "Easy",
    "duration": 1200000,
    "questions": [
      {
        "hint": "hello",
        "mode": "single-entry",
        "statement": "<p>question 1</p>",
        "options": [
          {"correct": true, "content": "Option 1"},
          {"correct": false, "content": "Option 2"}
        ]
      },
      {
        "hint": "hi",
        "mode": "multi-entries",
        "statement": "<p>question 2</p>",
        "options": [
          {"correct": true, "content": "Option 1"},
          {"correct": true, "content": "Option 2"}
        ]
      },
      {
        "hint": "",
        "mode": "text-entry",
        "statement": "<p>question 3</p>",
        "options": [{"content": "Your answer", "type": "string"}]
      }
    ]
  }
  