INDEX VERSION 1.131+D:\Tecnologias Construccion\Backend\.metadata\.plugins\org.eclipse.jdt.core
3000790689.index
3946940136.index
2538615317.index
3152960880.index
653055787.index
1447733497.index
2098930678.index
4018783759.index
2030298028.index
918353423.index
3006325878.index
1418363783.index
3434360202.index
157532464.index
3383467145.index
3789229323.index
2756934535.index
323124029.index
4107977049.index
663154683.index
709980673.index
2507285365.index
2792277370.index
3882586260.index
3527903221.index
190534327.index
1925358878.index
1978513571.index
2537434560.index
661625778.index
2852130361.index
2575392676.index
1956133932.index
3899254637.index
2399296392.index
1537183950.index
4157344636.index
2004001107.index
674403635.index
3181120508.index
467814815.index
4193803526.index
985543995.index
3271944909.index
4284821968.index
3157677223.index
3808843675.index
1121701898.index
4185499579.index
2388517632.index
1250186508.index
3766435330.index
1627775265.index
2864903886.index
1431535890.index
3280751372.index
3935241189.index
3691203741.index
1968623335.index
2196897656.index
1764062097.index
3282344916.index
4203154254.index
3141591098.index
1883940091.index
3107911046.index
1690162146.index
2221580613.index
290914016.index
1242758174.index
1458804427.index
1954438529.index
327137498.index
197087373.index
668640617.index
3431648690.index
1768669267.index
480691596.index
371322374.index
3560120714.index
1628147130.index
3085238185.index
2056818735.index
164595462.index
1511578184.index
2628245380.index
237796900.index
2129328200.index
1428178871.index
737907594.index
1831789226.index
1554051480.index
1545932363.index
3972465892.index
3934384119.index
3201690579.index
3155995990.index
334484962.index
3255245166.index
1690515309.index
1433496240.index
2115376622.index
526019975.index
4161524817.index
4236488990.index
4088354016.index
66728943.index
1723294219.index
948112570.index
325544099.index
276691229.index
3618366058.index
3973963927.index
2098444248.index
593251401.index
140216092.index
2924354208.index
2110080533.index
2833269140.index
1907021766.index
