{
  "images" : [
    {
      "idiom" : "universal",
      "filename" : "Keith_Tumi_3_19_19_1194_edit_v4.jpg"
    }
  ],
  "info" : {
    "version" : 1,
    "author" : "xcode"
  },
  "properties" : {
    "width" : 1
  }
}