{
  "version": "1.0",
  "repos" : [{
    "name" : "application",
    "expand_keys" : true,
    "url" : "https://gitlab.com/gary.kenneth.brown/consul-config.git",
    "include_branch_name" : false,
    "ignore_file_extension" : true,
	"source_root" : "config",
    "branches" : ["master"],
    "hooks": [{
      "type" : "polling",
      "interval" : "1"
    }]
  }]
}
