{
  "swagger": "2.0",
  "info": {
    "version": "1.0.0",
    "title": "REST API",
    "description": ""
  },
  "host": "210.65.10.85:8080",
  "basePath": "/object",
  "tags": [],
  "schemes": [
    "http"
  ],
  "consumes": [],
  "produces": [],
  "paths": {
    "/": {
      "post": {
        "tags": [],
        "description": "",
        "parameters": [
          {
            "name": "Record",
            "in": "body",
            "type": "string",
            "example": "{\"key\": \"value\"}",
            "required": true
          }
        ],
        "responses": {
          "400": {
            "description": "Bad Request"
          },
          "500": {
            "description": "Internal Server Error"
          }
        }
      }
    },
    "/{key?}": {
      "get": {
        "tags": [],
        "description": "",
        "parameters": [
          {
            "name": "key?",
            "in": "path",
            "required": true,
            "type": "string"
          },
          {
            "name": "timestamp",
            "in": "query",
            "type": "string"
          }
        ],
        "responses": {
          "400": {
            "description": "Bad Request"
          },
          "500": {
            "description": "Internal Server Error"
          }
        }
      }
    }
  },
  "definitions": {
      "Record": {
          "key": "mykey",
          "value": "val"
       }
  }
}