<?xml version="1.0" encoding="UTF-8" standalone="no"?>
<svg
   sodipodi:docname="panel-background.svg"
   inkscape:version="1.3.2 (091e20ef0f, 2023-11-25, custom)"
   version="1.1"
   id="svg2"
   viewBox="0 0 173 56.000004"
   height="56.000004"
   width="173"
   xmlns:inkscape="http://www.inkscape.org/namespaces/inkscape"
   xmlns:sodipodi="http://sodipodi.sourceforge.net/DTD/sodipodi-0.dtd"
   xmlns="http://www.w3.org/2000/svg"
   xmlns:svg="http://www.w3.org/2000/svg"
   xmlns:rdf="http://www.w3.org/1999/02/22-rdf-syntax-ns#"
   xmlns:cc="http://creativecommons.org/ns#"
   xmlns:dc="http://purl.org/dc/elements/1.1/">
  <defs
     id="defs4">
    <style
       id="current-color-scheme"
       type="text/css">
      .ColorScheme-Text {
        color:#31363b;
        stop-color:#31363b;
      }
      .ColorScheme-Background {
        color:#eff0f1;
        stop-color:#eff0f1;
      }
      .ColorScheme-Highlight {
        color:#3daee9;
        stop-color:#3daee9;
      }
      .ColorScheme-ViewText {
        color:#31363b;
        stop-color:#31363b;
      }
      .ColorScheme-ViewBackground {
        color:#fcfcfc;
        stop-color:#fcfcfc;
      }
      .ColorScheme-ViewHover {
        color:#93cee9;
        stop-color:#93cee9;
      }
      .ColorScheme-ViewFocus{
        color:#3daee9;
        stop-color:#3daee9;
      }
      .ColorScheme-ButtonText {
        color:#31363b;
        stop-color:#31363b;
      }
      .ColorScheme-ButtonBackground {
        color:#eff0f1;
        stop-color:#eff0f1;
      }
      .ColorScheme-ButtonHover {
        color:#93cee9;
        stop-color:#93cee9;
      }
      .ColorScheme-ButtonFocus{
        color:#3daee9;
        stop-color:#3daee9;
      }
      </style>
  </defs>
  <sodipodi:namedview
     inkscape:document-rotation="0"
     fit-margin-bottom="0"
     fit-margin-right="0"
     fit-margin-left="0"
     fit-margin-top="0"
     showguides="true"
     inkscape:window-maximized="0"
     inkscape:window-y="549"
     inkscape:window-x="789"
     inkscape:window-height="1447"
     inkscape:window-width="2309"
     units="px"
     borderlayer="true"
     inkscape:showpageshadow="false"
     showgrid="true"
     inkscape:current-layer="layer1"
     inkscape:document-units="px"
     inkscape:cy="43.001677"
     inkscape:cx="32.29804"
     inkscape:zoom="13.359944"
     inkscape:pageshadow="2"
     inkscape:pageopacity="0"
     borderopacity="1"
     bordercolor="#cc0000"
     pagecolor="#b0dba0"
     id="base"
     inkscape:guide-bbox="true"
     inkscape:pagecheckerboard="0"
     inkscape:deskcolor="#b0dba0">
    <inkscape:grid
       originy="-91.999976"
       originx="0"
       empspacing="2"
       id="grid3336"
       type="xygrid"
       spacingy="1"
       spacingx="1"
       units="px"
       visible="true" />
    <sodipodi:guide
       position="13,50.99998"
       orientation="1,0"
       id="guide992"
       inkscape:locked="false" />
    <sodipodi:guide
       position="35,51.99998"
       orientation="1,0"
       id="guide994"
       inkscape:locked="false" />
    <sodipodi:guide
       position="57.08298,25.905236"
       orientation="0,-1"
       id="guide998"
       inkscape:locked="false" />
    <sodipodi:guide
       position="54,47.99998"
       orientation="0,-1"
       id="guide1000"
       inkscape:locked="false" />
  </sodipodi:namedview>
  <metadata
     id="metadata7">
    <rdf:RDF>
      <cc:Work
         rdf:about="">
        <dc:format>image/svg+xml</dc:format>
        <dc:type
           rdf:resource="http://purl.org/dc/dcmitype/StillImage" />
        <dc:title />
      </cc:Work>
    </rdf:RDF>
  </metadata>
  <g
     transform="translate(0,-904.36218)"
     id="layer1"
     inkscape:groupmode="layer"
     inkscape:label="Layer 1">
    <rect
       y="904.36218"
       x="0"
       height="5"
       width="5"
       id="hint-tile-center"
       style="opacity:1;fill:#ff6600;fill-opacity:1;stroke:none" />
    <g
       transform="matrix(0.375,0,0,2.6666565,21.87499,-1515.261)"
       style="opacity:0.5;fill:#2f343f;fill-opacity:1"
       id="top">
      <rect
         class="ColorScheme-Background"
         transform="matrix(0,-1,-1,0,0,0)"
         style="opacity:1;fill:#161925;fill-opacity:1;stroke:none"
         id="rect4152"
         width="6"
         height="32"
         x="-916.36218"
         y="-50.999985" />
    </g>
    <g
       transform="matrix(0.375,0,0,2.6666565,21.87499,-1588.594)"
       style="opacity:0.5;fill:#192124;fill-opacity:1"
       id="bottom">
      <rect
         class="ColorScheme-Background"
         y="-50.999985"
         x="948.36218"
         height="32"
         width="6"
         id="rect4148"
         style="opacity:1;fill:#161925;fill-opacity:1;stroke:none"
         transform="rotate(90)" />
    </g>
    <g
       transform="matrix(2.6666669,0,0,0.375,-21.666677,584.72634)"
       style="opacity:0.5;fill:#2f343f;fill-opacity:1"
       id="left">
      <rect
         class="ColorScheme-Background"
         y="916.36218"
         x="-19.000004"
         height="32"
         width="5.9999995"
         id="rect4144"
         style="opacity:1;fill:#161925;fill-opacity:1;stroke:none"
         transform="scale(-1,1)" />
    </g>
    <g
       transform="matrix(2.6666669,0,0,0.375,-94.999985,584.72634)"
       style="opacity:0.5;fill:#192124;fill-opacity:1"
       id="right">
      <rect
         class="ColorScheme-Background"
         style="opacity:1;fill:#161925;fill-opacity:1;stroke:none"
         id="rect4140"
         width="5.9999995"
         height="32"
         x="50.999985"
         y="916.36218" />
    </g>
    <g
       transform="matrix(0.375,0,0,0.375,21.875002,584.72634)"
       style="opacity:0.7"
       id="center">
      <rect
         style="opacity:0.7;fill:none;fill-opacity:1;stroke:none"
         id="rect4401"
         width="32"
         height="32"
         x="19.000004"
         y="916.36218" />
      <rect
         class="ColorScheme-Background"
         y="916.36218"
         x="19.000004"
         height="32"
         width="32"
         id="rect4138"
         style="opacity:0.7;fill:#161925;fill-opacity:1;stroke:none" />
    </g>
    <rect
       y="910.3429"
       x="33.155327"
       height="1.9999769"
       width="4"
       id="hint-top-margin"
       style="opacity:0.5;fill:#ff00ff;fill-opacity:1;stroke:none" />
    <rect
       style="opacity:0.5;fill:#ff00ff;fill-opacity:1;stroke:none"
       id="hint-bottom-margin"
       width="4"
       height="2.0000231"
       x="33.116497"
       y="956.34259" />
    <rect
       transform="rotate(90)"
       style="opacity:0.5;fill:#ff00ff;fill-opacity:1;stroke:none"
       id="hint-right-margin"
       width="3.9999769"
       height="1.9999847"
       x="932.51752"
       y="-59.019245" />
    <rect
       transform="rotate(90)"
       y="-12.941902"
       x="932.401"
       height="2.0000019"
       width="4"
       id="hint-left-margin"
       style="opacity:0.5;fill:#ff00ff;fill-opacity:1;stroke:none" />
    <g
       style="opacity:0.5;fill:#0f111a;fill-opacity:1"
       id="topleft"
       transform="matrix(2.6666667,0,0,2.6666565,-21.666667,-1515.2611)">
      <path
         sodipodi:nodetypes="ccccc"
         class="ColorScheme-Background"
         inkscape:connector-curvature="0"
         id="rect4159"
         transform="translate(0,904.36218)"
         d="m 13,12 h 6 V 6 c -1.108109,0 -1.108109,0 0,0 -3,2.98e-5 -6,3.0000412 -6,6 z"
         style="color:#eff0f1;opacity:1;fill:#161925;fill-opacity:1;stroke:none" />
    </g>
    <g
       style="opacity:0.5;fill:#192124;fill-opacity:1"
       id="topright"
       transform="matrix(2.6666667,0,0,2.6666565,-95,-1515.2611)">
      <path
         sodipodi:nodetypes="cccc"
         class="ColorScheme-Background"
         inkscape:connector-curvature="0"
         id="rect4177"
         d="m 51,6 v 6 h 6 c -10e-7,-2.9999588 -3.000001,-5.9999702 -6,-6 z"
         style="color:#eff0f1;opacity:1;fill:#161925;fill-opacity:1;stroke:none"
         transform="translate(0,904.36218)" />
    </g>
    <g
       style="opacity:0.5;fill:#0f111a;fill-opacity:1"
       id="bottomleft"
       transform="matrix(2.6666667,0,0,2.6666565,-21.666667,-1588.594)">
      <path
         sodipodi:nodetypes="cccc"
         class="ColorScheme-Background"
         id="path5048"
         d="m 19,954.36218 v -6 h -6 c 0,3.00002 2.625,6.00004 6,6 z"
         style="color:#eff0f1;opacity:1;fill:#161925;fill-opacity:1;stroke:none"
         inkscape:connector-curvature="0" />
    </g>
    <g
       style="opacity:0.5;fill:#192124;fill-opacity:1"
       id="bottomright"
       transform="matrix(2.6666667,0,0,2.6666565,-95,-1588.594)">
      <path
         sodipodi:nodetypes="cccc"
         class="ColorScheme-Background"
         inkscape:connector-curvature="0"
         style="color:#eff0f1;opacity:1;fill:#161925;fill-opacity:1;stroke:none"
         d="m 51,954.36218 v -6 h 6 c -10e-7,3.00002 -3.000001,6.00004 -6,6 z"
         id="rect4177-6" />
    </g>
    <g
       transform="matrix(0.37500035,0,0,1.3333275,136.87498,-303.44862)"
       id="mask-top">
      <rect
         y="-51"
         x="-922.36218"
         height="32.000015"
         width="11.999931"
         id="rect4265"
         style="opacity:0.97;fill:#000000;fill-opacity:1;stroke:none;stroke-width:1.54919"
         transform="matrix(0,-1,-1,0,0,0)" />
    </g>
    <g
       transform="matrix(1.5999977,0,0,1.5999942,107.20003,-546.21192)"
       id="mask-topleft">
      <path
         inkscape:connector-curvature="0"
         id="path4277"
         d="m 23,910.36218 c -5.539984,0 -10,4.46002 -10,10 h 10 z"
         style="opacity:0.97;fill:#000000;fill-opacity:1;stroke-width:2" />
    </g>
    <g
       transform="matrix(2.0000036,0,0,2.0000159,57.999798,-910.37672)"
       id="mask-topright">
      <path
         inkscape:connector-curvature="0"
         id="path4287"
         d="m 49.000013,910.36218 v 7.99999 H 57 c 0,-4.43198 -3.568007,-7.99999 -7.999987,-7.99999 z"
         style="opacity:0.97;fill:#000000;fill-opacity:1;stroke-width:1.6" />
    </g>
    <g
       transform="matrix(0.37500035,0,0,1.600003,136.87498,-572.62032)"
       id="mask-bottom">
      <rect
         transform="rotate(90)"
         style="opacity:0.97;fill:#000000;fill-opacity:1;stroke:none;stroke-width:1.41421"
         id="rect4291"
         width="9.9999723"
         height="32.000015"
         x="944.36224"
         y="-51" />
    </g>
    <g
       transform="matrix(1.3333288,0,0,1.3333268,110.66673,-318.11452)"
       id="mask-bottomleft">
      <path
         inkscape:connector-curvature="0"
         id="path4303"
         d="m 13,942.36218 c 0,6.64797 5.35202,12 12,12 v -12 z"
         style="opacity:0.97;fill:#000000;fill-opacity:1;stroke-width:2.40001" />
    </g>
    <g
       transform="matrix(1.3333336,0,0,1.3333316,95.99999,-318.11912)"
       id="mask-bottomright">
      <path
         inkscape:connector-curvature="0"
         id="path4313"
         d="m 45,942.36218 v 12 c 6.64798,0 12,-5.35203 12,-12 z"
         style="opacity:0.97;fill:#000000;fill-opacity:1;stroke-width:2.40001" />
    </g>
    <g
       transform="matrix(1.3333341,0,0,0.60000604,110.66665,372.93927)"
       id="mask-left">
      <rect
         transform="scale(-1,1)"
         style="opacity:0.97;fill:#000000;fill-opacity:1;stroke:none;stroke-width:1.22475"
         id="rect4317"
         width="11.999996"
         height="20.000069"
         x="-25"
         y="922.36218" />
    </g>
    <g
       transform="matrix(1.6000014,0,0,0.37500479,80.799938,582.72193)"
       id="mask-right">
      <rect
         y="916.36218"
         x="47"
         height="32.000023"
         width="9.9999828"
         id="rect4323"
         style="opacity:0.97;fill:#000000;fill-opacity:1;stroke:none;stroke-width:1.41421" />
    </g>
    <rect
       y="926.36212"
       x="143.99997"
       height="12.000025"
       width="12.000025"
       id="mask-center"
       style="opacity:0.97;fill:#000000;fill-opacity:1;stroke:none;stroke-width:0.375001" />
  </g>
</svg>
