<svg width="20" height="28" viewBox="0 0 20 28" fill="none" xmlns="http://www.w3.org/2000/svg">
<path fill-rule="evenodd" clip-rule="evenodd" d="M10.0385 0.441294C8.73835 1.07243 8.07607 1.16232 6.95725 0.859455C6.23568 0.664104 5.99483 0.650853 5.59184 0.783773C4.79363 1.04729 4.31413 1.54769 4.0763 2.36612C3.73819 3.52893 2.88616 4.68861 2.00394 5.18655C1.16119 5.66222 0.786612 6.17423 0.659019 7.02531C0.584294 7.52352 0.63921 7.72584 1.04945 8.46407C1.68919 9.61528 1.78358 10.2698 1.47922 11.4434C1.21215 12.4729 1.28633 12.9873 1.82853 13.8682C2.12757 14.3538 2.31732 14.4575 3.50759 14.785C4.47916 15.0523 4.99868 15.502 5.5626 16.564C5.95768 17.308 6.06833 17.4112 6.77009 17.6889C7.89876 18.1357 8.66704 18.1303 9.26881 17.6713C10.301 16.884 11.2268 16.7215 12.3625 17.1285C13.1295 17.4034 13.7224 17.3094 14.4466 16.798C15.0623 16.3634 15.2658 16.0265 15.5577 14.9589C15.8159 14.0148 16.3407 13.3804 17.321 12.8271C18.1224 12.3749 18.4909 11.7956 18.6015 10.8138C18.6543 10.3464 18.5794 10.0878 18.1851 9.37389C17.5475 8.219 17.4798 7.80972 17.683 6.33079C17.8447 5.15226 17.8382 5.04516 17.5664 4.43083C17.2644 3.74819 17.1233 3.65571 15.4524 3.04629C14.5865 2.73032 14.1007 2.30218 13.5156 1.33909C12.9996 0.489654 12.4552 0.122449 11.545 0.0100195C11.1737 -0.0358812 10.8021 0.0705373 10.0385 0.441294ZM11.257 2.57977C13.0171 2.97772 14.7426 4.40692 15.5609 6.14486C17.5121 10.2892 14.9433 14.9641 10.4016 15.5344C7.60955 15.885 4.96016 14.412 3.66497 11.7893L3.12877 10.7035L3.12946 8.98879C3.13 7.29552 3.13629 7.26082 3.6345 6.21153C5.01398 3.30667 8.0575 1.85643 11.257 2.57977ZM7.88988 3.51678C3.81387 4.85186 2.5516 9.99328 5.56096 13.0028C7.34371 14.7854 9.91456 15.2202 12.1477 14.1165C16.4625 11.9839 16.3752 5.81399 12.0013 3.76718C10.7958 3.20312 9.15324 3.10299 7.88988 3.51678ZM13.2409 6.52573L13.7773 7.07517L11.2912 9.56146L8.80488 12.0476L7.50341 10.7312C6.70725 9.92606 6.23322 9.34411 6.2824 9.2325C6.32666 9.13209 6.5772 8.8709 6.83935 8.65191L7.31584 8.25383L8.06938 9.00737L8.82292 9.7609L10.6889 7.87269C11.7151 6.83419 12.5884 5.98271 12.6295 5.98038C12.6706 5.9782 12.9456 6.22355 13.2409 6.52573ZM16.0383 18.4768C14.9957 19.1742 13.3313 19.8472 12.0636 20.0838L11.1626 20.2519L12.6783 23.7617C13.512 25.6921 14.2321 27.229 14.2785 27.1769C14.325 27.1249 14.6545 26.0886 15.0106 24.8738L15.6582 22.6653L16.9753 23.2832C19.1917 24.323 20 24.6826 20 24.6288C20 24.4523 17.1203 17.9279 17.0334 17.9079C16.9745 17.8942 16.5267 18.1502 16.0383 18.4768ZM2.70324 18.5747C2.58466 18.804 2.28439 19.4597 2.03604 20.0316C1.78768 20.6036 1.2157 21.8862 0.765027 22.8817C0.31449 23.8771 -0.0289446 24.6917 0.00192906 24.6917C0.0328027 24.6917 1.01297 24.2338 2.18002 23.6743C4.24774 22.6829 4.30498 22.6646 4.41112 22.9571C4.4711 23.1222 4.78735 24.1647 5.11411 25.2737C5.44075 26.3825 5.74907 27.2432 5.79935 27.1862C5.84948 27.1291 6.14087 26.4984 6.44674 25.7846C6.7526 25.0708 7.40314 23.5647 7.89233 22.4377L8.7818 20.3885L7.82143 20.2249C6.391 19.981 5.2525 19.5603 4.02152 18.8204L2.91881 18.1577L2.70324 18.5747Z" fill="url(#paint0_linear_10806_6088)"/>
<defs>
<linearGradient id="paint0_linear_10806_6088" x1="10" y1="0" x2="10" y2="27.1889" gradientUnits="userSpaceOnUse">
<stop stop-color="#FFD588"/>
<stop offset="1" stop-color="#FFD588" stop-opacity="0"/>
</linearGradient>
</defs>
</svg>
