<svg width="25" height="26" viewBox="0 0 25 26" fill="none" xmlns="http://www.w3.org/2000/svg">
<path fill-rule="evenodd" clip-rule="evenodd" d="M9.78356 0.297599C6.56876 0.987366 3.00458 3.68667 1.47021 6.59389C0.0144037 9.35254 -0.379898 12.5671 0.375272 15.5201C0.974143 17.8615 1.9132 19.4798 3.72172 21.2886C5.53045 23.0971 7.14882 24.0362 9.49018 24.635C12.4432 25.3902 15.6578 24.9959 18.4164 23.5401C20.1056 22.6485 22.6382 20.1159 23.5298 18.4267C24.9856 15.6681 25.3799 12.4535 24.6247 9.50048C24.0261 7.15996 23.0868 5.54075 21.2783 3.73097C18.1506 0.601422 14.0611 -0.62014 9.78356 0.297599ZM12.0821 3.25747V5.70603L10.9922 6.80974C10.083 7.73041 9.77917 7.91324 9.15961 7.91324C8.49868 7.91324 8.19967 7.69384 6.43607 5.91394L4.45516 3.91443L5.16039 3.31703C6.72255 1.99391 9.52863 0.853424 11.2985 0.822499L12.0821 0.808708V3.25747ZM15.4923 1.1211C16.9307 1.49576 18.1051 2.06872 19.4656 3.0598L20.4757 3.79554L18.4246 5.85439C16.6114 7.67462 16.289 7.91324 15.6448 7.91324C15.0468 7.91324 14.7183 7.71787 13.8125 6.82333L12.709 5.73341V3.27106V0.808708H13.5009C13.9364 0.808708 14.8326 0.949336 15.4923 1.1211ZM22.9677 7.32587C23.6562 8.68973 24.2016 10.585 24.2016 11.6139V12.3013H21.7534H19.3055L18.3057 11.3167C17.3518 10.3771 17.306 10.2791 17.306 9.1789V8.02608L19.1131 6.21066L20.9199 4.39525L21.6381 5.25489C22.033 5.72755 22.6315 6.6595 22.9677 7.32587ZM5.87 6.40249C7.6148 8.15543 7.69399 8.27537 7.69399 9.16448C7.69399 10.0049 7.5893 10.2003 6.60407 11.1978L5.51415 12.3013H3.15628H0.79841L0.800918 11.5178C0.804052 10.4964 1.24725 8.85689 1.89732 7.46169C2.4523 6.27043 3.62184 4.56993 3.88617 4.56993C3.97414 4.56993 4.8668 5.39448 5.87 6.40249ZM15.6013 9.44741L18.5928 12.4443L15.4975 15.4033L12.402 18.3623L9.42833 15.3941L6.45467 12.4257L9.4252 9.43947C11.0588 7.79706 12.4438 6.45264 12.5027 6.45201C12.5616 6.45117 13.956 7.79915 15.6013 9.44741ZM9.15669 8.6191C9.15669 8.66236 9.01564 8.81489 8.84325 8.95803C8.58644 9.17117 8.52982 9.15675 8.52982 8.87904C8.52982 8.69265 8.67086 8.54012 8.84325 8.54012C9.01564 8.54012 9.15669 8.57564 9.15669 8.6191ZM16.4702 8.87904C16.4702 9.15675 16.4136 9.17117 16.1567 8.95803C15.9844 8.81489 15.8433 8.66236 15.8433 8.6191C15.8433 8.57564 15.9844 8.54012 16.1567 8.54012C16.3291 8.54012 16.4702 8.69265 16.4702 8.87904ZM6.8147 13.8242C7.58387 14.6078 7.69399 14.8377 7.69399 15.657C7.69399 16.5599 7.62545 16.6614 5.79896 18.47L3.90393 20.3462L3.27873 19.6148C2.0977 18.2334 0.79841 14.9442 0.79841 13.3359C0.79841 12.9537 0.959307 12.9282 3.36691 12.9282H5.93541L6.8147 13.8242ZM24.1113 14.2233C23.9143 15.7084 23.3336 17.2839 22.443 18.75C21.2081 20.7829 21.3075 20.7856 19.1745 18.6624C17.3217 16.8184 17.306 16.7939 17.306 15.7623C17.306 14.8446 17.3971 14.6287 18.0798 13.9295L18.8535 13.1372H21.5545H24.2555L24.1113 14.2233ZM9.05221 16.0626L9.65275 16.6894H8.98681C8.38626 16.6894 8.32086 16.628 8.32086 16.0626C8.32086 15.7178 8.35032 15.4357 8.38626 15.4357C8.4222 15.4357 8.72185 15.7178 9.05221 16.0626ZM16.4702 16.167C16.4702 16.5939 16.3682 16.6894 15.9114 16.6894H15.3525L15.8433 16.167C16.1133 15.8797 16.3647 15.6447 16.4021 15.6447C16.4395 15.6447 16.4702 15.8797 16.4702 16.167ZM11.2897 18.299L12.0821 19.0728V21.6423V24.2119H11.4331C9.70332 24.2119 6.74783 23.0231 5.09895 21.6639L4.31495 21.0178L6.05201 19.2715L7.78927 17.5253H9.14332C10.423 17.5253 10.5408 17.5677 11.2897 18.299ZM18.7608 19.2935C20.4916 21.0332 20.5135 21.0683 20.1363 21.485C19.0734 22.6595 16.1053 23.9931 13.9105 24.2821L12.9179 24.4129V21.658V18.9033L13.5857 18.2144C14.2078 17.5725 14.3478 17.5253 15.6277 17.5253H17.0018L18.7608 19.2935Z" fill="#747070"/>
</svg>
