<svg width="1445" height="129" viewBox="0 0 1445 129" fill="none" xmlns="http://www.w3.org/2000/svg">
<rect x="0.5" y="-0.5" width="1445" height="129" transform="matrix(1 0 0 -1 -6 121)" fill="#FFCBA6" stroke="#DADADA"/>
<rect width="129" height="360.477" transform="matrix(-0.0216837 -0.999765 -0.99993 0.011824 1446.79 118.738)" fill="url(#paint0_linear_11073_12)"/>
<rect width="1260" height="129" transform="matrix(1 0 0 -1 -2 122)" fill="url(#paint1_linear_11073_12)"/>
<rect width="129" height="756.215" transform="matrix(-0.0216837 -0.999765 0.99993 -0.011824 -6.41016 128.551)" fill="url(#paint2_linear_11073_12)"/>
<rect width="129" height="186.958" transform="matrix(-0.0216837 -0.999765 0.99993 -0.011824 -6.54297 122.434)" fill="url(#paint3_linear_11073_12)"/>
<defs>
<linearGradient id="paint0_linear_11073_12" x1="56.625" y1="0" x2="56.625" y2="360.477" gradientUnits="userSpaceOnUse">
<stop stop-color="#FFD588"/>
<stop offset="1" stop-color="#FFD588" stop-opacity="0"/>
</linearGradient>
<linearGradient id="paint1_linear_11073_12" x1="560.87" y1="44.5143" x2="908.176" y2="130.516" gradientUnits="userSpaceOnUse">
<stop stop-color="white"/>
<stop offset="1" stop-color="white" stop-opacity="0"/>
</linearGradient>
<linearGradient id="paint2_linear_11073_12" x1="65.0765" y1="-43.1808" x2="-2.96825" y2="654.414" gradientUnits="userSpaceOnUse">
<stop offset="0.0656249" stop-color="#FDEFBD" stop-opacity="0.74"/>
<stop offset="1" stop-color="#FFD588" stop-opacity="0"/>
</linearGradient>
<linearGradient id="paint3_linear_11073_12" x1="59.1764" y1="-146.183" x2="56.2564" y2="100.771" gradientUnits="userSpaceOnUse">
<stop stop-color="#FFD588"/>
<stop offset="1" stop-color="#FFD588" stop-opacity="0"/>
</linearGradient>
</defs>
</svg>
