<svg width="13" height="15" viewBox="0 0 13 15" fill="none" xmlns="http://www.w3.org/2000/svg">
<path fill-rule="evenodd" clip-rule="evenodd" d="M6.07594 0.117077C5.75392 0.189591 5.37335 0.29271 5.23023 0.346322C5.08711 0.399866 4.85291 0.463904 4.70979 0.488658C4.07706 0.597966 3.49124 1.03876 3.19498 1.62863C3.0449 1.92742 3.0207 2.0672 2.9978 2.76772L2.97165 3.56624L2.68599 3.8493L2.40034 4.13229V5.01597V5.89959L2.60272 6.13798C2.7141 6.26908 2.87055 6.39333 2.95044 6.41404C3.07222 6.44566 3.1136 6.53761 3.20617 6.98305C3.35599 7.70402 3.74105 8.47341 4.22591 9.02049C4.44443 9.26709 4.61344 9.49452 4.60147 9.52593C4.5895 9.55735 4.44794 9.7835 4.28693 10.0286L3.99418 10.4742L3.49573 10.4763C1.95894 10.4829 0.826655 11.1173 0.308557 12.262C0.0500936 12.8331 -0.0891892 13.9528 0.0632347 14.2336C0.11671 14.3321 0.212015 14.4229 0.275119 14.4355C0.485442 14.4773 0.578796 14.3183 0.579186 13.9176C0.580422 12.6797 0.996449 11.88 1.87723 11.4224C2.33749 11.1834 2.796 11.0838 3.43699 11.0838H3.94676L4.32069 11.9415C4.52633 12.4132 4.76892 12.9807 4.8598 13.2027C5.04762 13.6616 5.17552 13.8418 5.3133 13.8418C5.3658 13.8418 5.654 13.5942 5.95377 13.2917L6.4988 12.7416L7.04383 13.2917C7.3436 13.5942 7.6318 13.8418 7.6843 13.8418C7.82208 13.8418 7.94998 13.6616 8.1378 13.2027C8.22868 12.9807 8.47127 12.4132 8.67691 11.9415L9.05084 11.0838H9.56725C10.9342 11.0838 11.9059 11.6718 12.2616 12.7142C12.3154 12.8717 12.3767 13.2883 12.398 13.6398C12.4192 13.9914 12.4654 14.3169 12.5007 14.3631C12.606 14.5011 12.7987 14.4589 12.9173 14.2717C13.0165 14.1152 13.0211 14.0179 12.9595 13.3741C12.9044 12.7962 12.8493 12.5626 12.6837 12.2038C12.1741 11.0997 11.0633 10.4829 9.5787 10.4796L9.04811 10.4784L8.67587 9.91177L8.30356 9.34505L8.53112 9.05412C9.04323 8.39922 9.3512 7.71216 9.49172 6.91114C9.54162 6.62667 9.60954 6.45023 9.69222 6.3903C9.95927 6.19697 10.0118 5.95986 10.0118 4.94723C10.0118 3.89511 9.97736 3.77389 9.62508 3.58555L9.4415 3.48734L9.41443 2.59377C9.39023 1.79363 9.36844 1.65701 9.20639 1.28806C8.7255 0.193223 7.60304 -0.226655 6.07594 0.117077ZM7.96566 0.777905C8.30707 0.959794 8.48584 1.14209 8.65811 1.48407C8.78197 1.72993 8.80558 1.91121 8.83707 2.8551C8.85698 3.45337 8.8938 3.96386 8.91878 3.98962C8.94383 4.01538 9.06093 4.05682 9.179 4.08171L9.39375 4.12704L9.41196 4.98483L9.43018 5.84261L9.23267 5.91378C9.0202 5.9904 9.02085 5.98872 8.90896 6.77876C8.75296 7.87985 8.0207 8.98834 7.19567 9.37243C6.4774 9.70675 5.8178 9.60161 5.06928 9.03347C4.36656 8.50005 3.70501 7.21627 3.70222 6.38048C3.70131 6.11504 3.54673 5.90524 3.34981 5.90214C3.04009 5.8973 2.98583 5.76909 2.98583 5.04234C2.98583 4.38743 2.99182 4.35918 3.15465 4.24261C3.57562 3.94125 3.57133 3.9535 3.57133 3.05865C3.57133 2.30526 3.58629 2.19999 3.73806 1.88505C3.92744 1.49221 4.35251 1.15467 4.73542 1.09312C4.86442 1.0724 5.21884 0.980512 5.52298 0.888895C6.36479 0.635367 6.61603 0.594536 7.185 0.618685C7.55061 0.634223 7.78617 0.682252 7.96566 0.777905ZM8.162 10.209C8.33303 10.4677 8.46053 10.6896 8.44544 10.702C8.43028 10.7143 7.98687 11.0018 7.45999 11.3409L6.50199 11.9574L5.52824 11.3292L4.5545 10.7011L4.84068 10.26L5.12679 9.81895L5.53163 9.98806C5.8865 10.1362 6.01004 10.1538 6.53341 10.1301C7.02184 10.108 7.18825 10.071 7.44886 9.92644C7.62406 9.82931 7.78624 9.74724 7.80927 9.74415C7.8323 9.74105 7.99103 9.95018 8.162 10.209ZM5.43359 11.9751C5.7331 12.1693 5.97817 12.3447 5.97823 12.3647C5.9783 12.3848 5.8478 12.5336 5.68822 12.6956L5.39801 12.9901L5.33718 12.8273C5.30374 12.7378 5.17252 12.43 5.0456 12.1433C4.91861 11.8566 4.83151 11.622 4.85193 11.622C4.87236 11.622 5.13414 11.7809 5.43359 11.9751ZM7.90139 12.2633C7.74773 12.616 7.60896 12.9181 7.59303 12.9345C7.57715 12.951 7.43598 12.8295 7.27946 12.6646C7.12294 12.4997 7.00766 12.3526 7.02327 12.3377C7.10036 12.2648 8.09844 11.6242 8.13669 11.6232C8.16089 11.6225 8.05505 11.9105 7.90139 12.2633Z" fill="#2D197C"/>
</svg>
