<svg width="25" height="25" viewBox="0 0 25 25" fill="none" xmlns="http://www.w3.org/2000/svg">
<path fill-rule="evenodd" clip-rule="evenodd" d="M6.4145 0.0544526C6.29922 0.142197 5.44434 1.8712 5.44434 2.01656C5.44434 2.29039 5.78794 2.43033 5.98252 2.23575C6.03677 2.1815 6.227 1.83541 6.40518 1.46671C6.58335 1.09806 6.73696 0.786972 6.74648 0.775448C6.75605 0.763925 6.88999 0.806259 7.04404 0.869443C7.56338 1.08253 9.86133 2.04293 10.083 2.13951C10.2039 2.19215 11.3025 2.65059 12.5244 3.15821C13.7463 3.66583 15.149 4.24976 15.6416 4.45577C16.1687 4.67628 16.5884 4.82418 16.6621 4.81534C16.7309 4.80709 16.8311 4.74127 16.8847 4.66915C17.0293 4.47457 16.9348 4.27857 16.634 4.14942C16.1381 3.93658 8.99092 0.957919 7.88574 0.503525C7.73804 0.442783 7.39839 0.302548 7.13096 0.191904C6.60703 -0.0248442 6.53647 -0.0383696 6.4145 0.0544526ZM1.90078 2.5316C1.84712 2.55147 1.77764 2.59854 1.74639 2.63624C1.67769 2.719 0.854492 6.39102 0.854492 6.6147C0.854492 6.78785 0.99541 6.92432 1.17422 6.92432C1.41411 6.92432 1.46553 6.78111 1.85811 5.02003C2.0646 4.09351 2.25161 3.31583 2.27363 3.2919C2.31216 3.24996 2.75068 3.34122 5.54199 3.97183C6.19995 4.12047 7.1228 4.32818 7.59277 4.43345C8.06274 4.53868 8.88672 4.72374 9.42383 4.84473C9.96094 4.96568 10.8398 5.16339 11.377 5.28409C11.9141 5.40479 12.8369 5.61236 13.4277 5.74537C17.6649 6.69913 18.6811 6.92432 18.7477 6.92432C18.8695 6.92432 19.0186 6.74044 19.0186 6.5901C19.0186 6.30782 19.1809 6.35816 15.8447 5.60596C15.3748 5.50001 14.4958 5.30225 13.8916 5.16651C13.2874 5.03077 12.4084 4.83301 11.9385 4.72706C11.4685 4.6211 10.5896 4.42335 9.98535 4.28761C9.3811 4.15186 8.5022 3.95411 8.03223 3.84815C5.80063 3.34498 2.43232 2.58961 2.07339 2.51182C2.03208 2.50284 1.95444 2.51178 1.90078 2.5316ZM0.0930176 8.0525C0.0027832 8.1522 0 8.30894 0 13.2757V18.3962L0.11123 18.5074L0.222412 18.6187L7.37588 18.6313C13.7139 18.6426 14.5458 18.6355 14.6736 18.5694C14.8656 18.4702 14.9106 18.2838 14.7838 18.1139L14.6867 17.9839L7.67295 17.9715L0.65918 17.9591V13.2718V8.58448H10.7666H20.874V9.09937C20.874 9.58101 20.8818 9.62208 20.9939 9.73414C21.0598 9.80005 21.1597 9.85401 21.2158 9.85401C21.272 9.85401 21.3718 9.80005 21.4377 9.73414C21.5543 9.61753 21.5576 9.59444 21.5576 8.88155C21.5576 8.19068 21.5515 8.14312 21.4507 8.04927C21.3439 7.94971 21.3438 7.94971 10.7649 7.94971H0.186035L0.0930176 8.0525ZM2.9144 10.4033C2.46968 10.8398 2.01104 11.2903 1.89517 11.4046L1.68457 11.6124V13.2461V14.8799L1.84316 15.0647C1.93042 15.1664 2.01279 15.2605 2.02627 15.2739C2.03975 15.2874 2.28149 15.551 2.56348 15.8598C2.84546 16.1686 3.18428 16.5367 3.31636 16.6777L3.55654 16.9341H5.35303C7.13823 16.9341 7.15015 16.9334 7.24907 16.8272C7.37544 16.6916 7.37617 16.5222 7.25098 16.397C7.15718 16.3032 7.08823 16.2993 5.5001 16.2993H3.84692L3.48613 15.8965C3.2877 15.6749 3.10181 15.4717 3.07295 15.4448C3.04414 15.418 2.86279 15.2182 2.66997 15.0009L2.31934 14.6058V13.2614V11.917L3.12808 11.1174L3.93687 10.3179L5.54946 10.2935L7.16206 10.269L7.25537 10.1538C7.37998 9.99976 7.373 9.84512 7.23564 9.71602C7.12407 9.61124 7.10083 9.60987 5.4228 9.60987H3.723L2.9144 10.4033ZM9.73447 9.68614C8.99956 9.81915 8.33555 10.1629 7.81006 10.6823C7.03096 11.4524 6.65708 12.4378 6.72905 13.5313C6.82959 15.0574 7.86514 16.3224 9.39941 16.7933C9.88706 16.9429 10.7777 16.9525 11.2549 16.8133C12.9258 16.3259 13.9893 14.9508 13.9893 13.2777C13.9893 12.7011 13.8834 12.2135 13.6542 11.7339C13.1179 10.6116 12.0593 9.8314 10.8433 9.66226C10.3757 9.59722 10.2054 9.60088 9.73447 9.68614ZM13.4557 9.73853C13.3221 9.90835 13.328 10.0075 13.4805 10.1507L13.6065 10.269H15.3646H17.1227L17.2406 10.132C17.3846 9.96461 17.3872 9.90372 17.2572 9.73853L17.156 9.60987H15.3564H13.5569L13.4557 9.73853ZM11.2549 10.3809C11.9123 10.6136 12.3092 10.8809 12.6858 11.3444C13.1752 11.9467 13.3707 12.5123 13.369 13.3208C13.3678 13.9023 13.276 14.2447 12.977 14.7828C12.1212 16.3226 10.0448 16.7751 8.59204 15.7384C8.02622 15.3346 7.59507 14.6955 7.41538 13.9939C7.30728 13.5721 7.34507 12.6762 7.48765 12.2798C7.83721 11.3079 8.69751 10.5445 9.70059 10.3163C10.117 10.2215 10.8962 10.2539 11.2549 10.3809ZM19.5801 10.8107C17.5324 10.9667 16.1973 11.4408 15.888 12.1218C15.8025 12.3101 15.798 12.57 15.7973 17.398C15.7967 20.8305 15.8132 22.5365 15.8482 22.6626C16.0735 23.4738 17.6275 24.0111 19.9951 24.0964C22.0296 24.1697 23.9298 23.76 24.6503 23.0927C24.9725 22.7944 24.9498 23.1924 24.9647 17.5789C24.9736 14.216 24.9612 12.4234 24.9282 12.3008C24.7361 11.5873 23.6985 11.1004 21.8994 10.8797C21.4495 10.8245 19.9749 10.7806 19.5801 10.8107ZM10.114 11.5177C10.0411 11.5751 9.98535 11.668 9.98535 11.7321C9.98535 11.8152 9.94951 11.8541 9.85107 11.8782C9.6293 11.9323 9.34941 12.1551 9.24434 12.3611C9.06494 12.7127 9.13682 13.0899 9.4396 13.3856C9.66221 13.603 9.84858 13.6626 10.3053 13.6626C10.5176 13.6626 10.6849 13.6879 10.7403 13.7284C10.923 13.8621 10.7777 13.9067 10.1606 13.9067C9.83057 13.9067 9.48897 13.9316 9.40156 13.9621C9.10791 14.0645 9.05259 14.4722 9.31055 14.6333C9.36811 14.6692 9.54351 14.7103 9.70029 14.7245C9.93193 14.7456 9.98535 14.7668 9.98535 14.8377C9.98535 14.9532 10.2118 15.1274 10.3619 15.1274C10.4933 15.1274 10.7666 14.8853 10.7666 14.7689C10.7666 14.7266 10.8313 14.6815 10.9197 14.6621C11.1344 14.6149 11.4806 14.2543 11.5467 14.0087C11.6323 13.6909 11.4903 13.3084 11.205 13.088C11.0161 12.9422 10.7817 12.8814 10.4053 12.8806C10.0302 12.8798 9.9061 12.8357 9.95083 12.7191C9.97412 12.6585 10.1059 12.6418 10.6647 12.6288C11.2971 12.614 11.3585 12.6044 11.4587 12.504C11.5313 12.4313 11.5674 12.3361 11.5674 12.2169C11.5674 11.9592 11.4209 11.856 11.0551 11.856C10.7896 11.856 10.7662 11.8469 10.7376 11.7331C10.6997 11.5819 10.498 11.4165 10.3516 11.4165C10.2917 11.4165 10.1848 11.4621 10.114 11.5177ZM22.0215 11.6888C22.951 11.8079 24.0501 12.166 24.1306 12.3758C24.2397 12.6601 23.13 13.0634 21.8018 13.2222C21.2107 13.2928 19.567 13.2947 18.9941 13.2253C18.0183 13.1072 17.1994 12.8876 16.8074 12.6389C16.5263 12.4606 16.5431 12.3819 16.9033 12.1878C17.8835 11.6597 20.1052 11.4431 22.0215 11.6888ZM16.7627 13.486C17.2875 13.7547 18.4025 13.9789 19.6161 14.0596C21.174 14.1633 22.99 13.9345 23.9399 13.5148L24.1494 13.4222L24.1353 13.8232L24.1211 14.2241L23.7674 14.3995C23.3668 14.598 22.8051 14.7478 22.0209 14.865C21.3577 14.9642 19.5907 14.979 18.9209 14.8909C17.9606 14.7646 17.1581 14.542 16.7969 14.3019L16.6016 14.172L16.5873 13.7952C16.5794 13.588 16.586 13.4185 16.602 13.4185C16.6178 13.4185 16.6901 13.4488 16.7627 13.486ZM17.1995 15.3248C17.9816 15.6002 19.0443 15.7343 20.4346 15.733C21.925 15.7316 23.1368 15.5458 23.8827 15.2043L24.1494 15.0822L24.1353 15.4833L24.1211 15.8843L23.8246 16.0411C22.4926 16.7457 19.198 16.8387 17.3521 16.224C17.1443 16.1548 16.885 16.0334 16.7758 15.9543L16.5771 15.8104V15.4439V15.0773L16.7603 15.156C16.861 15.1992 17.0586 15.2752 17.1995 15.3248ZM16.9625 16.9113C17.654 17.1923 18.704 17.3666 19.9463 17.4066C21.4154 17.454 22.883 17.2707 23.7306 16.934C23.9333 16.8535 24.1096 16.7876 24.1224 16.7876C24.1351 16.7876 24.1455 16.949 24.1455 17.1462C24.1455 17.5388 24.1218 17.58 23.8037 17.7415C23.5449 17.8729 22.716 18.1009 22.168 18.1916C21.5452 18.2946 19.4072 18.3083 18.75 18.2135C17.8366 18.0817 16.8949 17.782 16.6618 17.5488C16.5978 17.4849 16.5771 17.3817 16.5771 17.1259C16.5771 16.9398 16.5953 16.7876 16.6176 16.7876C16.6398 16.7876 16.795 16.8433 16.9625 16.9113ZM17.2378 18.6702C18.1425 18.975 18.799 19.0555 20.3857 19.0561C21.63 19.0566 21.8443 19.0446 22.4104 18.9431C22.9433 18.8474 23.7287 18.625 24.0601 18.4758C24.1373 18.441 24.1455 18.4728 24.1455 18.8063C24.1455 19.166 24.1416 19.1781 23.9868 19.2921C23.7592 19.4599 23.3682 19.6027 22.7647 19.7386C21.9476 19.9226 21.2382 19.9769 20.0258 19.9484C18.5632 19.9141 17.674 19.7539 16.9434 19.3932C16.6127 19.2299 16.5771 19.1699 16.5771 18.775C16.5771 18.473 16.5862 18.4409 16.6626 18.4712C16.7096 18.4899 16.9685 18.5794 17.2378 18.6702ZM17.3037 20.3721C19.0902 20.9346 22.3486 20.8649 23.8467 20.2322L24.1211 20.1163L24.1355 20.4598C24.1527 20.8681 24.105 20.9427 23.7156 21.1165C22.2555 21.7681 19.0698 21.8289 17.3542 21.238C16.6945 21.0108 16.5771 20.8967 16.5771 20.4823C16.5771 20.3122 16.5909 20.1592 16.6078 20.1424C16.6246 20.1256 16.696 20.1414 16.7665 20.1775C16.8369 20.2137 17.0787 20.3013 17.3037 20.3721ZM17.1227 21.983C19.03 22.6134 22.1756 22.58 23.8178 21.912L24.1493 21.7772L24.1352 22.1754L24.1211 22.5737L23.7792 22.7446C23.3911 22.9386 22.7948 23.1013 22.0459 23.2176C21.3104 23.3317 19.4819 23.331 18.7256 23.2162C17.7149 23.0628 16.9776 22.8333 16.7165 22.5908C16.5911 22.4743 16.5771 22.4299 16.5771 22.1472C16.5771 21.9745 16.5909 21.8194 16.6078 21.8026C16.6246 21.7857 16.6998 21.8037 16.7749 21.8425C16.8499 21.8813 17.0064 21.9446 17.1227 21.983Z" fill="white"/>
</svg>
