<svg width="128" height="117" viewBox="0 0 128 117" fill="none" xmlns="http://www.w3.org/2000/svg">
<path fill-rule="evenodd" clip-rule="evenodd" d="M46.2537 4.81079C24.0822 7.97399 12.0303 9.96604 11.3283 10.5821C10.3961 11.401 10.6606 13.7276 13.3575 28.4438C15.3471 39.3029 16.8486 45.7091 17.5499 46.3278C18.5119 47.1768 21.2915 46.9143 40.8056 44.1321C52.9946 42.3941 63.5375 40.8406 64.2343 40.6796C65.9042 40.2933 66.6777 38.0191 65.5465 36.8218C64.2812 35.4824 63.7074 35.5256 41.9383 38.6024C31.1912 40.1212 22.2267 41.2131 22.0158 41.0285C21.3883 40.4766 16.8919 14.9223 17.3517 14.5184C17.7921 14.1315 81.3721 4.97445 81.5978 5.26511C81.6686 5.3561 82.308 8.96576 83.0197 13.2864C83.7306 17.6069 84.4929 21.8045 84.7127 22.6149C85.0808 23.9707 84.8543 24.0878 81.8676 24.0878C80.0829 24.0878 76.0216 24.8485 72.8434 25.7788C68.0899 27.1692 66.9825 27.7558 66.6032 29.0827C65.51 32.9104 68.5347 39.9195 71.6645 40.8092C72.3486 41.0043 75.6796 40.5415 79.0672 39.7814C87.4081 37.9111 90.9693 38.3805 99.1097 42.4255C102.593 44.1564 107.699 46.2584 110.456 47.097C115.007 48.4809 115.575 48.5267 116.636 47.5951C118.183 46.2368 128.247 22.8165 127.995 21.1616C127.853 20.2235 126.261 19.3306 122.161 17.8884C118.21 16.4987 114.416 14.4097 109.492 10.9126C101.51 5.24285 98.5195 3.77123 91.6579 2.13529C88.9938 1.5003 86.4952 0.730445 86.1062 0.423421C84.8543 -0.561806 80.7111 -0.105525 46.2537 4.81079ZM97.7326 9.71663C98.6954 10.1565 101.815 12.1702 104.667 14.1924C107.518 16.2145 110.305 18.1732 110.861 18.545C111.83 19.1925 110.588 22.6856 104.398 36.7236L103.588 38.5579L98.9271 36.306C92.7719 33.3326 86.9043 32.7369 79.296 34.3126C76.269 34.9391 73.6482 35.3247 73.4708 35.1695C73.2942 35.0137 72.9284 34.1129 72.6578 33.167C72.204 31.5788 72.4388 31.3654 75.7109 30.3861C77.6603 29.8022 81.5189 29.3249 84.2857 29.3249C90.0728 29.3249 91.8196 28.3757 91.2577 25.5352C89.9715 19.0334 87.9319 7.78545 87.9319 7.19366C87.9319 6.4788 94.1542 8.08069 97.7326 9.71663ZM47.6926 13.6942C43.0881 15.3072 40.24 19.2298 40.24 23.9582C40.24 34.7257 57.1036 38.1272 62.7007 28.489C64.662 25.1123 64.3118 20.5783 61.8564 17.5487C58.866 13.8598 52.312 12.0759 47.6926 13.6942ZM54.634 18.9575C59.4748 21.2225 59.0873 26.98 53.979 28.686C51.7755 29.4218 47.9356 28.3292 46.9311 26.6809C43.9824 21.8411 49.332 16.477 54.634 18.9575ZM119.503 22.7452L121.364 23.3671L119.292 28.1459C118.153 30.7749 116.312 35.0399 115.2 37.6237C113.194 42.29 113.165 42.3181 111.071 41.6766L108.962 41.0305L111.001 36.3236C112.124 33.7346 113.961 29.4801 115.084 26.87C116.206 24.26 117.241 22.1239 117.383 22.1239C117.525 22.1239 118.479 22.4035 119.503 22.7452ZM24.6694 51.8274C24.071 52.4604 23.8787 57.5292 24.0188 68.9409C24.1992 83.5562 24.3467 85.2256 25.5226 85.8769C26.4735 86.4033 27.1799 86.4033 28.1308 85.8769C29.2985 85.2301 29.4557 83.6368 29.6353 70.6599L29.8357 56.165H35.7831H41.7304L41.8183 63.2023C41.8668 67.0725 42.1209 71.1234 42.3824 72.2036C42.9801 74.6728 45.1314 75.0473 48.4721 73.2628L50.9126 71.9587L53.757 73.3904C55.988 74.5138 56.8852 74.6656 57.9218 74.0974C59.0582 73.4735 59.2713 72.1721 59.4502 64.7689L59.6581 56.165H65.5853H71.5132L71.7115 73.2785C71.8911 88.7514 72.0356 90.4607 73.2145 91.1134C74.1654 91.6403 74.8718 91.6403 75.8227 91.1134C77.0075 90.4574 77.1446 88.6703 77.3249 71.5574C77.465 58.2081 77.2758 52.4617 76.6744 51.8254C75.421 50.4985 25.9228 50.5004 24.6694 51.8274ZM53.6534 61.768C53.6534 66.014 53.4328 67.2512 52.7435 66.8768C52.2427 66.6051 50.9014 66.4454 49.7628 66.5213L47.6919 66.6601V61.8492C47.6919 59.2025 47.9154 56.8412 48.1889 56.6016C48.4617 56.3614 49.803 56.165 51.1697 56.165H53.6534V61.768ZM1.30408 81.0935C0.116249 81.701 0 83.2388 0 98.2908C0 110.274 0.245911 115.036 0.894223 115.606C1.47323 116.115 4.48155 116.391 9.43778 116.391C16.2376 116.391 17.1728 116.251 17.8584 115.125C18.2824 114.429 18.6296 113.292 18.6296 112.6C18.6296 111.402 19.3398 111.466 33.1958 113.91L47.7612 116.479L59.9405 113.131C82.2462 106.999 94.0991 101.559 96.1014 96.5331C97.4994 93.0242 93.7518 88.2421 89.6041 88.2421C88.657 88.2421 86.2262 88.9792 84.2023 89.88C80.1917 91.6659 68.1256 94.38 66.554 93.8497C66.016 93.6684 65.5763 93.1034 65.5763 92.5941C65.5763 91.1448 59.7199 86.8189 58.2683 87.196C43.1224 91.1264 35.9075 91.26 25.6202 87.8009C19.6021 85.7774 18.6296 85.2413 18.6296 83.9471C18.6296 81.0627 16.871 80.3845 9.44821 80.4061C5.68577 80.4173 2.02094 80.7263 1.30408 81.0935ZM12.4983 98.5526L12.7002 111.154H9.33122H5.96149V98.3517V85.5483L9.12853 85.7499L12.2956 85.9509L12.4983 98.5526ZM38.2213 95.4889C43.2402 95.5721 46.8349 95.2074 51.6041 94.1332C56.9732 92.9234 58.3279 92.8121 59.278 93.5054C59.9129 93.9682 60.3317 94.9351 60.2095 95.6539C59.9442 97.2178 54.4761 99.0299 47.9162 99.729C42.1306 100.346 40.8407 101.001 41.1268 103.179C41.3548 104.91 41.4331 104.934 46.6755 104.85C51.7889 104.768 61.5598 102.505 66.3215 100.299C67.3462 99.8246 71.3433 98.8119 75.2049 98.0486C79.0657 97.2853 83.8267 95.9478 85.7843 95.0765C90.6004 92.9326 91.4969 94.2006 87.4006 97.3632C83.8759 100.084 74.8167 103.429 58.7937 107.924L47.5347 111.082L34.7592 108.836C27.7321 107.601 21.2281 106.434 20.3063 106.241C18.6893 105.905 18.6296 105.629 18.6296 98.4387V90.9857L24.9943 93.1807C30.4103 95.0484 32.3828 95.3927 38.2213 95.4889Z" fill="#FD9149"/>
</svg>
