<svg width="7" height="8" viewBox="0 0 7 8" fill="none" xmlns="http://www.w3.org/2000/svg">
<path fill-rule="evenodd" clip-rule="evenodd" d="M3.3592 0.00605808C2.92384 0.0338221 2.51594 0.189011 2.1529 0.465007C2.06078 0.535034 1.84018 0.754677 1.7704 0.845836C1.45702 1.25525 1.30379 1.70173 1.30376 2.2055C1.30374 2.56539 1.3727 2.86757 1.52606 3.17959C1.62189 3.37457 1.72422 3.52642 1.87164 3.69244C1.99735 3.83401 2.19366 3.99698 2.35665 4.09507C2.39893 4.12052 2.43352 4.14378 2.43352 4.14378C2.43352 4.14378 2.41138 4.15345 2.38432 4.16229C2.28763 4.19385 2.09264 4.27416 1.97797 4.32965C1.4118 4.60363 0.920074 5.0289 0.558635 5.55717C0.363615 5.8422 0.205215 6.18268 0.105234 6.53177C0.046209 6.73786 -0.00505335 7.00735 0.000398698 7.0829C0.0083581 7.19314 0.10382 7.28287 0.213094 7.28283C0.266047 7.28281 0.301682 7.26882 0.342194 7.23214C0.392137 7.18693 0.404076 7.15786 0.42869 7.02169C0.521462 6.50835 0.718465 6.05119 1.02703 5.6332C1.3758 5.16073 1.87882 4.77212 2.41894 4.55785C3.46111 4.14441 4.61302 4.35343 5.49118 5.11533C6.05717 5.60638 6.44272 6.28898 6.56972 7.02481C6.5961 7.17768 6.6221 7.22431 6.70308 7.26402C6.82295 7.32279 6.97112 7.24202 6.99658 7.10402C7.00258 7.0715 7.00108 7.04456 6.98894 6.96629C6.91156 6.46743 6.72645 5.98613 6.45684 5.58273C6.01887 4.92745 5.38828 4.43618 4.64798 4.17352L4.56281 4.14331L4.64055 4.09605C4.92742 3.92172 5.20332 3.64472 5.37894 3.35472C5.82078 2.62513 5.80179 1.69718 5.33053 0.988272C5.21064 0.807934 5.02041 0.600613 4.8603 0.475803C4.49188 0.188617 4.0899 0.0357358 3.62506 0.00602156C3.49938 -0.00201326 3.48566 -0.00201326 3.3592 0.00605808ZM3.73822 0.389604C4.05589 0.436834 4.36221 0.573288 4.62447 0.784384C5.01029 1.09495 5.27135 1.56701 5.32056 2.04305C5.33132 2.14717 5.32527 2.37244 5.30917 2.46731C5.24849 2.82478 5.08739 3.14108 4.83154 3.40508C4.50094 3.74621 4.07872 3.94207 3.6095 3.97196C3.08768 4.0052 2.57055 3.80726 2.19141 3.42916C2.04951 3.28764 1.93464 3.12667 1.84652 2.94585C1.76199 2.7724 1.71058 2.60399 1.68625 2.42083C1.66926 2.29289 1.67415 2.04876 1.69616 1.92689C1.79406 1.38472 2.12447 0.912985 2.60941 0.623038C2.83527 0.487987 3.08213 0.406667 3.35191 0.378436C3.43593 0.369649 3.64456 0.375675 3.73822 0.389604Z" fill="#012433"/>
</svg>
