<svg width="71" height="18" viewBox="0 0 71 18" fill="none" xmlns="http://www.w3.org/2000/svg">
<g filter="url(#filter0_f_4837_690)">
<ellipse cx="35.5" cy="9" rx="31.5" ry="5" fill="#DFDBDB" fill-opacity="0.32"/>
</g>
<defs>
<filter id="filter0_f_4837_690" x="0" y="0" width="71" height="18" filterUnits="userSpaceOnUse" color-interpolation-filters="sRGB">
<feFlood flood-opacity="0" result="BackgroundImageFix"/>
<feBlend mode="normal" in="SourceGraphic" in2="BackgroundImageFix" result="shape"/>
<feGaussianBlur stdDeviation="2" result="effect1_foregroundBlur_4837_690"/>
</filter>
</defs>
</svg>
