<svg width="150" height="45" viewBox="0 0 150 45" fill="none" xmlns="http://www.w3.org/2000/svg">
<path d="M8.95236 17.3104C12.2883 6.9921 21.8959 0.000976562 32.7401 0.000976562H150V35.001C150 40.5238 145.523 45.001 140 45.001H0L8.95236 17.3104Z" fill="#FD9149"/>
<path d="M8.95236 17.3104C12.2883 6.9921 21.8959 0.000976562 32.7401 0.000976562H150V35.001C150 40.5238 145.523 45.001 140 45.001H0L8.95236 17.3104Z" fill="url(#paint0_linear_11422_10)"/>
<path d="M56.3858 28.3019C55.6492 28.3019 54.9688 28.2109 54.3448 28.0289C53.7295 27.8382 53.2008 27.5782 52.7588 27.2489L53.2788 25.9359C53.5735 26.1439 53.8812 26.3215 54.2018 26.4689C54.5225 26.6075 54.8648 26.7159 55.2288 26.7939C55.5928 26.8632 55.9785 26.8979 56.3858 26.8979C57.0705 26.8979 57.5645 26.7852 57.8678 26.5599C58.1712 26.3345 58.3228 26.0399 58.3228 25.6759C58.3228 25.3552 58.2188 25.1125 58.0108 24.9479C57.8028 24.7745 57.4302 24.6315 56.8928 24.5189L55.4238 24.2199C54.5832 24.0465 53.9548 23.7562 53.5388 23.3489C53.1228 22.9415 52.9148 22.3955 52.9148 21.7109C52.9148 21.1389 53.0665 20.6405 53.3698 20.2159C53.6732 19.7912 54.0978 19.4619 54.6438 19.2279C55.1898 18.9939 55.8268 18.8769 56.5548 18.8769C57.2048 18.8769 57.8072 18.9722 58.3618 19.1629C58.9165 19.3449 59.3802 19.6092 59.7528 19.9559L59.2328 21.2039C58.8602 20.8919 58.4528 20.6622 58.0108 20.5149C57.5688 20.3589 57.0748 20.2809 56.5288 20.2809C55.9135 20.2809 55.4325 20.4022 55.0858 20.6449C54.7478 20.8789 54.5788 21.2039 54.5788 21.6199C54.5788 21.9405 54.6828 22.1962 54.8908 22.3869C55.1075 22.5775 55.4715 22.7249 55.9828 22.8289L57.4388 23.1149C58.3055 23.2882 58.9468 23.5742 59.3628 23.9729C59.7788 24.3629 59.9868 24.8915 59.9868 25.5589C59.9868 26.1049 59.8395 26.5859 59.5448 27.0019C59.2502 27.4092 58.8342 27.7299 58.2968 27.9639C57.7595 28.1892 57.1225 28.3019 56.3858 28.3019ZM64.6087 28.3019C63.5081 28.3019 62.6457 27.9985 62.0217 27.3919C61.3977 26.7852 61.0857 25.9532 61.0857 24.8959C61.0857 24.2112 61.2201 23.6132 61.4887 23.1019C61.7574 22.5905 62.1301 22.1919 62.6067 21.9059C63.0921 21.6199 63.6554 21.4769 64.2967 21.4769C64.9294 21.4769 65.4581 21.6112 65.8827 21.8799C66.3074 22.1485 66.6281 22.5255 66.8447 23.0109C67.0701 23.4962 67.1827 24.0639 67.1827 24.7139V25.1429H62.3987V24.2849H66.0257L65.8047 24.4669C65.8047 23.8602 65.6747 23.3965 65.4147 23.0759C65.1634 22.7552 64.7951 22.5949 64.3097 22.5949C63.7724 22.5949 63.3564 22.7855 63.0617 23.1669C62.7757 23.5482 62.6327 24.0812 62.6327 24.7659V24.9349C62.6327 25.6455 62.8061 26.1785 63.1527 26.5339C63.5081 26.8805 64.0064 27.0539 64.6477 27.0539C65.0204 27.0539 65.3671 27.0062 65.6877 26.9109C66.0171 26.8069 66.3291 26.6422 66.6237 26.4169L67.1047 27.5089C66.7927 27.7602 66.4201 27.9552 65.9867 28.0939C65.5534 28.2325 65.0941 28.3019 64.6087 28.3019ZM68.5588 28.1719V18.6039H70.1838V28.1719H68.5588ZM75.1205 28.3019C74.0198 28.3019 73.1575 27.9985 72.5335 27.3919C71.9095 26.7852 71.5975 25.9532 71.5975 24.8959C71.5975 24.2112 71.7318 23.6132 72.0005 23.1019C72.2691 22.5905 72.6418 22.1919 73.1185 21.9059C73.6038 21.6199 74.1671 21.4769 74.8085 21.4769C75.4411 21.4769 75.9698 21.6112 76.3945 21.8799C76.8191 22.1485 77.1398 22.5255 77.3565 23.0109C77.5818 23.4962 77.6945 24.0639 77.6945 24.7139V25.1429H72.9105V24.2849H76.5375L76.3165 24.4669C76.3165 23.8602 76.1865 23.3965 75.9265 23.0759C75.6751 22.7552 75.3068 22.5949 74.8215 22.5949C74.2841 22.5949 73.8681 22.7855 73.5735 23.1669C73.2875 23.5482 73.1445 24.0812 73.1445 24.7659V24.9349C73.1445 25.6455 73.3178 26.1785 73.6645 26.5339C74.0198 26.8805 74.5181 27.0539 75.1595 27.0539C75.5321 27.0539 75.8788 27.0062 76.1995 26.9109C76.5288 26.8069 76.8408 26.6422 77.1355 26.4169L77.6165 27.5089C77.3045 27.7602 76.9318 27.9552 76.4985 28.0939C76.0651 28.2325 75.6058 28.3019 75.1205 28.3019ZM82.0865 28.3019C81.4105 28.3019 80.8169 28.1632 80.3055 27.8859C79.8029 27.6085 79.4129 27.2142 79.1355 26.7029C78.8582 26.1829 78.7195 25.5675 78.7195 24.8569C78.7195 24.1462 78.8582 23.5395 79.1355 23.0369C79.4215 22.5342 79.8159 22.1485 80.3185 21.8799C80.8212 21.6112 81.4105 21.4769 82.0865 21.4769C82.5199 21.4769 82.9402 21.5462 83.3475 21.6849C83.7635 21.8149 84.1015 22.0055 84.3615 22.2569L83.8675 23.3879C83.6335 23.1712 83.3692 23.0109 83.0745 22.9069C82.7885 22.7942 82.5069 22.7379 82.2295 22.7379C81.6489 22.7379 81.1939 22.9199 80.8645 23.2839C80.5439 23.6479 80.3835 24.1765 80.3835 24.8699C80.3835 25.5632 80.5439 26.0962 80.8645 26.4689C81.1939 26.8415 81.6489 27.0279 82.2295 27.0279C82.4982 27.0279 82.7755 26.9759 83.0615 26.8719C83.3562 26.7679 83.6249 26.6075 83.8675 26.3909L84.3615 27.5089C84.0929 27.7602 83.7505 27.9552 83.3345 28.0939C82.9272 28.2325 82.5112 28.3019 82.0865 28.3019ZM88.4547 28.3019C87.6747 28.3019 87.0854 28.0982 86.6867 27.6909C86.288 27.2835 86.0887 26.6725 86.0887 25.8579V22.8289H84.8277V21.6069H86.0887V19.9299L87.7137 19.5139V21.6069H89.4687V22.8289H87.7137V25.7539C87.7137 26.2045 87.8004 26.5209 87.9737 26.7029C88.147 26.8849 88.3854 26.9759 88.6887 26.9759C88.8534 26.9759 88.992 26.9629 89.1047 26.9369C89.226 26.9109 89.343 26.8762 89.4557 26.8329V28.1199C89.3084 28.1805 89.1437 28.2239 88.9617 28.2499C88.7884 28.2845 88.6194 28.3019 88.4547 28.3019Z" fill="#302F2F"/>
<defs>
<linearGradient id="paint0_linear_11422_10" x1="32.6087" y1="32.379" x2="132.448" y2="34.2136" gradientUnits="userSpaceOnUse">
<stop stop-color="#FFD588"/>
<stop offset="1" stop-color="#FFD588" stop-opacity="0"/>
</linearGradient>
</defs>
</svg>
