<svg width="30" height="21" viewBox="0 0 30 21" fill="none" xmlns="http://www.w3.org/2000/svg">
<path fill-rule="evenodd" clip-rule="evenodd" d="M2.0008 0.0364519C1.07609 0.240461 0.369192 0.902096 0.0799294 1.83428L0.0104157 2.05829L0.00193321 10.0202C-0.00394636 15.554 0.00343372 18.0475 0.0261558 18.1965C0.183465 19.2271 0.977452 20.0665 1.99379 20.2764C2.2049 20.32 3.48193 20.3248 15.0002 20.3248C26.4764 20.3248 27.7964 20.3199 28.0085 20.2768C29.0193 20.0712 29.8169 19.2271 29.9742 18.1965C29.9969 18.0474 30.0041 15.5566 29.9978 10.0202C29.9892 2.41501 29.9863 2.05005 29.9329 1.87455C29.6616 0.982572 29.1014 0.390053 28.2601 0.105139L27.9689 0.00656413L15.0767 0.00123577C4.47778 -0.00314328 2.15186 0.00310376 2.0008 0.0364519ZM26.1461 2.2077C25.9844 2.36308 16.8351 10.4614 16.5363 10.7137C15.7844 11.3485 15.2283 11.6207 14.8492 11.5393C14.5238 11.4696 14.0218 11.1658 13.4843 10.7134C13.1042 10.3936 3.82286 2.16565 3.82286 2.14859C3.82286 2.14103 8.86266 2.13485 15.0224 2.13485H26.222L26.1461 2.2077ZM5.9052 6.98858C7.90104 8.73635 9.55926 10.1901 9.59016 10.2192C9.644 10.2698 9.4914 10.4117 5.9229 13.6295C3.87501 15.476 2.19265 16.9869 2.18436 16.9869C2.17603 16.9869 2.16923 14.0013 2.16923 10.3523C2.16923 4.03637 2.1718 3.71997 2.22282 3.76425C2.25231 3.78985 3.90937 5.24079 5.9052 6.98858ZM27.8311 10.3759V16.994L27.7163 16.8906C26.7019 15.9776 21.5225 11.3083 21.0482 10.8793C20.6945 10.5593 20.4051 10.2856 20.4051 10.2708C20.4051 10.2416 27.7706 3.76401 27.8081 3.76018C27.8208 3.75889 27.8311 6.73597 27.8311 10.3759ZM11.9985 12.3449C12.8348 13.0749 13.1585 13.2833 13.7621 13.4803C14.1437 13.6049 14.5118 13.6567 15.0155 13.6568C15.8563 13.6569 16.5213 13.4714 17.1445 13.0631C17.2873 12.9695 17.7061 12.6289 18.0754 12.3062C18.6662 11.7897 18.7532 11.7239 18.8004 11.7578C18.8299 11.779 20.4586 13.2226 22.4197 14.9658L25.9853 18.1352L20.5105 18.143C17.4994 18.1472 12.562 18.1472 9.5385 18.143L4.04123 18.1352L4.35291 17.8596C4.5243 17.708 6.1508 16.264 7.96728 14.6505C10.8539 12.0867 11.2763 11.7221 11.32 11.7567C11.3476 11.7785 11.6529 12.0432 11.9985 12.3449Z" fill="#F3BD6A"/>
</svg>
