<svg width="20" height="21" viewBox="0 0 20 21" fill="none" xmlns="http://www.w3.org/2000/svg">
<path d="M13.5412 0.800001C13.4124 0.833252 13.3708 0.90391 12.6808 2.28798C12.0075 3.63879 11.9618 3.74686 11.995 3.8757C12.02 3.95052 12.0699 4.0378 12.1073 4.06274C12.1821 4.12093 12.4024 4.1334 12.5146 4.09183C12.552 4.07521 12.7099 3.80505 12.8679 3.48916L13.1588 2.91559L13.4997 3.06106C13.6908 3.14419 13.9818 3.26472 14.148 3.33538C14.4307 3.45591 14.4473 3.47254 14.4473 3.59723C14.4473 3.85492 14.5678 4.14587 14.7507 4.3329C15.0666 4.6571 15.8771 5.35121 16.0267 5.42602C16.114 5.47174 16.2803 5.50915 16.4423 5.51331L16.7125 5.52578L17.0118 5.97051L17.311 6.41524L17.2404 6.54408C17.1988 6.62721 17.1739 6.77684 17.1697 6.96387C17.1697 7.22157 17.1988 7.32963 17.4149 7.89905C17.5479 8.25234 17.6934 8.60979 17.735 8.69292C17.8223 8.87164 18.1049 9.13349 18.2462 9.1709C18.3584 9.19999 18.3626 9.20415 18.4582 9.81513L18.5288 10.2557L18.3002 10.4802C18.1423 10.6339 18.0592 10.7545 18.0259 10.8708C17.976 11.0745 17.8139 12.3671 17.8139 12.5833C17.8139 12.7287 17.9428 13.0529 18.0716 13.2275C18.109 13.2815 18.0924 13.3896 17.9844 13.7886L17.8472 14.2832L17.5937 14.3289C17.444 14.358 17.2736 14.4287 17.1739 14.4952C16.9702 14.6407 16.0891 15.9042 16.0226 16.1453C15.9976 16.2409 15.9852 16.4237 16.0018 16.5526L16.0267 16.7895L15.6111 17.1262L15.1954 17.4628L14.9752 17.4213C14.8463 17.3963 14.6801 17.3963 14.5637 17.4171C14.306 17.467 13.0383 18.1362 12.8513 18.319C12.7307 18.4437 12.6185 18.6557 12.5562 18.8926C12.5478 18.9175 12.3234 19.0007 12.0574 19.0755L11.5669 19.2126L11.3965 19.0422C11.1097 18.7638 11.0391 18.7471 10 18.7471C8.96091 18.7471 8.89025 18.7638 8.60347 19.0422L8.43305 19.2126L7.9426 19.0755C7.6766 19.0007 7.45215 18.9175 7.44384 18.8926C7.3815 18.6557 7.26927 18.4437 7.14874 18.319C6.9617 18.1362 5.69402 17.467 5.43632 17.4171C5.31994 17.3963 5.15369 17.3963 5.02484 17.4213L4.80456 17.4628L4.38892 17.1262L3.97329 16.7895L3.99822 16.5526C4.01485 16.4237 4.00238 16.2409 3.97744 16.1453C3.91094 15.9042 3.02979 14.6407 2.82613 14.4952C2.73054 14.4287 2.56013 14.3622 2.41465 14.3331L2.16111 14.2874L2.0198 13.7886C1.91173 13.3938 1.89095 13.2774 1.93252 13.2233C2.05305 13.0529 2.18605 12.7287 2.18605 12.5833C2.18605 12.3671 2.02396 11.0745 1.97408 10.8708C1.94083 10.7545 1.8577 10.6339 1.69976 10.4802L1.47116 10.2557L1.54182 9.81513C1.63741 9.20415 1.64157 9.19999 1.75379 9.1709C1.89511 9.13349 2.17774 8.87164 2.26502 8.69292C2.30659 8.60979 2.45206 8.25234 2.58506 7.89905C2.80119 7.32963 2.83029 7.22157 2.83029 6.96387C2.82613 6.77684 2.80119 6.62721 2.75963 6.54408L2.68897 6.41524L2.98823 5.97051L3.28749 5.52578L3.55765 5.51331C3.71975 5.50915 3.886 5.47174 3.97329 5.42602C4.12291 5.35121 4.9334 4.6571 5.24929 4.3329C5.43217 4.14587 5.5527 3.85492 5.5527 3.59307C5.5527 3.47669 5.57348 3.45176 5.74389 3.38525L5.93508 3.30628L6.0764 3.43513C6.33825 3.68451 6.56685 3.76348 7.00742 3.76348C7.35656 3.76348 7.42722 3.74686 7.61425 3.65126C8.56606 3.1525 8.56606 1.76012 7.61425 1.2572C7.42722 1.15745 7.35656 1.14498 7.00742 1.14498C6.67907 1.14498 6.57932 1.1616 6.41722 1.24058C5.96834 1.46086 5.67739 1.92222 5.67739 2.40435V2.64127L5.44048 2.73686L5.19941 2.8283L4.99575 2.72439C4.72143 2.58308 4.32242 2.57892 4.06888 2.71608C3.86522 2.82415 2.88432 3.68451 2.71391 3.90064C2.50194 4.17912 2.46037 4.62385 2.61831 4.96051L2.69313 5.1143L2.4105 5.54656L2.12371 5.97882H1.84523C1.50857 5.97466 1.24256 6.09104 1.05137 6.32795C0.980711 6.41939 0.814456 6.78515 0.644046 7.23404C0.41129 7.84502 0.357257 8.03206 0.357257 8.22325C0.357257 8.60148 0.531824 8.90905 0.868489 9.12518C0.926678 9.16259 0.922522 9.22077 0.843551 9.69044L0.756267 10.2141L0.619108 10.2682C0.315694 10.3762 0.0538435 10.7046 0.00396723 11.0454C-0.0126582 11.1327 0.024749 11.5733 0.082938 12.0263C0.166065 12.6705 0.207629 12.8908 0.282443 13.0238C0.415446 13.2649 0.685609 13.4561 0.972398 13.5143L1.21347 13.5642L1.35894 14.0879L1.50441 14.6074L1.38388 14.782C1.22594 15.0064 1.18437 15.4137 1.28828 15.6797C1.39219 15.9624 2.23177 17.1303 2.41881 17.2592C2.6765 17.442 3.10876 17.4836 3.43712 17.3548C3.53271 17.3174 4.31826 17.9533 4.28501 18.0364C4.26839 18.0738 4.2476 18.1985 4.23514 18.3149C4.20604 18.6058 4.31411 18.9217 4.50946 19.1171C4.64662 19.2542 5.60673 19.7862 6.02652 19.9608C6.39228 20.1104 6.87026 20.019 7.1529 19.7447L7.28174 19.62L7.80544 19.7696L8.32499 19.9192L8.37486 20.0855C8.43721 20.2933 8.68659 20.5676 8.89857 20.6632C9.04404 20.7297 9.18535 20.7422 10 20.7422C10.8146 20.7422 10.956 20.7297 11.1014 20.6632C11.3134 20.5676 11.5628 20.2933 11.6251 20.0855L11.6709 19.9192L12.1987 19.7738L12.7224 19.6241L12.8471 19.7447C13.1297 20.019 13.6119 20.1104 13.9735 19.9608C14.4224 19.7738 15.3492 19.2542 15.4947 19.1087C15.69 18.9051 15.794 18.6017 15.7649 18.3149C15.7524 18.1985 15.7316 18.0738 15.715 18.0364C15.6817 17.9533 16.4673 17.3174 16.5629 17.3548C16.8912 17.4836 17.3235 17.442 17.5812 17.2592C17.7599 17.1386 18.4831 16.1411 18.6702 15.7629C18.7658 15.5717 18.7782 15.5093 18.7616 15.2516C18.7408 15.0147 18.7159 14.9233 18.6161 14.782L18.4956 14.6074L18.6411 14.0879L18.7865 13.5642L19.0276 13.5143C19.3144 13.4561 19.5846 13.2649 19.7176 13.0238C19.7924 12.8908 19.8339 12.6705 19.9171 12.0263C19.9753 11.5733 20.0127 11.1327 19.996 11.0454C19.9462 10.7046 19.6843 10.3762 19.3809 10.2682L19.2437 10.2141L19.1564 9.69044C19.0775 9.22077 19.0733 9.16259 19.1315 9.12518C19.4682 8.90905 19.6427 8.60148 19.6427 8.22325C19.6427 8.03206 19.5887 7.84502 19.356 7.23404C19.1855 6.78515 19.0193 6.41939 18.9486 6.32795C18.7574 6.09104 18.4914 5.97466 18.1548 5.97882H17.8763L17.5895 5.54656L17.3069 5.1143L17.3817 4.96051C17.5396 4.62385 17.4981 4.17912 17.2861 3.90064C17.1157 3.68451 16.1348 2.82415 15.9311 2.71608C15.6776 2.57892 15.2827 2.58723 15.0001 2.72855L14.784 2.83246L14.1397 2.55398C13.7823 2.40435 13.4913 2.27135 13.4913 2.26304C13.4913 2.25057 13.6036 2.02197 13.7407 1.74765C13.9859 1.2572 14.0317 1.07432 13.9485 0.91638C13.8903 0.812471 13.7033 0.758438 13.5412 0.800001ZM7.33162 1.9139C7.87195 2.24226 7.63919 3.07768 7.00742 3.07768C6.65413 3.07768 6.38397 2.80752 6.38397 2.45423C6.38397 2.22979 6.49619 2.03028 6.68323 1.9139C6.76636 1.86403 6.8952 1.83078 7.00742 1.83078C7.11965 1.83078 7.24849 1.86403 7.33162 1.9139ZM4.34736 3.50579C4.34736 3.65542 4.44295 3.75101 4.61752 3.78011L4.77546 3.80505L4.25176 4.27056C3.96497 4.52825 3.71975 4.74022 3.70728 4.74022C3.69481 4.74022 3.68234 4.71113 3.68234 4.67788C3.68234 4.56566 3.5244 4.44928 3.37061 4.44928C3.24177 4.44928 3.22514 4.44097 3.26255 4.37862C3.30827 4.2955 4.26839 3.41435 4.31826 3.41435C4.33489 3.41019 4.34736 3.45176 4.34736 3.50579ZM16.2137 3.87155C16.4964 4.12093 16.7374 4.35784 16.7499 4.39109C16.7665 4.43266 16.7374 4.44928 16.6294 4.44928C16.4756 4.44928 16.3177 4.56566 16.3177 4.67788C16.3177 4.71113 16.3052 4.74022 16.2927 4.74022C16.2803 4.74022 16.035 4.52825 15.7482 4.27056L15.2245 3.80505L15.3825 3.78011C15.557 3.75101 15.6526 3.65542 15.6526 3.50579C15.6526 3.45176 15.6651 3.41019 15.6776 3.41019C15.69 3.41019 15.9311 3.61801 16.2137 3.87155ZM1.79536 7.05531C1.83692 7.08441 1.92005 7.10935 1.98655 7.10935C2.04889 7.10935 2.10293 7.11766 2.10293 7.12597C2.10293 7.17169 1.63326 8.38535 1.60001 8.4186C1.55013 8.46847 1.18437 8.44769 1.11787 8.3895C1.08878 8.36457 1.06384 8.30222 1.06384 8.24819C1.06384 8.13181 1.49194 6.96803 1.59169 6.8184L1.66235 6.71449L1.69145 6.85997C1.70807 6.93478 1.75379 7.02622 1.79536 7.05531ZM18.7034 7.52498C18.9445 8.16922 18.9736 8.31469 18.8863 8.3895C18.8156 8.44769 18.4457 8.46847 18.4 8.4186C18.3667 8.38119 17.8971 7.17585 17.8971 7.12597C17.8971 7.11766 17.9553 7.10935 18.0218 7.10935C18.1755 7.10935 18.3127 6.9805 18.3127 6.82671L18.3169 6.71449L18.3917 6.80593C18.4332 6.85581 18.5704 7.17585 18.7034 7.52498ZM1.29244 11.1036C1.30075 11.1161 1.33816 11.3571 1.37141 11.6398C1.40882 11.9266 1.44622 12.2217 1.45869 12.2923C1.48363 12.4253 1.47947 12.4295 1.334 12.4295C1.1719 12.4295 1.02227 12.5459 1.02227 12.6789C1.02227 12.7994 0.955772 12.7828 0.90174 12.6456C0.847707 12.5085 0.681453 11.2075 0.710547 11.1285C0.727173 11.0911 0.814456 11.0787 1.00565 11.0828C1.15112 11.087 1.27997 11.0953 1.29244 11.1036ZM19.2895 11.1285C19.3185 11.2075 19.1523 12.5085 19.0983 12.6456C19.0442 12.7828 18.9777 12.7994 18.9777 12.6789C18.9777 12.5459 18.8281 12.4295 18.666 12.4295C18.5205 12.4295 18.5164 12.4253 18.5413 12.2923C18.5538 12.2217 18.5912 11.9266 18.6286 11.6439C18.6618 11.3571 18.6992 11.1161 18.7076 11.1036C18.7367 11.0496 19.2687 11.0787 19.2895 11.1285ZM2.84691 15.6673C3.20852 16.1868 3.32905 16.378 3.29996 16.3946C3.29164 16.3988 3.23761 16.4237 3.17111 16.4528C3.09629 16.4861 3.05057 16.5443 3.03395 16.6232C2.98407 16.8726 2.83029 16.7313 2.25255 15.8876L1.93252 15.4221H2.05721C2.21515 15.4221 2.35231 15.2932 2.35231 15.1477C2.35231 15.0521 2.36062 15.0438 2.41881 15.0937C2.45206 15.1228 2.64741 15.3805 2.84691 15.6673ZM17.7558 15.368C17.7973 15.3971 17.8846 15.4221 17.9511 15.4221H18.0675L17.7474 15.8876C17.1697 16.7313 17.0159 16.8726 16.966 16.6232C16.9494 16.5443 16.9037 16.4861 16.8289 16.4528C16.7624 16.4237 16.7084 16.3988 16.7 16.3946C16.6917 16.3905 16.7042 16.3448 16.7333 16.299C16.804 16.1619 17.444 15.2475 17.5396 15.1394L17.6269 15.0397L17.656 15.1768C17.6685 15.2516 17.7142 15.3389 17.7558 15.368ZM6.50035 18.7264C6.50866 18.7347 6.47541 18.7804 6.42553 18.8303C6.34656 18.9092 6.3341 18.955 6.35072 19.1254C6.36319 19.2376 6.36319 19.329 6.35488 19.329C6.27591 19.329 5.04147 18.6391 4.99159 18.5684C4.90431 18.4396 4.91262 18.4146 5.05394 18.4146C5.18694 18.4146 5.34488 18.2899 5.34488 18.1819C5.34488 18.132 5.49451 18.1943 5.91846 18.4146C6.23019 18.5809 6.49204 18.7222 6.50035 18.7264ZM14.8006 18.3897C14.838 18.4022 14.917 18.4146 14.971 18.4146C15.0874 18.4146 15.0957 18.4437 15.0084 18.5684C14.9585 18.6391 13.7241 19.329 13.6451 19.329C13.6368 19.329 13.6368 19.2376 13.6493 19.1254C13.6659 18.955 13.6534 18.9092 13.5745 18.8303C13.5246 18.7804 13.4913 18.7347 13.4997 18.7264C13.508 18.7222 13.7657 18.585 14.0732 18.4229L14.6302 18.1278L14.6801 18.2442C14.705 18.3066 14.759 18.3731 14.8006 18.3897ZM10.6941 19.4454C10.7274 19.4662 10.7315 19.4994 10.7066 19.5368C10.6816 19.5701 10.665 19.6657 10.665 19.7447C10.665 19.8236 10.6816 19.9192 10.7066 19.9525C10.7731 20.0564 10.6692 20.0772 10 20.0772C9.33083 20.0772 9.22692 20.0564 9.29342 19.9525C9.31836 19.9192 9.33498 19.8236 9.33498 19.7447C9.33498 19.6657 9.31836 19.5701 9.29342 19.5368C9.26848 19.4994 9.27264 19.4662 9.30589 19.4454C9.37239 19.4038 10.6276 19.4038 10.6941 19.4454Z" fill="url(#paint0_linear_18788_507)"/>
<defs>
<linearGradient id="paint0_linear_18788_507" x1="10" y1="20.7422" x2="10" y2="0.785936" gradientUnits="userSpaceOnUse">
<stop stop-color="#F77433"/>
<stop offset="1" stop-color="#FEAF38"/>
</linearGradient>
</defs>
</svg>
