<svg width="6" height="5" viewBox="0 0 6 5" fill="none" xmlns="http://www.w3.org/2000/svg">
<path fill-rule="evenodd" clip-rule="evenodd" d="M4.47095 0.742863C2.76323 2.43562 2.313 2.874 2.26326 2.89239C2.23445 2.90306 2.18394 2.90111 2.15101 2.88806C2.11808 2.87502 1.80454 2.56864 1.45428 2.20726C0.877979 1.61268 0.809103 1.55019 0.729963 1.55019C0.656409 1.55019 0.593172 1.59491 0.331349 1.83211C0.00580883 2.127 -0.041766 2.20141 0.027565 2.30719C0.141852 2.48162 2.06091 4.45579 2.15101 4.4916C2.18394 4.5047 2.23394 4.50673 2.26214 4.49612C2.32359 4.47303 5.93762 0.880964 5.98103 0.799873C5.99765 0.768815 6.00471 0.717285 5.99669 0.685399C5.97301 0.591024 5.35817 0 5.28368 0C5.23664 0 5.02819 0.19054 4.47095 0.742863Z" fill="white"/>
</svg>
