<svg width="215" height="60" viewBox="0 0 215 60" fill="none" xmlns="http://www.w3.org/2000/svg">
<path d="M51.8304 0H215V60H0C15.8282 22.6114 25.0142 2.63497 51.8304 0Z" fill="url(#paint0_linear_17007_18)"/>
<path d="M91.725 32.48C92.345 32.66 92.82 32.975 93.15 33.425C93.49 33.875 93.66 34.43 93.66 35.09C93.66 36 93.335 36.715 92.685 37.235C92.045 37.745 91.15 38 90 38H85.155V27.32H89.85C90.95 27.32 91.815 27.57 92.445 28.07C93.075 28.56 93.39 29.24 93.39 30.11C93.39 30.67 93.24 31.16 92.94 31.58C92.65 31.99 92.245 32.29 91.725 32.48ZM87.045 31.82H89.535C90.875 31.82 91.545 31.32 91.545 30.32C91.545 29.82 91.38 29.445 91.05 29.195C90.72 28.945 90.215 28.82 89.535 28.82H87.045V31.82ZM89.79 36.5C90.49 36.5 91 36.375 91.32 36.125C91.65 35.875 91.815 35.48 91.815 34.94C91.815 34.39 91.65 33.985 91.32 33.725C91 33.465 90.49 33.335 89.79 33.335H87.045V36.5H89.79ZM102.276 30.425V38H100.446V36.83C100.206 37.25 99.8864 37.57 99.4864 37.79C99.0864 38.01 98.6264 38.12 98.1064 38.12C96.2564 38.12 95.3314 37.08 95.3314 35V30.425H97.1914V35.015C97.1914 35.565 97.3014 35.97 97.5214 36.23C97.7514 36.49 98.1014 36.62 98.5714 36.62C99.1214 36.62 99.5614 36.44 99.8914 36.08C100.221 35.72 100.386 35.24 100.386 34.64V30.425H102.276ZM111.482 30.425L107.957 38.51C107.557 39.45 107.047 40.135 106.427 40.565C105.807 40.995 105.042 41.28 104.132 41.42L103.712 39.98C104.422 39.82 104.952 39.615 105.302 39.365C105.662 39.125 105.952 38.765 106.172 38.285L106.412 37.73L103.262 30.425H105.227L107.402 35.87L109.622 30.425H111.482ZM125.708 27.32V38H124.268L118.508 30.515V38H116.708V27.32H118.148L123.893 34.79V27.32H125.708ZM131.331 38.12C130.561 38.12 129.881 37.96 129.291 37.64C128.711 37.32 128.261 36.865 127.941 36.275C127.631 35.675 127.476 34.975 127.476 34.175C127.476 33.375 127.631 32.68 127.941 32.09C128.261 31.49 128.711 31.03 129.291 30.71C129.881 30.39 130.561 30.23 131.331 30.23C132.091 30.23 132.761 30.39 133.341 30.71C133.921 31.03 134.366 31.49 134.676 32.09C134.996 32.68 135.156 33.375 135.156 34.175C135.156 34.975 134.996 35.675 134.676 36.275C134.366 36.865 133.921 37.32 133.341 37.64C132.761 37.96 132.091 38.12 131.331 38.12ZM131.316 36.65C131.956 36.65 132.441 36.445 132.771 36.035C133.111 35.615 133.281 34.995 133.281 34.175C133.281 33.365 133.111 32.75 132.771 32.33C132.431 31.9 131.951 31.685 131.331 31.685C130.701 31.685 130.216 31.9 129.876 32.33C129.536 32.75 129.366 33.365 129.366 34.175C129.366 34.995 129.531 35.615 129.861 36.035C130.201 36.445 130.686 36.65 131.316 36.65ZM148.701 30.425L145.731 38H144.096L142.221 33.035L140.391 38H138.741L135.771 30.425H137.691L139.641 35.765L141.606 30.425H142.956L144.921 35.81L146.871 30.425H148.701Z" fill="#302F2F"/>
<defs>
<linearGradient id="paint0_linear_17007_18" x1="65.9509" y1="42.6667" x2="150.369" y2="43.9715" gradientUnits="userSpaceOnUse">
<stop stop-color="#FD9149" stop-opacity="0.94"/>
<stop offset="1" stop-color="#FFD588"/>
</linearGradient>
</defs>
</svg>
