<svg width="28" height="28" viewBox="0 0 28 28" fill="none" xmlns="http://www.w3.org/2000/svg">
<circle cx="14" cy="14" r="14" fill="#D9D9D9" fill-opacity="0.3"/>
<g filter="url(#filter0_d_2190_18)">
<path d="M12.5677 11.5192C12.2912 11.5863 12.0613 11.8354 12.0106 12.1201C11.9805 12.2926 12.0188 12.4911 12.1105 12.6403C12.1352 12.68 12.4746 13.0304 12.9209 13.478L13.6888 14.2487L12.9072 15.0317C12.1995 15.7421 12.1229 15.8243 12.0832 15.9064C11.9381 16.2089 11.9846 16.5251 12.2091 16.7633C12.3953 16.9618 12.6622 17.0412 12.9277 16.9796C13.1249 16.933 13.0934 16.9604 14.2555 15.8037C14.9276 15.1344 15.3479 14.7045 15.3807 14.6553C15.4642 14.528 15.4957 14.4171 15.4957 14.2487C15.4957 14.0803 15.4642 13.9695 15.3807 13.8422C15.3479 13.7929 14.9276 13.3631 14.2555 12.6937C13.0934 11.537 13.1249 11.5644 12.9277 11.5178C12.8196 11.4932 12.6745 11.4932 12.5677 11.5192Z" fill="#012433"/>
</g>
<defs>
<filter id="filter0_d_2190_18" x="8" y="11.5" width="11.4956" height="13.5" filterUnits="userSpaceOnUse" color-interpolation-filters="sRGB">
<feFlood flood-opacity="0" result="BackgroundImageFix"/>
<feColorMatrix in="SourceAlpha" type="matrix" values="0 0 0 0 0 0 0 0 0 0 0 0 0 0 0 0 0 0 127 0" result="hardAlpha"/>
<feOffset dy="4"/>
<feGaussianBlur stdDeviation="2"/>
<feComposite in2="hardAlpha" operator="out"/>
<feColorMatrix type="matrix" values="0 0 0 0 0 0 0 0 0 0 0 0 0 0 0 0 0 0 0.25 0"/>
<feBlend mode="normal" in2="BackgroundImageFix" result="effect1_dropShadow_2190_18"/>
<feBlend mode="normal" in="SourceGraphic" in2="effect1_dropShadow_2190_18" result="shape"/>
</filter>
</defs>
</svg>
