<svg width="30" height="22" viewBox="0 0 30 22" fill="none" xmlns="http://www.w3.org/2000/svg">
<path d="M29.0456 3.64947L20.9726 0.130293C20.5631 -0.0478963 20.0917 -0.0394317 19.6871 0.140718C19.2838 -0.0390981 18.8125 -0.0485471 18.4003 0.130619L10.3276 3.6498C10.3221 3.65208 10.3178 3.65566 10.3126 3.65761C10.3071 3.65533 10.3029 3.65175 10.2976 3.64947L2.22462 0.130293C1.73923 -0.0807955 1.16558 -0.03356 0.717004 0.258647C0.268106 0.55379 0 1.05057 0 1.58746V16.8379C0 17.4702 0.374627 18.0422 0.954454 18.295L9.02649 21.8142C9.22846 21.9022 9.44184 21.9468 9.66172 21.9468C9.8878 21.9468 10.1087 21.8976 10.3126 21.8061C10.5165 21.8979 10.7374 21.9468 10.9635 21.9468C11.1824 21.9468 11.3958 21.9025 11.5987 21.8142L19.6717 18.2947C19.6773 18.2924 19.6815 18.2888 19.6867 18.2869C19.6926 18.2892 19.6968 18.2931 19.7024 18.295L27.7744 21.8142C27.9764 21.9021 28.1901 21.9468 28.41 21.9468C28.7197 21.9468 29.0201 21.8572 29.2823 21.6862C29.7316 21.391 29.9997 20.8942 29.9997 20.3574L30 5.10611C29.9997 4.47381 29.625 3.90147 29.0455 3.64895L29.0456 3.64947ZM9.23598 19.7063L2.01649 16.5592V2.2386L9.23598 5.38608V19.7063ZM18.6096 16.5592L11.3897 19.7066V5.38608L18.6096 2.2386V16.5592ZM27.984 19.7066L20.7645 16.5592V2.23943L27.984 5.38692V19.7066Z" fill="#FF5500"/>
</svg>
