<svg width="20" height="24" viewBox="0 0 20 24" fill="none" xmlns="http://www.w3.org/2000/svg">
<path fill-rule="evenodd" clip-rule="evenodd" d="M8.85747 0.152546C7.10446 0.624574 5.71384 2.05812 5.29803 3.82162C5.17104 4.36006 5.19494 5.79069 5.33648 6.12398C5.38689 6.24256 4.88784 6.56483 3.25944 7.46555C0.875812 8.78404 0.607478 8.97547 0.277723 9.59248C0.0590649 10.0015 0.0470096 10.1606 0.0135457 13.0869C-0.0295832 16.8596 0.00918087 17.2938 0.44629 17.9404C0.754532 18.3963 1.0529 18.5817 5.08634 20.8236L9.39694 23.2195L10.0382 23.2122C10.6744 23.2048 10.7109 23.1872 14.769 20.9379C17.0184 19.6912 19.0112 18.5577 19.1974 18.4191C19.3837 18.2805 19.6407 17.9711 19.7686 17.7315C19.9967 17.3041 20.001 17.2263 19.9999 13.6584C19.9988 10.1431 19.9913 10.0071 19.7766 9.60536C19.6544 9.37673 19.4446 9.08938 19.3105 8.96685C19.1763 8.84432 18.0786 8.19697 16.8713 7.52811L14.676 6.31218L14.7644 5.93223C14.8129 5.72324 14.8537 5.21744 14.8551 4.80808C14.8597 3.43221 14.2995 2.20455 13.2338 1.25457C12.0072 0.16138 10.3624 -0.252762 8.85747 0.152546ZM10.9796 2.80762C12.3538 3.47285 12.6608 5.15581 11.6149 6.29046C10.7103 7.27183 9.24511 7.22465 8.33212 6.18477C7.63396 5.38954 7.63001 4.22807 8.32267 3.38773C8.95443 2.62129 10.0848 2.37446 10.9796 2.80762ZM8.26166 9.9691C9.15261 10.8533 9.91574 11.528 10.0251 11.528C10.1345 11.528 10.9044 10.8465 11.806 9.95164L13.3942 8.37531L13.996 8.70475C14.3269 8.88599 15.0535 9.27966 15.6104 9.57959C16.1675 9.87962 16.6117 10.1575 16.5977 10.1974C16.5636 10.2946 10.1582 13.9529 10.0219 13.9529C9.86492 13.9529 3.52476 10.3085 3.50938 10.2093C3.49597 10.123 6.41076 8.42737 6.59138 8.41636C6.64615 8.41293 7.39784 9.11172 8.26166 9.9691ZM5.967 13.3588L9.34955 15.2937V17.7584C9.34955 19.1139 9.3243 20.2483 9.29343 20.2791C9.26257 20.31 7.71928 19.4936 5.8639 18.4649L2.4905 16.5946V14.0093C2.4905 12.5874 2.51159 11.4241 2.53747 11.4241C2.56324 11.4241 4.10653 12.2947 5.967 13.3588ZM17.5596 14.004V16.5839L15.7669 17.5769C14.7809 18.1231 13.2544 18.9731 12.3746 19.4658C11.4949 19.9585 10.7583 20.3616 10.7378 20.3616C10.7173 20.3616 10.7006 19.2214 10.7006 17.8279V15.2943L14.0522 13.3688C15.8956 12.3097 17.4389 11.4389 17.4817 11.4336C17.5245 11.4283 17.5596 12.585 17.5596 14.004ZM13.2727 16.8877L12.2595 17.4649V17.978C12.2595 18.2601 12.2916 18.491 12.3307 18.491C12.37 18.491 12.8536 18.2353 13.4054 17.9229L14.4086 17.3548L14.4272 16.8317C14.4374 16.5439 14.4098 16.3089 14.3658 16.3095C14.322 16.3101 13.8301 16.5702 13.2727 16.8877Z" fill="#FD9149"/>
</svg>
