<svg width="31" height="35" viewBox="0 0 31 35" fill="none" xmlns="http://www.w3.org/2000/svg">
<path fill-rule="evenodd" clip-rule="evenodd" d="M13.4587 0.150921C8.50469 0.944538 4.13639 4.12508 2.09152 8.42748C1.09947 10.5145 0.878418 11.6077 0.878418 14.427C0.878418 16.6341 0.9307 17.1707 1.24733 18.2126C2.00999 20.7229 3.16035 22.6248 5.02223 24.454C7.02234 26.4187 9.46683 27.7838 12.2334 28.481C14.2271 28.9833 17.6105 28.9808 19.5855 28.4755C23.9868 27.3498 27.5856 24.5599 29.527 20.7689C30.6796 18.5183 30.9376 17.3742 30.9391 14.5049C30.9406 11.806 30.7667 10.8822 29.8624 8.78267C28.9071 6.565 26.8302 4.09033 24.7065 2.63916C23.3713 1.72693 21.2859 0.811593 19.6245 0.408395C17.8914 -0.0122596 15.1833 -0.125411 13.4587 0.150921ZM19.3541 1.65025C24.0471 2.79517 27.8829 6.38998 29.2569 10.9308C29.7979 12.7183 29.7979 16.1356 29.2569 17.9231C28.7318 19.6586 27.5914 21.6774 26.3566 23.058C24.8524 24.7398 24.7638 24.7635 24.4181 23.577C24.0176 22.2031 23.2571 20.9262 22.2683 19.9678C20.7966 18.5413 19.4803 18.3123 17.6092 19.1574C16.4033 19.7019 15.4155 19.7019 14.2096 19.1574C12.3729 18.3277 11.0377 18.5438 9.61567 19.9003C8.59765 20.8713 8.01765 21.8117 7.46591 23.3862L7.02805 24.6355L5.91119 23.5143C3.22048 20.8129 1.96784 17.5767 2.15262 13.8036C2.25833 11.6429 2.65779 10.2049 3.66634 8.35469C5.73947 4.55088 9.62188 1.92986 14.0621 1.33636C15.5044 1.14357 17.8469 1.28243 19.3541 1.65025ZM14.0037 4.5861C12.7835 4.9706 12.1071 5.38409 11.2281 6.28244C9.55669 7.99077 9.09498 10.1961 9.89816 12.6346C10.6058 14.783 12.1892 16.7341 13.8381 17.4895C15.1569 18.0938 16.6851 18.0897 17.9758 17.4785C20.7099 16.1838 22.7727 12.2477 22.2177 9.38412C21.8238 7.35161 20.2256 5.45157 18.325 4.75645C17.014 4.27704 15.2105 4.20597 14.0037 4.5861ZM17.9902 6.00533C20.1334 6.97319 21.3019 9.14488 20.8811 11.3781C20.51 13.3472 18.9339 15.5808 17.3826 16.3357C16.5187 16.7561 15.2944 16.7533 14.4225 16.3289C12.2003 15.2476 10.4265 11.812 10.9204 9.54574C11.5963 6.44328 15.0881 4.69474 17.9902 6.00533ZM13.7299 20.3493C14.5736 20.7301 14.978 20.8168 15.9094 20.8168C16.8408 20.8168 17.2452 20.7301 18.0889 20.3493C19.245 19.8277 19.7168 19.7775 20.3819 20.1056C21.77 20.7904 23.3432 23.4563 23.3432 25.1238C23.3432 25.6073 23.2738 25.666 21.9953 26.2653C19.8619 27.2654 18.4263 27.5681 15.8277 27.5653C13.907 27.5631 13.4329 27.5086 12.1577 27.1423C11.3524 26.911 10.1944 26.4715 9.58447 26.1659C8.56791 25.6562 8.4756 25.5685 8.4756 25.1121C8.4756 23.488 9.91923 20.9918 11.3348 20.1682C12.0183 19.7705 12.5336 19.8095 13.7299 20.3493ZM6.1958 30.8612C6.08796 30.9851 6.02392 31.248 6.05316 31.4456L6.10659 31.8049H15.9094H25.7122L25.7657 31.4456C25.8897 30.6113 26.19 30.636 15.9094 30.636C7.80967 30.636 6.36244 30.6695 6.1958 30.8612ZM6.13502 33.8558C5.95644 34.0261 6.00889 34.6106 6.22096 34.8129C6.36898 34.9541 8.74714 34.9999 15.9222 34.9999C26.1888 34.9999 25.8897 35.0245 25.7657 34.1903L25.7122 33.831L15.9787 33.7908C10.6254 33.7687 6.19563 33.798 6.13502 33.8558Z" fill="url(#paint0_linear_1146_48)"/>
<defs>
<linearGradient id="paint0_linear_1146_48" x1="15.9088" y1="0" x2="15.9088" y2="35" gradientUnits="userSpaceOnUse">
<stop stop-color="#FF5500"/>
<stop offset="1" stop-color="#FF9900"/>
</linearGradient>
</defs>
</svg>
