<svg width="16" height="16" viewBox="0 0 16 16" fill="none" xmlns="http://www.w3.org/2000/svg">
<path fill-rule="evenodd" clip-rule="evenodd" d="M0.427975 0.135935C0.0387078 0.317506 -0.0210333 0.515382 0.00540811 1.53533L0.0289575 2.44363L3.06559 2.46685L6.10222 2.49016V1.2484V0.00673472L3.39611 0.0101906C1.28311 0.0129377 0.632566 0.0404968 0.427975 0.135935ZM6.65311 0.0658406C6.57057 0.154278 6.5866 4.34884 6.66947 4.34884C6.70881 4.34884 6.83548 4.26909 6.95108 4.17162C7.17938 3.97906 7.38513 3.94334 7.46536 4.08256C7.49329 4.13103 7.5884 4.21211 7.67681 4.26289C7.83389 4.35301 7.83744 4.30684 7.83744 2.18089V0.00673472H7.27283C6.96223 0.00673472 6.68336 0.033319 6.65311 0.0658406ZM8.41585 1.28828V2.57655H11.3011C12.888 2.57655 14.2452 2.55236 14.3171 2.52277C14.4256 2.4781 14.4478 2.29963 14.4478 1.47481C14.4478 0.520876 14.4392 0.472049 14.2347 0.265843L14.0215 0.051042L11.2187 0.025521L8.41585 0V1.28828ZM0.566049 8.02023V13.0231L0.765434 13.2718L0.964819 13.5204L4.93657 13.5451L8.9084 13.5697L8.86329 13.2792C8.83841 13.1195 8.80181 12.9013 8.7819 12.7945C8.7619 12.6876 8.78314 12.3088 8.82899 11.9527C9.10737 9.79066 11.0144 8.14677 12.9853 8.36964C13.267 8.40154 13.5999 8.45161 13.7248 8.48094L13.952 8.53437V5.82135V3.10824H11.1839H8.41585V4.00024C8.41585 4.86751 8.33834 5.23499 8.15548 5.23499C8.10632 5.23499 7.88305 5.0909 7.65937 4.91474L7.25251 4.59448L6.83424 4.90844C6.6042 5.08124 6.36507 5.20158 6.30293 5.17597C6.21823 5.14115 6.18411 4.87078 6.16676 4.09674L6.14354 3.06393L3.35479 3.04063L0.566049 3.01723V8.02023ZM11.6265 9.06757C10.6466 9.4362 10.0405 10.0265 9.59555 11.0454C9.38997 11.5162 9.36625 11.6677 9.36741 12.5014C9.36865 13.3663 9.3874 13.4729 9.63323 14.0144C9.95647 14.7264 10.622 15.4292 11.287 15.7609C11.7066 15.9703 11.8645 15.9983 12.6342 15.9999C13.4776 16.0016 13.5267 15.9907 14.1369 15.6674C15.7291 14.8233 16.3976 12.9535 15.7616 11.122C15.5037 10.3794 14.608 9.4199 13.9107 9.13925C13.1609 8.83743 12.3093 8.81076 11.6265 9.06757ZM4.57358 10.5519V10.7734L3.64243 10.7985C2.86744 10.8193 2.70318 10.8008 2.66269 10.6877C2.636 10.613 2.636 10.4907 2.66269 10.416C2.70318 10.3029 2.86744 10.2844 3.64243 10.3052L4.57358 10.3303V10.5519ZM14.4478 11.2871C14.4478 11.3851 12.4695 13.4586 11.9882 13.8648L11.7904 14.0319L11.3425 13.5577C10.8896 13.078 10.7876 12.8057 11.0245 12.7083C11.1076 12.6741 11.2715 12.7777 11.4799 12.9958L11.8055 13.3368L12.4036 12.7165C13.9632 11.0992 14.1009 10.9792 14.2799 11.082C14.3723 11.135 14.4478 11.2273 14.4478 11.2871ZM4.57358 11.8811V12.1026H3.6245C2.76118 12.1026 2.67269 12.0875 2.64542 11.936C2.59716 11.6671 2.78738 11.6134 3.70597 11.6371C4.57077 11.6594 4.57358 11.6602 4.57358 11.8811Z" fill="#FD9149"/>
</svg>
