<svg width="194" height="53" viewBox="0 0 194 53" fill="none" xmlns="http://www.w3.org/2000/svg">
<path fill-rule="evenodd" clip-rule="evenodd" d="M1.9036 3.60041C1.27946 5.57617 0.606754 7.1927 0.4083 7.1927C0.148091 7.1927 0.0401705 8.27945 0.020385 11.0974C-0.000299778 14.053 0.0851374 14.9989 0.371427 14.9889C1.04653 14.9658 7.51308 13.5248 7.66837 13.363C7.7514 13.2765 7.72532 10.2365 7.61051 6.607C7.43424 1.04333 7.33111 0.0081217 6.95159 0.0081217C6.56038 0.0081217 6.52531 0.791554 6.68389 5.97101C6.83738 10.978 6.8002 11.9074 6.45156 11.7677C5.72759 11.4785 1.4989 8.11702 1.4989 7.83119C1.4989 7.68032 2.0385 5.98726 2.69802 4.06897C4.04073 0.163059 4.07011 0.0081217 3.46755 0.0081217C3.18546 0.0081217 2.64885 1.24075 1.9036 3.60041ZM62.4735 1.01959C62.5811 1.57998 62.8818 3.24774 63.1414 4.72589C63.401 6.20404 63.7101 7.57599 63.8279 7.77528C63.9898 8.04798 66.7535 8.05954 75.066 7.82245C81.1291 7.64939 86.2047 7.43386 86.345 7.34327C86.4856 7.25299 86.4823 6.79537 86.3378 6.32681C86.1933 5.85825 85.725 4.24484 85.2969 2.74139C84.7708 0.894324 84.3742 0.0081217 84.0729 0.0081217C83.6164 0.0081217 83.6796 0.747197 84.2819 2.44932C84.8533 4.06366 84.2513 3.77659 82.7656 1.72617C82.0809 0.781245 81.3227 0.0081217 81.0808 0.0081217C80.8386 0.0081217 80.6407 0.0868398 80.6407 0.182738C80.6407 0.278949 81.4502 1.46534 82.4394 2.81948C83.4287 4.17362 84.2381 5.42186 84.2381 5.59304C84.2381 5.76422 81.002 4.75338 77.0467 3.34677C73.0914 1.94015 69.8538 0.624434 69.852 0.423578C69.8496 0.165245 68.7365 0.049355 66.0634 0.0290507L62.2777 0.000312373L62.4735 1.01959ZM139.315 1.33571C139.806 5.40281 139.191 4.63374 146.299 10.0597C150.542 13.2984 152.993 14.9742 153.487 14.9749C154.348 14.9761 160.932 13.5964 161.15 13.3693C161.229 13.2862 161.203 10.2462 161.091 6.61325C160.919 1.05457 160.816 0.0081217 160.439 0.0081217C160.051 0.0081217 160.014 0.804361 160.163 5.94321C160.257 9.20751 160.234 11.8783 160.112 11.8783C159.718 11.8783 154.986 8.14763 154.986 7.83744C154.986 7.67313 155.525 5.94977 156.183 4.00775C157.539 0.00499791 157.538 0.0081217 156.955 0.0081217C156.673 0.0081217 156.135 1.24356 155.388 3.60978C154.657 5.92447 154.114 7.1799 153.868 7.12398C153.658 7.07588 151.921 5.85044 150.007 4.40103L146.527 1.76553L147.534 0.895261C148.508 0.0531034 148.517 0.0246775 147.815 0.0165558C147.416 0.0118702 146.832 0.250523 146.518 0.546653C145.977 1.05676 145.899 1.05676 145.046 0.546653C144.551 0.250523 143.853 0.0131197 143.495 0.0193671C142.892 0.0296755 142.91 0.0859026 143.738 0.790929C144.755 1.65651 144.716 1.7243 142.463 3.01034C140.684 4.02524 140.31 3.84781 140.301 1.98607C140.295 0.702527 140.03 0.0081217 139.544 0.0081217C139.261 0.0081217 139.199 0.36985 139.315 1.33571ZM215.961 1.01927C216.068 1.57998 216.369 3.24774 216.629 4.72589C216.888 6.20404 217.197 7.57599 217.315 7.77528C217.477 8.04798 220.241 8.05954 228.553 7.82245C234.616 7.64939 239.692 7.43386 239.832 7.34327C239.973 7.25299 239.969 6.79537 239.825 6.32681C239.681 5.85825 239.212 4.24484 238.784 2.74139C238.264 0.914941 237.86 0.0081217 237.566 0.0081217C237.015 0.0081217 237.016 0.230844 237.575 1.88236C238.103 3.43985 238.103 3.44423 237.761 3.44423C237.616 3.44423 236.938 2.6711 236.253 1.72617C235.568 0.781245 234.81 0.0081217 234.568 0.0081217C234.326 0.0081217 234.128 0.0868398 234.128 0.182738C234.128 0.278949 234.937 1.46534 235.927 2.81948C236.916 4.17362 237.725 5.42342 237.725 5.5971C237.725 5.77047 234.489 4.75963 230.533 3.35083C226.578 1.94171 223.34 0.629432 223.339 0.434511C223.337 0.19086 222.151 0.0671602 219.55 0.0399838L215.765 0L215.961 1.01927ZM292.806 1.49189C293.174 5.2032 292.761 4.69716 299.792 10.064C303.33 12.7645 306.394 14.9802 306.6 14.988C306.864 14.998 306.968 14.4235 306.951 13.0497C306.927 11.0789 306.876 11.0199 306.545 12.5811C306.445 13.0538 306.227 13.4402 306.06 13.4402C305.553 13.4402 301.899 10.4951 301.989 10.1602C302.036 9.98844 303.177 9.64233 304.524 9.39087C306.96 8.937 306.974 8.92856 306.974 7.98145C306.974 7.12554 306.622 6.76225 303.494 4.39728L300.014 1.76553L301.021 0.895261C301.995 0.0531034 302.005 0.0246775 301.302 0.0165558C300.903 0.0118702 300.319 0.250523 300.005 0.546653C299.464 1.05676 299.386 1.05676 298.533 0.546653C298.038 0.250523 297.34 0.0131197 296.983 0.0193671C296.38 0.0296755 296.397 0.0859026 297.225 0.790929C298.242 1.65651 298.203 1.7243 295.95 3.01034C294.171 4.02524 293.797 3.84781 293.789 1.98607C293.783 0.709087 293.517 0.0081217 293.039 0.0081217C292.764 0.0081217 292.7 0.420142 292.806 1.49189ZM66.5511 0.919002C67.1282 1.03458 67.6003 1.28542 67.6003 1.47596C67.6003 1.9439 64.8229 5.94321 64.4979 5.94321C64.229 5.94321 63.2712 0.955862 63.4652 0.565083C63.5698 0.354231 63.9544 0.398588 66.5511 0.919002ZM220.038 0.919002C220.615 1.03458 221.088 1.28542 221.088 1.47596C221.088 1.93234 218.314 5.94321 217.999 5.94321C217.726 5.94321 216.732 0.91744 216.935 0.565083C217.056 0.354231 217.44 0.398276 220.038 0.919002ZM75.5145 3.76097C78.8679 4.96611 81.7326 6.03036 81.8803 6.12564C82.6682 6.63262 81.3249 6.80817 76.3737 6.84441C73.3621 6.86659 69.6502 6.97311 68.1249 7.0815C66.4222 7.20239 65.352 7.16272 65.352 6.97842C65.352 6.56421 68.8873 1.56999 69.1805 1.56999C69.3109 1.56999 72.1615 2.55615 75.5145 3.76097ZM229.041 3.77409C232.416 4.98641 235.295 6.09971 235.438 6.2484C235.585 6.40053 235.127 6.59201 234.389 6.68697C232.276 6.95874 218.839 7.14304 218.839 6.90032C218.839 6.53984 222.409 1.56999 222.668 1.56999C222.798 1.56999 225.666 2.56177 229.041 3.77409ZM145.494 3.83469C145.586 4.39322 145.755 5.68738 145.869 6.71071L146.077 8.57183L145.211 7.9852C143.476 6.81098 141.153 4.94737 141.27 4.8246C141.583 4.49942 144.684 2.8301 144.985 2.8251C145.173 2.82198 145.402 3.27617 145.494 3.83469ZM298.981 3.83469C299.073 4.39322 299.242 5.68738 299.356 6.71071L299.564 8.57183L298.698 7.9852C297.263 7.01371 294.684 4.9961 294.684 4.84491C294.684 4.64468 298.06 2.85259 298.472 2.83447C298.66 2.82635 298.889 3.27617 298.981 3.83469ZM149.709 5.34283C152.131 7.20332 153.05 8.12982 152.471 8.12982C152.407 8.12982 151.257 8.34692 149.915 8.61182C148.574 8.87702 147.363 9.02071 147.224 8.93137C147.085 8.84172 146.879 7.74623 146.766 6.49674C146.654 5.24724 146.492 3.97932 146.407 3.67851C146.146 2.75701 146.719 3.04595 149.709 5.34283ZM303.258 5.36001C305.719 7.22269 306.257 7.73217 306.021 7.97739C305.778 8.23134 301.19 9.09818 300.836 8.95699C300.613 8.86734 300.379 7.88524 300.255 6.5161C300.142 5.25599 299.973 3.95777 299.88 3.63134C299.635 2.77294 300.271 3.09843 303.258 5.36001ZM153.453 10.5507C153.033 12.9775 152.892 13.4402 152.573 13.4402C152.067 13.4402 148.411 10.4954 148.504 10.1621C148.598 9.82351 151.278 9.15816 152.774 9.10193L153.71 9.06694L153.453 10.5507ZM3.6723 10.9577C4.78538 11.8136 5.69582 12.6246 5.69582 12.7595C5.69582 13.0722 0.817499 14.049 0.547698 13.79C0.36753 13.6173 0.725167 10.7709 1.05253 9.76978C1.24858 9.17096 1.4947 9.28248 3.6723 10.9577ZM157.16 10.9577C158.272 11.8136 159.183 12.6246 159.183 12.7595C159.183 13.0722 154.305 14.049 154.035 13.79C153.855 13.6173 154.212 10.7709 154.54 9.76978C154.736 9.17096 154.982 9.28248 157.16 10.9577ZM119.612 26.5867C118.87 26.7329 115.565 27.2886 112.268 27.8221C108.97 28.3554 105.987 28.862 105.639 28.9482C105.041 29.096 100.726 35.4209 100.726 36.15C100.726 36.3215 101.704 37.4264 102.899 38.6059C104.095 39.7851 107.655 43.3202 110.812 46.4621C113.969 49.6039 116.734 52.1704 116.958 52.1654C117.388 52.1557 127.833 32.0848 127.659 31.6015C127.535 31.2582 121.36 26.2322 121.126 26.2843C121.035 26.3046 120.354 26.4408 119.612 26.5867ZM266.504 27.6691C262.135 28.4206 258.545 29.041 258.526 29.0473C258.341 29.1104 254.213 35.8832 254.213 36.1247C254.213 36.3021 255.259 37.4923 256.537 38.7696C266.342 48.5697 269.941 52.0183 270.363 52.0183C270.696 52.0183 272.49 48.848 276.018 42.0223C278.86 36.5245 281.184 31.8858 281.183 31.714C281.181 31.4132 275.206 26.4821 274.697 26.3615C274.56 26.3287 270.873 26.9172 266.504 27.6691ZM120.511 27.6066C120.511 27.6669 120.383 28.1236 120.226 28.6218C120.07 29.1197 119.794 30.1246 119.615 30.855C119.436 31.5853 119.193 32.1804 119.076 32.1776C118.959 32.1747 118.432 31.7768 117.905 31.2929C117.379 30.8087 116.469 30.0731 115.884 29.658C114.644 28.7777 114.563 28.5 115.49 28.3016C115.861 28.2223 116.704 28.023 117.364 27.8593C118.572 27.5591 120.511 27.4036 120.511 27.6066ZM273.999 27.6203C273.999 28.2916 272.699 31.8702 272.455 31.8702C271.975 31.8702 268.247 28.7008 268.461 28.4741C268.791 28.1258 273.999 27.3227 273.999 27.6203ZM45.4166 28.7602C44.2625 29.2472 39.6758 31.118 35.2241 32.9176C28.6437 35.5774 27.1337 36.2965 27.1499 36.7629C27.1759 37.5257 39.8584 55.2982 40.3764 55.2982C40.669 55.2982 47.1718 52.0867 47.5643 51.7484C47.5912 51.7249 48.6423 48.0033 49.8998 43.4777L52.1866 35.2494L50.0593 31.5294C48.8893 29.4833 47.8383 27.824 47.7234 27.8421C47.6089 27.8599 46.5708 28.2732 45.4166 28.7602ZM122.882 28.6574C124.548 29.9691 125.753 31.1976 125.565 31.3935C125.315 31.655 120.429 32.513 120.25 32.3269C120.062 32.1307 121.377 27.8093 121.625 27.8093C121.723 27.8093 122.289 28.1911 122.882 28.6574ZM195.157 30.3236C191.777 31.6899 187.325 33.4967 185.264 34.3382C183.203 35.1798 181.28 35.9482 180.992 36.046C180.704 36.1438 180.467 36.4215 180.467 36.6629C180.467 36.9044 181.521 38.5606 182.809 40.343C184.097 42.1257 187.022 46.22 189.309 49.4412C191.596 52.6627 193.643 55.2982 193.859 55.2982C194.074 55.2982 195.792 54.4988 197.675 53.5217L201.1 51.7456L202.825 45.4781C203.773 42.0314 204.787 38.3041 205.077 37.1958L205.605 35.1807L203.49 31.495C202.326 29.468 201.358 27.8162 201.338 27.8243C201.319 27.8324 198.537 28.9573 195.157 30.3236ZM277.179 29.3981C278.233 30.2718 279.095 31.1089 279.095 31.2582C279.095 31.4076 278.657 31.6044 278.121 31.6956C277.585 31.7871 276.404 31.992 275.498 32.1507C274.591 32.3097 273.8 32.3893 273.74 32.3278C273.582 32.1654 274.882 27.8093 275.089 27.8093C275.185 27.8093 276.125 28.5244 277.179 29.3981ZM111.931 28.997C112.094 29.2722 109.203 33.7516 108.874 33.7326C108.615 33.7176 106.422 30.4401 106.422 30.0687C106.422 29.9163 107.467 29.5736 108.745 29.3072C111.651 28.7015 111.75 28.6918 111.931 28.997ZM263.985 31.5775C263.225 32.7695 262.54 33.7444 262.464 33.7444C262.24 33.7444 259.909 30.3624 259.909 30.0375C259.909 29.7867 260.852 29.5733 264.706 28.9526C265.535 28.8189 265.376 29.3978 263.985 31.5775ZM115.774 30.6741C116.813 31.5622 117.727 32.3431 117.805 32.409C118.156 32.707 116.938 33.0694 114.41 33.4183C112.902 33.6263 111.351 33.8741 110.964 33.9684C110.459 34.0915 110.29 34.0174 110.367 33.7079C110.58 32.8451 113.137 29.0588 113.506 29.0588C113.715 29.0588 114.735 29.7857 115.774 30.6741ZM269.252 30.6819C270.944 32.0226 271.663 32.7973 271.226 32.8095C271.184 32.8104 269.599 33.0906 267.703 33.432C263.617 34.1677 263.737 34.1605 263.859 33.6663C264.027 32.9907 266.641 29.0723 266.928 29.0654C267.079 29.0616 268.125 29.7892 269.252 30.6819ZM46.7656 29.7492C46.7656 29.9569 46.4101 31.4329 45.9754 33.0291L45.1849 35.931L39.9049 35.9423C37.0006 35.9485 33.8319 36.0369 32.8628 36.1391C31.4964 36.2831 31.13 36.234 31.2305 35.9204C31.3345 35.5955 45.7329 29.453 46.5408 29.389C46.6643 29.3793 46.7656 29.5411 46.7656 29.7492ZM200.253 29.807C200.253 30.0465 199.997 31.1358 199.685 32.2279C199.372 33.3196 199.038 34.5788 198.941 35.0261L198.765 35.8389L192.019 36.0629C188.309 36.1859 185.137 36.1984 184.969 36.0903C184.448 35.7552 184.632 35.3825 185.419 35.1767C186.265 34.9555 197.209 30.536 198.604 29.8519C199.77 29.2803 200.253 29.2672 200.253 29.807ZM49.3902 32.2001C50.0902 33.4124 50.6628 34.5216 50.6628 34.6653C50.6628 34.9764 49.8795 35.1945 47.6905 35.4922C46.2323 35.6905 46.0872 35.6583 46.265 35.176C46.3735 34.8808 46.7539 33.5945 47.1101 32.3175C47.4659 31.0408 47.8386 29.9959 47.9375 29.9959C48.0367 29.9959 48.6905 30.9877 49.3902 32.2001ZM202.852 32.0404C204.553 35.1442 204.565 35.1023 201.861 35.4544C199.904 35.7089 199.609 35.5527 199.951 34.4404C200.095 33.9718 200.43 32.7704 200.697 31.7712C200.963 30.7716 201.327 30.0047 201.507 30.0669C201.686 30.1293 202.291 31.0174 202.852 32.0404ZM106.695 32.2154C107.367 33.2643 107.851 34.2336 107.771 34.3695C107.595 34.6662 102.589 35.4768 102.365 35.2448C102.236 35.1095 105.192 30.3083 105.404 30.3083C105.442 30.3083 106.023 31.1664 106.695 32.2154ZM260.265 32.4043C260.873 33.3808 261.317 34.2689 261.253 34.3782C261.114 34.6119 256.035 35.4344 255.859 35.2513C255.665 35.0486 258.532 30.6313 258.86 30.6301C259.025 30.6294 259.657 31.4279 260.265 32.4043ZM126.207 32.703C126.207 32.8854 123.837 37.6116 122.347 40.4005C122.054 40.949 121.038 42.9098 120.089 44.7581C119.14 46.6064 118.268 48.0567 118.15 47.9811C118.033 47.9055 118.347 44.6612 118.849 40.7716C119.524 35.5434 119.879 33.632 120.212 33.4408C120.459 33.2984 121.538 33.0838 122.61 32.9638C123.682 32.8439 124.615 32.6892 124.683 32.6202C124.893 32.4097 126.207 32.4809 126.207 32.703ZM279.694 32.7023C279.694 33.2596 271.803 48.0877 271.582 47.9455C271.442 47.8553 271.378 47.61 271.441 47.4008C271.503 47.1915 271.93 44.0996 272.389 40.5295C272.849 36.9597 273.301 33.9094 273.395 33.7513C273.692 33.2503 279.694 32.2507 279.694 32.7023ZM118.903 34.2911C118.82 34.5919 118.324 38.0708 117.801 42.0223C117.277 45.9738 116.754 49.314 116.639 49.4446C116.523 49.5755 114.902 46.4411 113.038 42.4796C111.173 38.5184 109.698 35.2254 109.758 35.1626C109.91 35.0061 116.988 33.875 118.358 33.7885C118.886 33.755 119.017 33.8753 118.903 34.2911ZM272.2 34.4157C272.2 35.6939 270.334 49.2078 270.124 49.4452C269.929 49.6667 263.644 36.6551 263.446 35.619C263.375 35.2497 264.15 35.0092 267.104 34.4819C272.072 33.5954 272.2 33.5935 272.2 34.4157ZM111.722 41.788C113.378 45.3528 114.676 48.3754 114.607 48.5047C114.537 48.6337 111.731 46.0332 108.372 42.7258C105.012 39.4181 102.365 36.6045 102.488 36.4733C102.666 36.285 106.818 35.4853 108.39 35.3366C108.566 35.32 110.066 38.2232 111.722 41.788ZM265.226 41.8624C266.893 45.4684 268.166 48.4744 268.055 48.5428C267.799 48.6999 256.193 37.2418 256.072 36.7126C255.996 36.3815 258.603 35.7683 261.876 35.3472C262.052 35.3247 263.559 38.2567 265.226 41.8624ZM50.9554 36.1653C50.9281 37.0653 49.4819 41.3976 49.2091 41.3976C48.8905 41.3976 46.4659 37.3948 46.4659 36.8691C46.4659 36.7357 47.2417 36.4883 48.1896 36.319C50.467 35.9123 50.9641 35.8848 50.9554 36.1653ZM204.438 36.1653C204.402 36.9006 202.982 41.3866 202.762 41.4632C202.506 41.5519 199.953 37.3986 199.953 36.8947C199.953 36.7566 200.661 36.5017 201.527 36.3284C203.552 35.9226 204.453 35.8723 204.438 36.1653ZM44.6672 37.3323C44.6672 37.8106 42.5447 45.6524 42.3424 45.922C42.1736 46.1463 40.4715 45.0708 34.5583 41.003L29.2285 37.3367L31.7767 37.1605C33.1781 37.0637 36.652 36.9584 39.496 36.9263C43.8955 36.8769 44.6672 36.9375 44.6672 37.3323ZM198.151 37.2586C198.149 37.4735 197.798 38.9142 197.371 40.4604C196.945 42.0067 196.451 43.8691 196.275 44.5994C196.099 45.3297 195.819 45.927 195.652 45.927C195.486 45.927 193.81 44.908 191.928 43.6623C190.047 42.4165 188.283 41.2561 188.01 41.0833C187.736 40.9106 186.433 39.9969 185.114 39.0529L182.716 37.3367L185.264 37.1605C186.665 37.0637 190.139 36.9584 192.983 36.9263C196.952 36.8816 198.154 36.9591 198.151 37.2586ZM47.2903 40.4173C47.9911 41.6781 48.5643 42.8429 48.5643 43.0063C48.5643 43.3543 43.853 45.8073 43.6302 45.5752C43.5061 45.4459 44.8998 39.8997 45.4058 38.5081C45.672 37.7762 46.0159 38.1245 47.2903 40.4173ZM200.164 39.2915C200.527 39.9344 201.174 41.0555 201.602 41.783L202.38 43.1056L199.829 44.4238C198.425 45.1489 197.211 45.673 197.13 45.5884C196.98 45.4319 198.176 40.4839 198.733 38.9573C199.139 37.8434 199.377 37.899 200.164 39.2915ZM36.0545 43.1781C39.1782 45.2741 41.7833 47.1365 41.843 47.317C41.9943 47.7728 40.3303 53.4549 40.0428 53.4642C39.8185 53.4711 29.978 39.8401 29.978 39.5221C29.978 39.1497 30.6831 39.5739 36.0545 43.1781ZM189.808 43.3293C192.785 45.341 195.27 47.1349 195.33 47.3158C195.463 47.7163 193.842 53.4314 193.571 53.5183C193.466 53.5523 192.078 51.7527 190.488 49.5193C188.898 47.2858 187.341 45.107 187.03 44.6775C184.628 41.3651 183.465 39.6773 183.465 39.5036C183.465 39.1138 184.429 39.6954 189.808 43.3293ZM48.454 45.2241C47.3202 49.3372 46.9908 50.3246 46.78 50.2418C46.3019 50.0537 43.7678 47.4732 43.7678 47.1743C43.7678 46.8438 47.5738 44.7175 48.2097 44.6928C48.4459 44.6837 48.5442 44.8971 48.454 45.2241ZM201.941 45.2241C200.807 49.3372 200.478 50.3246 200.267 50.2418C199.789 50.0537 197.255 47.4732 197.255 47.1743C197.255 46.8438 201.061 44.7175 201.697 44.6928C201.933 44.6837 202.031 44.8971 201.941 45.2241ZM44.5599 49.5433C45.4433 50.3299 46.1661 51.0721 46.1661 51.193C46.1661 51.4913 41.6388 53.8085 41.4466 53.6082C41.283 53.438 42.6239 48.1136 42.8304 48.1136C42.8982 48.1136 43.6764 48.7571 44.5599 49.5433ZM198.047 49.5433C198.931 50.3299 199.653 51.0721 199.653 51.193C199.653 51.4863 195.128 53.81 194.939 53.6135C194.766 53.4333 196.077 48.1136 196.294 48.1136C196.375 48.1136 197.164 48.7571 198.047 49.5433ZM70.6278 74.9799C68.3858 80.8206 66.5511 85.8073 66.5511 86.0613C66.5511 86.3156 66.8545 86.5877 67.2256 86.6661C69.3493 87.1149 88.6272 89.2163 88.8376 89.022C89.0948 88.7849 91.133 81.7012 91.133 81.0449C91.133 80.7928 83.5576 67.2402 82.8981 66.3121C82.8687 66.2709 81.3033 65.8826 79.4194 65.4494C77.5356 65.0161 75.704 64.5938 75.3493 64.511C74.7555 64.3726 74.3829 65.1985 70.6278 74.9799ZM224.119 74.9593C221.874 80.7875 220.038 85.7736 220.038 86.0397C220.038 86.3059 220.342 86.5902 220.713 86.672C221.316 86.8044 235.408 88.4035 240.463 88.913L242.45 89.1132L242.763 88.0586C244.002 83.875 244.645 81.1199 244.485 80.6838C244.344 80.3015 236.696 66.727 236.388 66.3121C236.357 66.2709 234.79 65.8826 232.907 65.4494C231.023 65.0161 229.193 64.5944 228.84 64.5119C228.251 64.3748 227.867 65.2257 224.119 74.9593ZM0 65.738C0 66.2672 0.444274 66.4208 2.77296 66.6967C3.72117 66.8091 4.4967 67.0206 4.4967 67.1671C4.4967 67.5832 0.53091 70.9093 0.250316 70.7288C0.112717 70.6401 0 71.1499 0 71.8611C0 72.8023 0.783924 75.0602 2.87669 80.1456C4.45892 83.9906 5.70661 87.2764 5.64965 87.447C5.59269 87.6179 4.29824 86.9203 2.77296 85.8967C0.510525 84.3782 0 84.1424 0 84.6163C0 84.9895 0.643327 85.6109 1.79868 86.354C2.78795 86.9903 3.59736 87.6429 3.59736 87.804C3.59736 88.1845 3.44927 88.1736 1.57384 87.6535C0.123509 87.2511 0 87.2589 0 87.7531C0 88.1851 0.711977 88.4528 3.65102 89.1266C5.65924 89.5871 7.37038 89.8926 7.45372 89.8057C7.6252 89.627 6.6662 66.5136 6.47944 66.319C6.41319 66.25 5.43411 66.0654 4.30364 65.9089C3.17317 65.7521 1.74262 65.5481 1.12417 65.4553C0.269202 65.3272 0 65.3947 0 65.738ZM145.365 70.7503L139.19 76.1656L138.981 80.3058C138.865 82.5827 138.878 84.5547 139.009 84.6881C139.328 85.0124 160.744 90.0113 160.94 89.8073C161.116 89.623 160.152 66.5117 159.959 66.3109C159.767 66.1113 153.796 65.3122 152.588 65.3244C151.672 65.3338 150.751 66.026 145.365 70.7503ZM298.852 70.7488L292.677 76.1781L292.468 80.3118C292.353 82.5855 292.366 84.5569 292.497 84.6928C292.712 84.9162 305.958 88.0974 306.673 88.0974C306.839 88.0974 306.974 87.9109 306.974 87.6828C306.974 87.4036 305.535 86.9369 302.553 86.2497C294.593 84.4154 294.084 84.2836 294.084 84.0571C294.084 83.934 295.162 82.8973 296.48 81.7531L298.875 79.673L302.809 82.34C304.973 83.8066 306.812 84.9349 306.896 84.8474C307.306 84.4201 306.441 83.6264 303.255 81.506C301.345 80.2346 299.816 79.0982 299.856 78.9801C299.986 78.6003 306.363 73.1034 306.674 73.1034C307.121 73.1034 307.031 70.069 306.525 68.1055C306.281 67.1605 306.081 66.3521 306.079 66.3093C306.077 66.2665 306.277 66.2312 306.525 66.2312C306.772 66.2312 306.974 66.0204 306.974 65.7627C306.974 65.4397 306.672 65.2982 306 65.3069C305.183 65.3175 304.032 66.1937 298.852 70.7488ZM79.4575 66.4124C80.603 66.6839 81.5401 66.9891 81.5401 67.0903C81.5401 67.367 79.3148 70.9115 79.1419 70.9103C78.974 70.909 78.1571 69.6211 76.9166 67.4026C76.1018 65.9451 76.0985 65.9189 76.731 65.9189C77.0851 65.9189 78.3121 66.141 79.4575 66.4124ZM232.834 66.4121C233.956 66.6832 234.927 66.9597 234.991 67.0259C235.142 67.1833 232.838 70.9106 232.588 70.914C232.441 70.9162 230.804 68.1986 229.72 66.1531C229.525 65.7855 230.616 65.8761 232.834 66.4121ZM76.9924 69.3487L78.4871 71.998L77.4157 73.2534C71.7607 79.8804 69.0863 82.7895 69.0105 82.3962C68.9616 82.1438 70.1859 78.6493 71.7316 74.6309C73.2773 70.6123 74.6368 67.055 74.7531 66.7257C75.0253 65.9548 75.1794 66.1353 76.9924 69.3487ZM156.635 66.7354C157.377 66.8407 157.984 67.0409 157.984 67.1802C157.984 67.6038 153.976 70.9287 153.765 70.6801C153.657 70.5526 153.409 69.7454 153.215 68.8864C153.02 68.0274 152.785 67.0603 152.692 66.7373C152.538 66.2037 152.649 66.1681 153.904 66.3468C154.664 66.4552 155.893 66.6298 156.635 66.7354ZM230.358 69.1729C231.16 70.6191 231.791 71.9192 231.76 72.0623C231.646 72.594 222.659 82.7742 222.433 82.6283C222.118 82.4256 228.196 66.5558 228.591 66.5489C228.761 66.5461 229.556 67.7269 230.358 69.1729ZM152.147 68.3354C152.348 69.0454 152.604 70.0056 152.716 70.4695L152.919 71.3126L150.43 71.0864C149.061 70.9621 147.773 70.7622 147.567 70.6419C147.161 70.4052 151.019 66.7994 151.51 66.9572C151.659 67.0053 151.946 67.6254 152.147 68.3354ZM305.539 67.9696C305.674 68.4738 305.907 69.4309 306.056 70.0959L306.328 71.3054L303.878 71.083C302.531 70.9606 301.26 70.7622 301.054 70.6419C300.641 70.4014 304.511 66.8004 305.009 66.9613C305.165 67.0119 305.404 67.4654 305.539 67.9696ZM84.0495 70.214C85.1234 72.1088 85.3215 72.6577 84.9603 72.7398C84.3898 72.8695 80.0412 71.8824 80.0412 71.6234C80.0412 71.3039 82.2778 67.7987 82.4835 67.7959C82.5902 67.7943 83.295 68.8827 84.0495 70.214ZM159.626 76.5892C159.845 81.2864 159.968 85.1907 159.898 85.2651C159.829 85.3397 159.655 85.2694 159.51 85.1089C159.188 84.7497 154.015 72.131 154.144 72.0161C157.185 69.2994 158.991 67.8015 159.096 67.9102C159.168 67.9861 159.407 71.8917 159.626 76.5892ZM237.556 70.214C238.612 72.1098 238.805 72.6577 238.446 72.7398C237.877 72.8695 233.528 71.8824 233.528 71.6234C233.528 71.2842 235.771 67.7987 235.991 67.7959C236.11 67.7943 236.813 68.8827 237.556 70.214ZM5.7105 68.1836C5.83042 68.8264 6.50042 85.1682 6.41079 85.2651C6.34184 85.3397 6.16677 85.2694 6.02198 85.1089C5.68982 84.7418 0.523116 72.1388 0.65352 72.0145C2.90097 69.8691 5.63796 67.7959 5.7105 68.1836ZM150.126 72.0392C151.163 72.1551 151.973 72.3641 151.925 72.5037C151.791 72.896 146.581 77.4767 146.269 77.4767C145.954 77.4767 145.905 74.4826 146.189 72.6867C146.37 71.5478 146.425 71.4972 147.31 71.659C147.822 71.7524 149.089 71.9236 150.126 72.0392ZM303.614 72.0392C304.651 72.1551 305.46 72.3687 305.412 72.514C305.292 72.8804 300.023 77.4767 299.723 77.4767C299.436 77.4767 299.405 74.3964 299.677 72.6867C299.857 71.5478 299.912 71.4972 300.798 71.659C301.31 71.7524 302.577 71.9236 303.614 72.0392ZM145.093 75.1436C145.093 77.1387 144.988 77.8509 144.674 77.9765C144.33 78.1139 141.434 76.8426 140.896 76.3181C140.729 76.1547 144.515 72.5056 144.869 72.489C144.992 72.4834 145.093 73.6779 145.093 75.1436ZM298.581 75.1436C298.581 77.1387 298.475 77.8509 298.161 77.9765C297.817 78.1139 294.921 76.8426 294.384 76.3181C294.216 76.1547 298.002 72.5056 298.356 72.489C298.48 72.4834 298.581 73.6779 298.581 75.1436ZM85.9786 74.2021C86.0961 74.307 84.599 79.7036 84.3928 79.9185C84.3077 80.0072 84.1928 80.0213 84.1377 79.9497C83.7276 79.4187 80.341 73.3318 80.341 73.1256C80.341 72.9116 85.6744 73.93 85.9786 74.2021ZM81.3872 77.0534C82.6436 79.226 83.563 81.1043 83.4302 81.2276C83.0747 81.5584 69.3459 85.0592 68.9475 84.9208C68.6292 84.8102 78.4536 73.159 78.8972 73.1209C79.0102 73.1113 80.1305 74.8808 81.3872 77.0534ZM156.362 80.1318C157.92 83.9116 159.158 87.1749 159.114 87.3836C159.068 87.5994 156.835 86.2728 153.937 84.308C151.134 82.4078 148.267 80.4808 147.566 80.0256C146.865 79.5708 146.325 79.101 146.367 78.9823C146.546 78.47 152.775 73.1484 153.134 73.2012C153.351 73.2334 154.804 76.3521 156.362 80.1318ZM234.94 77.148C236.16 79.2688 237.05 81.1049 236.917 81.2283C236.562 81.5584 222.833 85.0592 222.435 84.9208C222.043 84.785 232.041 73.1028 232.451 73.2165C232.6 73.2581 233.72 75.027 234.94 77.148ZM237.164 73.6148C238.379 73.8959 239.415 74.1615 239.466 74.2049C239.584 74.3064 238.086 79.7042 237.88 79.9185C237.795 80.0072 237.68 80.0213 237.625 79.9497C237.362 79.6089 233.828 73.369 233.828 73.2449C233.828 72.9788 234.954 73.1034 237.164 73.6148ZM88.4008 77.7656C89.0792 78.9551 89.6341 80.0616 89.6341 80.2237C89.6341 80.5579 87.9353 80.9043 86.2709 80.9093C85.5119 80.9115 85.1959 80.7881 85.2804 80.5223C85.3488 80.3077 85.6875 79.1129 86.0332 77.8671C86.3788 76.6214 86.7754 75.6024 86.9145 75.6024C87.0536 75.6024 87.7224 76.5758 88.4008 77.7656ZM241.888 77.7656C242.566 78.9551 243.121 80.0616 243.121 80.2237C243.121 80.5579 241.423 80.9043 239.758 80.9093C238.999 80.9115 238.683 80.7881 238.768 80.5223C238.836 80.3077 239.175 79.1129 239.52 77.8671C239.866 76.6214 240.263 75.6024 240.402 75.6024C240.541 75.6024 241.21 76.5758 241.888 77.7656ZM144.111 79.2478C144.226 79.6086 140.134 83.1372 139.892 82.8854C139.717 82.7036 139.937 78.3248 140.158 77.5673C140.278 77.159 143.941 78.7168 144.111 79.2478ZM297.598 79.2478C297.714 79.6086 293.621 83.1372 293.379 82.8854C293.204 82.7036 293.424 78.3248 293.645 77.5673C293.765 77.159 297.429 78.7168 297.598 79.2478ZM155.661 86.6086C157.252 87.6341 157.544 88.2857 156.26 87.9484C155.017 87.6213 140.908 84.3489 140.742 84.3489C140.228 84.3489 140.898 83.5826 143.003 81.7627L145.41 79.6826L149.823 82.6867C152.251 84.3392 154.878 86.1038 155.661 86.6086ZM89.9339 81.8905C89.9339 82.6211 88.6314 87.1602 88.4218 87.1602C88.1634 87.1602 85.6414 82.6414 85.6893 82.2644C85.7076 82.1223 86.3662 81.9227 87.1535 81.8208C89.5361 81.5125 89.9339 81.5225 89.9339 81.8905ZM243.421 81.9289C243.421 82.5543 242.257 86.6245 242.002 86.89C241.773 87.1284 239.359 83.3552 239.171 82.4656C239.1 82.1267 239.467 81.9577 240.573 81.8208C243.088 81.51 243.421 81.5228 243.421 81.9289ZM85.9885 85.0052C86.869 86.5608 87.5255 87.8996 87.4475 87.9808C87.2962 88.1386 70.9833 86.2294 70.7729 86.0294C70.7042 85.9642 70.7348 85.8202 70.841 85.7099C71.0145 85.5287 83.3657 82.2569 84.0882 82.2007C84.2531 82.1876 85.1084 83.4499 85.9885 85.0052ZM239.476 85.0052C240.356 86.5608 241 87.913 240.906 88.0105C240.813 88.108 239.553 88.0311 238.107 87.8393C236.66 87.6475 232.948 87.179 229.856 86.7985C226.765 86.4177 224.235 85.9945 224.235 85.8583C224.235 85.7218 224.606 85.5109 225.06 85.3897C228.354 84.5082 237.333 82.221 237.575 82.2013C237.74 82.1882 238.596 83.4499 239.476 85.0052ZM28.1793 109.571C26.6129 111.057 25.2897 112.376 25.2388 112.501C25.1398 112.745 36.342 131.359 37.0513 132.13C37.4182 132.529 37.5774 132.461 38.2966 131.599C38.7501 131.055 42.0891 127.222 45.7164 123.081C49.3437 118.94 52.3538 115.356 52.4054 115.117C52.4779 114.782 50.4769 111.901 47.7456 108.409C47.6206 108.249 33.4218 106.867 31.9265 106.869C31.217 106.87 30.4261 107.44 28.1793 109.571ZM113.167 112.187C108.056 115.125 103.711 117.688 103.512 117.885C103.235 118.159 103.717 118.858 105.587 120.897C110.77 126.545 118.837 134.953 119.073 134.953C119.21 134.953 120.777 133.898 122.557 132.607L125.793 130.261L126.901 122.377C127.51 118.041 128.008 114.168 128.007 113.771C128.006 112.97 123.415 106.838 122.82 106.843C122.622 106.844 118.278 109.249 113.167 112.187ZM181.667 109.563C180.1 111.049 178.777 112.368 178.727 112.495C178.617 112.769 190.269 132.046 190.718 132.336C190.887 132.445 191.315 132.175 191.667 131.736C192.02 131.298 195.344 127.477 199.054 123.245C202.764 119.014 205.837 115.377 205.885 115.162C205.959 114.823 201.741 108.86 201.088 108.382C200.884 108.232 185.685 106.798 184.814 106.846C184.649 106.855 183.233 108.078 181.667 109.563ZM266.654 112.187C261.543 115.125 257.189 117.697 256.98 117.902C256.678 118.2 258.211 119.994 264.427 126.615C268.732 131.201 272.38 134.953 272.532 134.953C273.051 134.953 279.395 130.179 279.395 129.789C279.395 129.574 279.867 126.055 280.444 121.968C281.021 117.881 281.493 114.202 281.493 113.793C281.493 112.971 276.916 106.838 276.307 106.843C276.109 106.844 271.765 109.249 266.654 112.187ZM35.6363 108.094C38.0762 108.102 38.1557 108.48 36.1235 110.412C35.1342 111.352 34.1749 112.128 33.9917 112.136C33.6485 112.15 32.3762 109.034 32.3762 108.179C32.3762 107.808 32.5891 107.743 33.313 107.894C33.8283 108.001 34.8737 108.091 35.6363 108.094ZM189.124 108.094C191.563 108.102 191.643 108.48 189.611 110.412C188.621 111.352 187.662 112.128 187.479 112.136C187.136 112.15 185.863 109.034 185.863 108.179C185.863 107.808 186.076 107.743 186.8 107.894C187.316 108.001 188.361 108.091 189.124 108.094ZM32.0584 110.445C32.4392 111.569 32.6865 112.556 32.6082 112.637C32.3196 112.938 27.28 112.366 27.28 112.033C27.28 111.622 30.5982 108.436 31.0467 108.416C31.2224 108.408 31.6774 109.321 32.0584 110.445ZM122.204 108.948C122.123 109.249 121.898 110.725 121.703 112.228C121.508 113.732 121.321 114.961 121.286 114.961C121.251 114.961 118.196 115.446 114.497 116.038C110.798 116.63 107.669 117.009 107.546 116.881C107.308 116.635 121.275 108.425 121.955 108.41C122.189 108.405 122.291 108.625 122.204 108.948ZM185.511 110.354C185.873 111.428 186.168 112.421 186.166 112.562C186.163 112.812 181.652 112.563 180.771 112.264C180.462 112.159 180.918 111.553 182.27 110.271C183.34 109.258 184.358 108.423 184.534 108.415C184.71 108.408 185.149 109.28 185.511 110.354ZM275.691 108.948C275.611 109.249 275.378 110.725 275.173 112.228C274.969 113.732 274.781 114.961 274.755 114.961C274.729 114.961 271.626 115.454 267.86 116.057C261.721 117.039 260.397 117.16 260.843 116.695C261.234 116.288 275.108 108.411 275.443 108.407C275.676 108.404 275.778 108.626 275.691 108.948ZM41.3522 111.305C42.2264 112.472 42.8691 113.503 42.7804 113.596C42.6916 113.688 41.1679 113.611 39.3941 113.426C37.6206 113.239 35.9229 113.087 35.6216 113.087C35.3206 113.087 35.0742 112.978 35.0742 112.843C35.0742 112.401 39.3494 108.67 39.5586 108.929C39.6711 109.069 40.4784 110.138 41.3522 111.305ZM46.4233 109.193C46.5948 109.367 44.3503 113.087 44.0733 113.087C43.8065 113.087 40.77 109.18 40.77 108.836C40.77 108.637 46.2143 108.979 46.4233 109.193ZM125.418 111.192C126.319 112.387 126.696 113.122 126.48 113.261C126.01 113.564 122.512 114.651 122.396 114.53C122.29 114.419 122.882 109.741 123.087 109.069C123.26 108.499 123.665 108.868 125.418 111.192ZM196.257 113.607C196.174 113.693 194.655 113.611 192.881 113.426C191.108 113.239 189.41 113.087 189.109 113.087C188.205 113.087 188.461 112.691 190.687 110.65L192.813 108.701L194.61 111.076C195.598 112.382 196.339 113.521 196.257 113.607ZM199.901 109.181C200.079 109.366 197.847 113.087 197.559 113.087C197.275 113.087 194.257 109.223 194.257 108.859C194.257 108.631 199.669 108.939 199.901 109.181ZM278.905 111.192C279.673 112.211 280.179 113.124 280.029 113.221C279.602 113.496 275.984 114.635 275.88 114.527C275.776 114.419 276.372 109.731 276.574 109.069C276.748 108.499 277.153 108.868 278.905 111.192ZM49.2823 112.008C50.0896 113.124 50.6688 114.122 50.5698 114.225C50.2875 114.52 45.2667 114.003 45.2667 113.679C45.2667 113.103 47.1314 109.964 47.4686 109.971C47.659 109.976 48.4753 110.892 49.2823 112.008ZM202.77 112.008C203.577 113.124 204.156 114.122 204.057 114.225C203.761 114.533 198.754 113.995 198.754 113.655C198.754 113.118 200.676 109.963 200.998 109.971C201.165 109.976 201.963 110.892 202.77 112.008ZM33.1652 113.805C33.1994 113.841 33.8601 117.006 34.633 120.838C35.8441 126.843 36.0746 128.639 35.559 128.055C35.4118 127.888 29.3664 117.939 27.8115 115.304L26.6309 113.304L29.8668 113.522C31.6465 113.642 33.1308 113.769 33.1652 113.805ZM186.657 113.81C186.694 113.848 187.355 117.012 188.127 120.84C189.338 126.843 189.565 128.635 189.044 128.055C188.945 127.946 181.104 115.064 180.331 113.741C180.113 113.368 180.572 113.335 183.332 113.521C185.124 113.641 186.62 113.772 186.657 113.81ZM39.3695 114.365C41.3765 114.552 43.1035 114.798 43.2076 114.911C43.457 115.183 38.0106 129.209 37.6224 129.295C37.4575 129.332 37.241 128.968 37.1415 128.487C37.042 128.006 36.3942 124.801 35.702 121.365C35.0101 117.929 34.3742 114.871 34.2891 114.571C34.1011 113.906 34.3476 113.896 39.3695 114.365ZM192.857 114.365C194.864 114.552 196.591 114.798 196.695 114.911C196.935 115.173 191.513 129.187 191.11 129.349C190.87 129.446 189.446 123.137 187.844 114.883C187.645 113.858 187.54 113.869 192.857 114.365ZM127.084 114.727C126.982 116.476 126.273 119.803 126.002 119.803C125.654 119.803 122.517 115.891 122.706 115.694C122.925 115.466 126.076 114.382 126.582 114.36C126.87 114.347 127.096 114.513 127.084 114.727ZM280.571 114.727C280.469 116.476 279.76 119.803 279.489 119.803C279.141 119.803 276.004 115.891 276.194 115.694C276.412 115.466 279.563 114.382 280.069 114.36C280.358 114.347 280.584 114.513 280.571 114.727ZM50.7245 115.541C50.9748 115.784 39.9852 128.393 39.5236 128.393C39.3494 128.393 39.2765 128.218 39.3617 128.003C39.4465 127.788 40.6301 124.752 41.9913 121.257L44.4666 114.901L47.4896 115.119C49.1525 115.239 50.6082 115.429 50.7245 115.541ZM204.212 115.541C204.462 115.784 193.472 128.393 193.011 128.393C192.837 128.393 192.763 128.218 192.846 128.003C192.929 127.788 194.09 124.81 195.426 121.384C196.762 117.958 197.855 115.096 197.855 115.025C197.855 114.817 203.977 115.314 204.212 115.541ZM121.111 116.235C121.111 116.87 119.862 125.101 119.733 125.319C119.607 125.531 117.659 124.624 109.569 120.588C106.386 119 105.782 118.596 106.272 118.383C106.602 118.239 109.367 117.747 112.417 117.29C115.468 116.833 118.57 116.349 119.312 116.215C120.054 116.082 120.762 115.955 120.886 115.935C121.01 115.915 121.111 116.05 121.111 116.235ZM274.598 116.174C274.598 116.325 274.328 118.31 273.999 120.584C273.669 122.859 273.399 124.843 273.399 124.995C273.399 125.687 272.471 125.292 263.057 120.59C259.873 119 259.269 118.596 259.759 118.383C260.089 118.239 262.854 117.747 265.905 117.29C268.955 116.833 272.058 116.349 272.8 116.215C273.542 116.082 274.25 115.955 274.373 115.935C274.497 115.915 274.598 116.022 274.598 116.174ZM123.823 118.914C124.684 120.057 125.405 121.193 125.424 121.438C125.458 121.884 121.241 125.197 120.983 124.928C120.886 124.827 121.636 118.898 121.996 116.914C122.045 116.645 122.428 117.065 123.823 118.914ZM277.31 118.914C278.172 120.057 278.892 121.193 278.911 121.438C278.945 121.888 274.727 125.196 274.466 124.924C274.235 124.683 275.36 116.836 275.626 116.836C275.69 116.836 276.448 117.771 277.31 118.914ZM113.515 123.594C116.868 125.25 119.609 126.761 119.606 126.952C119.586 127.983 118.778 132.803 118.591 132.998C118.4 133.197 116.26 131.002 108.545 122.693C107.469 121.533 106.774 120.584 107.002 120.584C107.231 120.584 110.161 121.939 113.515 123.594ZM263.385 121.781C264.688 122.439 267.407 123.798 269.427 124.799C271.447 125.801 273.096 126.773 273.093 126.96C273.073 127.996 272.263 132.805 272.076 133.001C271.882 133.202 270.188 131.462 261.891 122.536C260.797 121.36 260.263 120.584 260.546 120.584C260.804 120.584 262.082 121.123 263.385 121.781ZM125.776 124.098C125.264 127.378 124.995 128.824 124.874 128.95C124.762 129.067 122.282 127.363 121.313 126.503C121.072 126.29 125.166 123.083 125.679 123.083C125.82 123.083 125.863 123.54 125.776 124.098ZM279.275 123.942C279.182 124.414 278.974 125.698 278.811 126.795C278.649 127.892 278.45 128.857 278.37 128.941C278.251 129.064 275.805 127.394 274.8 126.503C274.556 126.287 278.657 123.083 279.177 123.083C279.323 123.083 279.367 123.47 279.275 123.942ZM122.336 128.411C124.667 129.969 124.667 129.997 122.314 131.627C120.057 133.191 119.49 133.389 119.717 132.532C119.796 132.232 119.95 131.283 120.058 130.424C120.31 128.425 120.533 127.456 120.743 127.456C120.834 127.456 121.551 127.886 122.336 128.411ZM275.823 128.411C278.154 129.969 278.154 129.997 275.801 131.627C273.544 133.191 272.977 133.389 273.204 132.532C273.283 132.232 273.437 131.283 273.545 130.424C273.797 128.425 274.02 127.456 274.23 127.456C274.321 127.456 275.038 127.886 275.823 128.411ZM75.5604 145.129C73.8382 145.363 72.2739 145.616 72.0847 145.692C71.6471 145.867 62.3542 159.157 62.3542 159.607C62.3542 159.814 63.0722 159.931 64.2278 159.911C65.8094 159.884 65.9471 159.841 65.1119 159.635C64.5678 159.501 64.0428 159.308 63.9457 159.207C63.7946 159.049 64.9281 157.169 66.3922 155.148C67.0481 154.243 67.3473 154.741 67.7679 157.439L68.1579 159.943H69.1082C69.9776 159.943 70.272 159.634 72.5599 156.313C74.9488 152.846 75.0816 152.711 75.5274 153.297C75.784 153.635 77.0059 155.267 78.2425 156.925C79.6041 158.75 80.7043 159.94 81.032 159.941C81.4612 159.943 81.3066 159.592 80.2825 158.241C77.7296 154.875 75.8443 152.178 75.8443 151.893C75.8443 151.672 78.7135 147.265 79.331 146.537C79.5906 146.232 79.897 147.117 81.6672 153.284C83.1379 158.408 83.6496 159.81 84.0795 159.897C84.4746 159.976 84.5748 159.869 84.4426 159.51C84.2321 158.939 83.304 155.765 81.4633 149.322C79.9641 144.075 80.5034 144.458 75.5604 145.129ZM231.88 144.787C231.715 144.851 230.187 145.071 228.484 145.276L225.389 145.65L223.538 148.324C221.217 151.677 218.485 155.559 216.99 157.629C216.358 158.504 215.841 159.383 215.841 159.581C215.841 159.82 216.478 159.932 217.715 159.911C219.297 159.884 219.434 159.841 218.599 159.635C218.055 159.501 217.525 159.303 217.421 159.194C217.203 158.967 220.148 154.477 220.516 154.477C220.65 154.477 220.934 155.39 221.145 156.507C221.813 160.031 221.774 159.944 222.667 159.93C223.359 159.92 223.856 159.386 225.884 156.471C227.203 154.576 228.368 152.967 228.473 152.895C228.578 152.824 229.834 154.381 231.263 156.354C233.021 158.78 234.053 159.943 234.448 159.943C234.907 159.943 234.417 159.105 232.182 156.067C230.615 153.935 229.331 152.058 229.331 151.896C229.331 151.668 232.225 147.227 232.835 146.52C233.088 146.226 233.423 147.209 235.183 153.404C236.735 158.868 237.373 160.414 237.865 159.901C237.928 159.836 237.007 156.41 235.818 152.288C233.781 145.226 233.614 144.79 232.918 144.733C232.512 144.7 232.045 144.724 231.88 144.787ZM78.2764 146.433C77.6627 147.601 75.498 150.416 75.2129 150.416C74.8199 150.416 72.9595 146.914 73.2125 146.65C73.4301 146.423 76.0706 145.985 77.5785 145.925C78.4308 145.892 78.5246 145.96 78.2764 146.433ZM231.82 146.297C230.832 147.992 228.881 150.572 228.649 150.491C228.216 150.341 226.458 146.902 226.69 146.66C226.916 146.425 229.531 145.986 231.07 145.925C231.815 145.896 232 145.988 231.82 146.297ZM73.2893 149.399C73.7803 150.367 74.0969 151.247 73.9934 151.355C73.753 151.606 69.6565 152.204 69.066 152.075C68.7422 152.004 69.0414 151.358 70.1652 149.698C71.0142 148.443 71.8638 147.467 72.053 147.528C72.2421 147.589 72.7985 148.43 73.2893 149.399ZM226.77 149.396C227.272 150.358 227.61 151.221 227.52 151.314C227.287 151.557 223.131 152.2 222.576 152.079C222.221 152.002 222.479 151.43 223.652 149.698C224.501 148.443 225.345 147.469 225.527 147.533C225.709 147.596 226.269 148.434 226.77 149.396ZM5.99559 149.968C5.5834 150.105 4.06591 150.582 2.62307 151.029C0.87086 151.572 0 151.994 0 152.3C0 152.874 0.213743 152.873 1.79868 152.29C3.29338 151.741 3.29758 151.74 3.29758 152.096C3.29758 152.248 2.55562 152.955 1.64879 153.668C0.741955 154.382 0 155.172 0 155.424C0 155.676 0.0743454 155.882 0.165179 155.882C0.256012 155.882 1.40657 155.039 2.722 154.008C4.03773 152.977 5.3124 152.134 5.55462 152.134C5.8544 152.134 5.99559 152.467 5.99559 153.175C5.99559 153.748 6.09662 154.322 6.22043 154.451C6.50702 154.749 6.51301 154.804 6.55768 157.6C6.58616 159.381 6.69588 159.943 7.01485 159.943C7.60271 159.943 7.46002 154.997 6.86076 154.611C6.5337 154.4 6.52621 154.267 6.82239 153.959C7.26546 153.497 7.32512 152.638 6.89493 152.915C6.73006 153.021 6.59515 152.967 6.59515 152.795C6.59515 152.624 6.73006 152.396 6.89493 152.29C7.24208 152.066 7.30413 150.048 6.96988 149.852C6.84607 149.779 6.40779 149.831 5.99559 149.968ZM149.74 152.979C143.969 154.778 139.139 156.358 139.007 156.489C138.874 156.62 138.858 157.451 138.97 158.336C139.199 160.131 139.899 160.554 140.053 158.991L140.147 158.038L141.415 159.013C142.175 159.598 142.956 159.948 143.364 159.888C143.948 159.801 143.8 159.61 142.324 158.538C141.378 157.85 140.602 157.191 140.6 157.073C140.597 156.851 141.763 156.462 150.789 153.674C153.675 152.782 156.204 151.986 156.41 151.904C156.616 151.822 156.785 151.891 156.785 152.057C156.785 152.223 154.664 154.03 152.072 156.073C148.557 158.844 147.518 159.811 147.981 159.881C148.395 159.943 150.255 158.672 153.576 156.054C156.312 153.898 158.69 152.134 158.86 152.134C159.03 152.134 158.581 153.891 157.863 156.039C156.743 159.385 156.63 159.943 157.066 159.943C157.423 159.943 157.735 159.408 158.112 158.147C158.408 157.159 158.855 155.859 159.106 155.258C159.561 154.169 159.564 154.168 159.793 154.945C159.919 155.375 160.036 156.675 160.052 157.835C160.077 159.558 160.171 159.943 160.568 159.943C161.005 159.943 161.033 159.444 160.84 155.023C160.722 152.317 160.537 150.014 160.429 149.906C160.321 149.797 155.511 151.18 149.74 152.979ZM302.328 153.259C300.02 154.016 296.917 154.996 295.433 155.438C293.949 155.879 292.647 156.336 292.539 156.452C292.166 156.856 292.638 159.943 293.073 159.943C293.33 159.943 293.484 159.592 293.484 159.006C293.484 158.491 293.56 158.069 293.652 158.069C293.744 158.069 294.337 158.502 294.969 159.032C295.7 159.644 296.377 159.957 296.825 159.891C297.446 159.799 297.324 159.636 295.811 158.538C294.865 157.85 294.089 157.192 294.088 157.075C294.083 156.8 294.356 156.705 301.126 154.639C305.455 153.317 306.843 152.772 306.919 152.362C307.044 151.681 307.287 151.633 302.328 153.259ZM73.628 152.94C73.3969 153.568 69.8616 158.648 69.4889 158.889C69.3352 158.988 69.1526 159.009 69.0833 158.937C68.8336 158.677 68.0188 153.624 68.1966 153.439C68.342 153.287 70.2714 152.943 73.5531 152.482C73.6943 152.462 73.7281 152.668 73.628 152.94ZM227.233 152.752C227.233 153.17 222.985 159.318 222.696 159.318C222.568 159.318 222.378 158.791 222.273 158.147C222.168 157.503 221.96 156.484 221.811 155.882C221.663 155.281 221.54 154.424 221.539 153.977C221.537 153.189 221.612 153.157 224.16 152.855C225.603 152.685 226.884 152.523 227.008 152.496C227.132 152.468 227.233 152.584 227.233 152.752ZM4.23889 156.514C3.33235 159.396 3.19865 160.535 3.85697 159.766C4.4976 159.018 5.64995 154.969 5.4473 154.179C5.26533 153.47 5.08966 153.81 4.23889 156.514ZM303.704 157.547C301.49 159.305 301.018 159.808 301.512 159.884C301.908 159.946 302.764 159.452 303.825 158.553C304.75 157.767 305.838 156.899 306.241 156.623C306.917 156.163 307.272 155.225 306.75 155.282C306.626 155.296 305.256 156.315 303.704 157.547Z" fill="#F9F4F4"/>
</svg>
