<svg width="15" height="20" viewBox="0 0 15 20" fill="none" xmlns="http://www.w3.org/2000/svg">
<path fill-rule="evenodd" clip-rule="evenodd" d="M10.9146 0.197504C10.2923 0.459632 9.69613 1.01017 9.36811 1.62536C9.15225 2.03009 9.13147 2.15654 9.13218 3.05685L9.13289 4.04436L6.93179 5.62068L4.7307 7.19709L4.18877 6.95387C3.09906 6.46478 1.77643 6.6929 0.934638 7.51489C-0.59089 9.00472 -0.192104 11.4973 1.71685 12.4041C2.13242 12.6016 2.32431 12.6359 3.0044 12.6344C3.65537 12.633 3.87994 12.595 4.21523 12.4296L4.6269 12.2265L6.7645 13.6301C7.94017 14.4021 8.9616 15.0736 9.03424 15.1225C9.14301 15.1955 9.15074 15.2939 9.07801 15.6788C8.90761 16.5805 9.28944 17.6892 9.98765 18.32C11.5174 19.7022 13.9311 19.1973 14.7996 17.3136C15.067 16.7338 15.0667 15.4789 14.7992 14.9005C14.0462 13.2722 11.9658 12.6249 10.491 13.56L10.1081 13.8028L8.11022 12.5081C7.01136 11.796 6.02438 11.1516 5.91702 11.076C5.72771 10.9428 5.72593 10.9266 5.85922 10.5443C5.99081 10.1668 5.98646 9.32119 5.84963 8.6847C5.80097 8.45853 6.09826 8.22766 9.72587 5.6744L10.155 5.37231L10.5782 5.60265C11.7829 6.25833 13.2977 6.00854 14.2264 5.00097C14.8228 4.35399 14.9913 3.9029 14.9897 2.95731C14.9881 2.00274 14.7884 1.50495 14.1512 0.867742C13.5721 0.288699 13.0161 0.0501018 12.1505 0.00943283C11.5459 -0.0188933 11.3619 0.00907766 10.9146 0.197504Z" fill="#FD9149"/>
</svg>
