<svg width="50" height="51" viewBox="0 0 50 51" fill="none" xmlns="http://www.w3.org/2000/svg">
<path d="M22.624 1.02614C14.8016 1.83772 7.94724 6.09115 3.78181 12.7206C-2.1241 22.1075 -1.01919 34.5158 6.44143 42.6902C10.5775 47.2174 15.7403 49.926 21.9396 50.806C23.0934 50.9722 26.9361 50.9624 28.1486 50.806C33.8101 50.0237 38.8751 47.5108 42.7276 43.58C43.9987 42.2893 44.2628 41.9862 45.1037 40.8715C47.6068 37.5372 49.2398 33.4696 49.8753 29.0304C50.0416 27.8765 50.0416 24.024 49.8753 22.8702C49.4549 19.9075 48.6824 17.3847 47.4602 14.9109C46.1499 12.2904 44.8201 10.4228 42.7374 8.32053C38.8751 4.40933 34.0447 1.97461 28.4908 1.15326C27.2881 0.977252 23.8169 0.899028 22.624 1.02614ZM27.337 9.90457C32.9496 10.9899 36.9879 15.5954 37.3888 21.3546C37.643 24.9627 34.8465 30.3308 28.794 37.8306C27.5521 39.3657 25.1076 42.1818 25.0196 42.1818C24.9316 42.1818 22.4871 39.3657 21.2453 37.8306C17.999 33.8118 15.7794 30.5264 14.3127 27.5637C12.6505 24.2 12.318 22.3226 12.8949 19.5457C13.902 14.686 17.7155 10.9019 22.624 9.91435C23.8658 9.66012 26.0659 9.66012 27.337 9.90457Z" fill="url(#paint0_linear_24068_26)"/>
<path d="M23.8561 17.3066C21.3822 17.9715 19.8471 20.5431 20.4729 22.968C21.128 25.4712 23.6898 27.0259 26.1441 26.3903C28.6473 25.7352 30.202 23.1734 29.5664 20.7191C29.234 19.4773 28.2366 18.1964 27.161 17.6684C26.1441 17.1697 24.8925 17.023 23.8561 17.3066Z" fill="url(#paint1_linear_24068_26)"/>
<defs>
<linearGradient id="paint0_linear_24068_26" x1="25" y1="0.963467" x2="25" y2="50.927" gradientUnits="userSpaceOnUse">
<stop stop-color="#012433"/>
<stop offset="1" stop-color="#007A64"/>
</linearGradient>
<linearGradient id="paint1_linear_24068_26" x1="25.0209" y1="17.1635" x2="25.0209" y2="26.5327" gradientUnits="userSpaceOnUse">
<stop stop-color="#012433"/>
<stop offset="1" stop-color="#007A64"/>
</linearGradient>
</defs>
</svg>
