<svg width="20" height="26" viewBox="0 0 20 26" fill="none" xmlns="http://www.w3.org/2000/svg">
<path d="M9.63881 0.140945C9.27458 0.599616 6.76538 5.09188 6.76538 5.28075C6.76538 5.38867 6.85981 5.59102 6.98123 5.69895C7.2915 6.02271 12.9844 6.02271 13.2947 5.69895C13.4161 5.59102 13.5105 5.38867 13.5105 5.26726C13.5105 5.14585 12.8495 3.91823 12.0536 2.54222C10.7045 0.235378 10.5696 0.0465136 10.1919 0.00604248C9.96258 -0.0209379 9.71976 0.0465136 9.63881 0.140945ZM10.9339 3.31116L11.6084 4.49831L10.8664 4.53878C10.4752 4.56576 9.8007 4.56576 9.40948 4.53878L8.66751 4.49831L9.34203 3.31116C9.71976 2.66363 10.0705 2.13751 10.138 2.13751C10.2054 2.13751 10.5562 2.66363 10.9339 3.31116Z" fill="url(#paint0_linear_18788_523)"/>
<path d="M1.5986 0.545673C1.09946 1.22019 0.290039 2.74459 0.290039 3.00091C0.290039 3.12232 0.627296 3.81032 1.0455 4.51182L1.78746 5.77991H3.39281C4.98466 5.77991 4.99815 5.77991 5.25447 5.40218C5.79408 4.61974 6.49557 3.24373 6.49557 2.94695C6.49557 2.60969 5.37588 0.559164 5.03862 0.275867C4.89023 0.167945 4.33713 0.113984 3.37932 0.113984H1.92236L1.5986 0.545673ZM4.70137 2.23196L5.11956 3.0144L4.71486 3.71589L4.31015 4.43088H3.46026H2.61037L2.19217 3.75636C1.96284 3.37863 1.77397 3.04138 1.77397 3.00091C1.77397 2.94695 1.96284 2.58271 2.19217 2.19149L2.59688 1.46301H3.43328H4.26968L4.70137 2.23196Z" fill="url(#paint1_linear_18788_523)"/>
<path d="M15.3992 0.4243C13.6589 1.34164 13.3756 3.87782 14.873 5.1459C16.1007 6.19815 17.733 6.14419 18.8662 5.02449C19.7835 4.10715 19.9724 2.83906 19.3788 1.63843C18.8662 0.626655 18.1782 0.194965 16.964 0.141004C16.1546 0.100533 15.9118 0.141004 15.3992 0.4243ZM17.7869 1.74635C18.4615 2.31294 18.5019 3.39217 17.8814 4.0397C16.5458 5.4292 14.3739 3.4866 15.615 2.01616C16.1546 1.36862 17.1664 1.24721 17.7869 1.74635Z" fill="url(#paint2_linear_18788_523)"/>
<path d="M1.16689 7.18285C-0.00676892 7.69548 -0.371007 9.13894 0.42492 10.1777C0.640765 10.461 2.27309 12.2147 4.05381 14.0764L7.29148 17.449L7.30497 20.0796C7.30497 21.523 7.35893 22.7911 7.41289 22.8721C7.46685 22.9665 8.3707 23.614 9.39597 24.329C10.9473 25.3813 11.379 25.6106 11.7837 25.6106C12.6876 25.6106 12.7011 25.5162 12.7011 21.2262V17.449L16.0872 13.9415C17.9353 12.0124 19.5811 10.2451 19.716 10.0293C20.1342 9.39526 20.0803 8.34302 19.6216 7.78992C18.9336 6.96701 19.1764 6.99399 9.97605 6.99399C3.29835 7.00748 1.49065 7.04795 1.16689 7.18285ZM18.5019 8.61282C18.7178 8.82867 18.7447 8.95008 18.6368 9.15244C18.5559 9.30083 16.8831 11.095 14.927 13.1456L11.3521 16.8554V20.4303V23.9918L9.93558 23.0474L8.5191 22.1031V19.432V16.7745L4.94417 13.0242C1.2883 9.17942 1.03198 8.82867 1.61207 8.49141C1.76046 8.39698 4.72832 8.35651 10.0435 8.34302C18.0837 8.34302 18.2321 8.34302 18.5019 8.61282Z" fill="url(#paint3_linear_18788_523)"/>
<defs>
<linearGradient id="paint0_linear_18788_523" x1="10.138" y1="5.94177" x2="10.138" y2="4.76837e-05" gradientUnits="userSpaceOnUse">
<stop stop-color="#F77433"/>
<stop offset="1" stop-color="#FEAF38"/>
</linearGradient>
<linearGradient id="paint1_linear_18788_523" x1="3.39281" y1="5.77991" x2="3.39281" y2="0.113984" gradientUnits="userSpaceOnUse">
<stop stop-color="#F77433"/>
<stop offset="1" stop-color="#FEAF38"/>
</linearGradient>
<linearGradient id="paint2_linear_18788_523" x1="16.8113" y1="5.901" x2="16.8113" y2="0.127712" gradientUnits="userSpaceOnUse">
<stop stop-color="#F77433"/>
<stop offset="1" stop-color="#FEAF38"/>
</linearGradient>
<linearGradient id="paint3_linear_18788_523" x1="10" y1="25.6106" x2="10" y2="6.99389" gradientUnits="userSpaceOnUse">
<stop stop-color="#F77433"/>
<stop offset="1" stop-color="#FEAF38"/>
</linearGradient>
</defs>
</svg>
