<svg width="45" height="40" viewBox="0 0 45 40" fill="none" xmlns="http://www.w3.org/2000/svg">
<path fill-rule="evenodd" clip-rule="evenodd" d="M23.2259 0.260755C22.0367 0.840658 21.4949 2.07448 21.9564 3.15141C22.0681 3.41184 22.0914 3.63073 22.0084 3.63774C21.9254 3.64494 21.015 3.6706 19.9851 3.69514C16.7381 3.77192 15.5121 4.79792 15.5121 7.43831C15.5121 8.63078 15.6575 8.97721 16.1585 8.97721C16.538 8.97721 16.5523 9.23136 16.5523 15.9324C16.5523 22.6265 16.5688 22.9178 16.9903 23.6904C17.2905 24.2402 17.681 24.6073 18.2305 24.8559C18.9932 25.2012 19.4969 25.2189 28.5621 25.2189C39.3024 25.2189 39.0819 25.2459 40.0064 23.8155C40.4648 23.106 40.471 23.0016 40.4746 16.0497L40.4779 9.00287L40.946 8.94399C41.3794 8.88936 41.4187 8.77844 41.4748 7.4527C41.5479 5.73311 41.1877 4.90884 40.0813 4.26287C39.4501 3.89429 38.9933 3.81234 37.1491 3.73685C35.4731 3.66838 34.9852 3.59123 35.0534 3.40538C35.1025 3.2723 35.1797 2.83119 35.2253 2.42515C35.3994 0.874434 33.6537 -0.35717 31.9306 0.100921C31.2391 0.284748 30.891 0.573408 29.9092 1.77788C29.2568 2.57797 28.6295 3.23521 28.5151 3.23834C28.4007 3.24148 27.8554 2.66305 27.3032 1.95303C26.7513 1.24319 26.0824 0.535941 25.8169 0.381645C25.0234 -0.0795836 24.02 -0.126279 23.2259 0.260755ZM25.354 1.27162C25.6305 1.50011 26.2 2.11637 26.6194 2.64109L27.3819 3.59529L25.7639 3.66524C23.9842 3.74202 23.3493 3.54435 22.9631 2.7928C22.5379 1.96466 23.3809 0.908394 24.4985 0.868897C24.6924 0.861883 25.0773 1.04313 25.354 1.27162ZM33.7257 1.30945C34.3367 1.85134 34.3941 2.67284 33.862 3.25588C33.5274 3.62242 33.29 3.66727 31.6254 3.67798C30.6014 3.68444 29.7761 3.62685 29.7917 3.54989C29.846 3.28227 31.63 1.19502 31.944 1.03187C32.5086 0.738225 33.2041 0.846564 33.7257 1.30945ZM39.4853 4.99337C40.1773 5.39554 40.4779 6.04576 40.4779 7.14024V8.05439H28.5151H16.5523V7.21462C16.5523 5.78903 17.2553 4.93745 18.5916 4.7444C19.0148 4.68312 23.7737 4.64713 29.1669 4.66429C37.8007 4.69179 39.0342 4.73111 39.4853 4.99337ZM39.4376 15.9076C39.4376 23.4248 39.4096 23.6269 38.2992 24.0756C37.902 24.2361 35.2045 24.2961 28.3805 24.2961H19.0073L18.3 23.6686L17.5926 23.0411V16.0091V8.97721H28.5151H39.4376V15.9076ZM22.2435 12.5794C22.1726 12.7436 22.1971 12.9511 22.298 13.0404C22.3991 13.1299 24.6993 13.2281 27.4095 13.2588L32.3376 13.3145L32.9763 13.8577C33.7789 14.5404 34.0921 15.475 33.8126 16.3539C33.3339 17.86 32.5219 18.2492 29.639 18.3546C28.2935 18.4037 27.3709 18.3668 27.3709 18.2638C27.3709 18.1682 27.6517 17.8513 27.995 17.5595C28.6999 16.9604 28.7804 16.6389 28.2692 16.4647C27.8142 16.3098 25.4957 18.3064 25.5047 18.8457C25.508 19.0519 26.0678 19.7176 26.7486 20.3252C27.9218 21.3721 28.0052 21.413 28.3462 21.1107C28.6872 20.8082 28.6645 20.7539 27.9141 20.0722L27.1222 19.3527L29.5872 19.2839C31.6849 19.2254 32.1763 19.1523 32.8877 18.7928C34.4004 18.0283 35.239 16.4706 34.8868 15.0797C34.6421 14.1142 34.2306 13.5624 33.2692 12.9116L32.5015 12.3917L27.437 12.3363C22.928 12.287 22.3583 12.3138 22.2435 12.5794ZM0.0470582 24.0058C-0.180546 24.532 0.477718 24.6558 3.77216 24.7066C5.59487 24.7346 7.06286 24.8199 7.03415 24.896C7.00544 24.972 6.98213 27.7336 6.98213 31.0327V37.0311H3.5716C0.809555 37.0311 0.139432 37.0811 0.0470582 37.2945C-0.200935 37.8679 0.439229 37.9632 4.19887 37.9122L7.91461 37.8617L8.02217 37.308L8.12994 36.7543L10.6427 36.7028L13.1555 36.6511L17.8185 38.3173C22.8787 40.1255 23.6957 40.2721 25.5704 39.7075C26.5645 39.4079 43.0541 30.2315 44.1778 29.3525C45.8609 28.0356 44.7864 25.5881 42.5251 25.5881C42.0378 25.5881 40.9331 26.1333 36.2649 28.6773C34.2038 29.8008 33.4042 30.3349 33.4042 30.5885C33.4042 30.7849 33.5482 30.9405 33.73 30.9405C33.9092 30.9405 35.9083 29.9438 38.1723 28.7257C40.4365 27.5076 42.4724 26.5109 42.6965 26.5109C43.3175 26.5109 44.0147 27.1907 44.0147 27.796C44.0147 28.1561 43.8295 28.4588 43.4426 28.7312C42.398 29.4667 26.4509 38.3733 25.5207 38.7407C24.0585 39.3186 22.7928 39.1291 19.0489 37.7718C13.3203 35.6949 13.5019 35.7392 10.7176 35.7392H8.23042L8.21919 33.7551C8.19901 30.188 8.1963 26.6098 8.21357 26.2802C8.22897 25.9866 8.5348 25.9572 11.5729 25.9572C13.6807 25.9572 15.0831 26.0353 15.3698 26.1685C15.6197 26.2848 16.4806 26.9302 17.2828 27.6026C18.2344 28.4003 19.0383 28.9043 19.5955 29.0524C20.1618 29.203 22.0315 29.2794 25.1468 29.2794C29.789 29.2794 29.851 29.2845 30.4175 29.7168C31.1586 30.2823 31.2102 31.3076 30.528 31.9135C30.0946 32.2987 29.8379 32.3306 26.4814 32.417C23.0711 32.5048 22.8978 32.5272 22.8978 32.8784C22.8978 33.2287 23.057 33.2503 26.0185 33.3022C29.6935 33.3664 30.2727 33.2948 31.1057 32.673C32.3463 31.7468 32.3455 30.0481 31.1039 28.992L30.4654 28.4488L25.1121 28.3566L19.759 28.2643L18.9357 27.6807C18.483 27.3597 17.785 26.792 17.3845 26.4192C16.0836 25.2079 15.7938 25.1364 11.7672 25.0344L8.1264 24.9421L8.06128 24.3423L7.99595 23.7424H4.07862C0.877379 23.7424 0.140264 23.7906 0.0470582 24.0058ZM18.9337 32.6176C18.6563 33.0159 19.2626 33.2246 20.5573 33.1765C20.9827 33.1608 21.1294 33.0606 21.1294 32.7861C21.1294 32.4668 20.9906 32.417 20.1014 32.417C19.536 32.417 19.0106 32.5072 18.9337 32.6176ZM4.49887 35.2635C4.17598 35.6087 4.38091 35.9237 4.92849 35.9237C5.23952 35.9237 5.32961 35.8209 5.2803 35.5228C5.19708 35.0221 4.83674 34.9023 4.49887 35.2635Z" fill="black"/>
</svg>
