<svg width="22" height="23" viewBox="0 0 22 23" fill="none" xmlns="http://www.w3.org/2000/svg">
<path fill-rule="evenodd" clip-rule="evenodd" d="M0.885746 0.20754C0.616396 0.53191 0.775836 0.847691 1.60132 1.62406C3.76557 3.65971 6.46036 5.00125 9.21414 5.41383C9.5845 5.46931 9.65119 5.51023 9.59915 5.65039C9.56465 5.74356 9.51447 5.98749 9.48767 6.19242L9.43907 6.56499L8.49254 6.50659C6.85725 6.40574 5.76455 6.84369 4.68316 8.03365C3.1613 9.70825 2.8273 11.9579 3.7767 14.1392C3.98428 14.6161 4.6097 15.352 7.50641 18.5269C9.82621 21.0695 11.0501 22.3415 11.1767 22.3415C11.3031 22.3415 12.5191 21.0819 14.8108 18.5774C18.5067 14.5382 18.6382 14.361 18.9699 12.9739C19.3915 11.2103 18.8329 9.18582 17.5694 7.89804C16.5195 6.82813 15.3433 6.39705 13.7793 6.50891L12.9172 6.57065L12.8682 6.19525C12.8413 5.98881 12.7909 5.74356 12.7564 5.65039C12.7044 5.51023 12.7711 5.46931 13.1414 5.41383C15.9304 4.99599 18.5725 3.67325 20.8007 1.57939C21.5795 0.847489 21.7355 0.527464 21.4698 0.20754C21.2139 -0.10046 20.9843 -0.0319481 20.4329 0.517056C18.6246 2.31766 16.5445 3.51581 14.1548 4.13343C13.2136 4.37666 12.9591 4.39939 11.1778 4.39939C9.39649 4.39939 9.14198 4.37666 8.20075 4.13343C5.81101 3.51581 3.73098 2.31766 1.92261 0.517056C1.3713 -0.0319481 1.14165 -0.10046 0.885746 0.20754ZM11.6951 5.96364C12.0253 6.32358 12.0419 6.67261 11.7463 7.047C11.3037 7.60762 10.3894 7.24829 10.3894 6.51376C10.3894 6.17282 10.8598 5.66828 11.1778 5.66828C11.3262 5.66828 11.5316 5.78559 11.6951 5.96364ZM9.42367 7.78487C9.7201 7.89845 10.2048 8.19614 10.5008 8.44654C10.7968 8.69694 11.1014 8.90187 11.1778 8.90187C11.2542 8.90187 11.5567 8.70008 11.8501 8.45351C13.5058 7.06175 15.6537 7.23212 17.0735 8.86772C17.8864 9.80415 18.2375 11.032 18.0713 12.3563C17.9085 13.6531 17.8086 13.7931 14.3511 17.5676L11.1801 21.0293L8.04492 17.6181C5.40495 14.7458 4.86681 14.1112 4.63771 13.6007C3.91518 11.9904 4.17136 10.1472 5.29791 8.84943C6.36678 7.61824 7.93297 7.21414 9.42367 7.78487ZM7.03913 8.35701C5.67588 8.87166 4.73371 10.4421 4.84909 12.0072C4.94138 13.26 5.14794 13.5593 8.23228 16.9101C9.93844 18.7636 11.0678 19.9163 11.1778 19.9163C11.2878 19.9163 12.4171 18.7636 14.1233 16.9101C17.3796 13.3724 17.4849 13.2103 17.4849 11.7313C17.4849 10.9597 17.4525 10.7966 17.18 10.1935C16.8424 9.44623 16.3004 8.85842 15.6035 8.48353C15.2393 8.28759 15.0186 8.24788 14.2849 8.24666C13.5087 8.24525 13.3417 8.27829 12.8817 8.52435C12.5946 8.67805 12.094 9.06982 11.7694 9.3951L11.1793 9.98644L10.586 9.39429C9.74459 8.55426 9.15989 8.26566 8.21976 8.22645C7.70453 8.20503 7.33278 8.24606 7.03913 8.35701ZM9.10776 9.51666C9.32804 9.63853 9.84504 10.0958 10.2566 10.5327C10.6682 10.9696 11.0827 11.3271 11.1778 11.3271C11.2728 11.3271 11.6874 10.9696 12.099 10.5327C13.2402 9.32123 13.9016 9.03991 14.8799 9.34972C15.5015 9.54657 16.046 10.0412 16.3201 10.658C16.5534 11.1831 16.5761 12.174 16.3673 12.7197C16.2729 12.9665 15.3583 14.0407 13.7021 15.85L11.1807 18.6044L8.69604 15.9005C7.14607 14.2137 6.14241 13.042 6.02805 12.7856C5.77456 12.218 5.77929 11.2347 6.03825 10.6519C6.58502 9.42137 7.9941 8.90015 9.10776 9.51666ZM7.29114 10.1413C6.84204 10.4214 6.72739 10.614 6.80623 10.9562C6.87728 11.2646 7.27082 11.4248 7.5053 11.2407C7.77576 11.0283 8.09306 10.917 8.26196 10.9754C8.35369 11.0071 8.70847 11.329 9.05044 11.6907C9.58051 12.2515 9.71454 12.3438 9.95959 12.3177C10.1778 12.2944 10.2685 12.2196 10.3368 12.0067C10.4207 11.7453 10.3802 11.6749 9.73559 10.9602C9.3555 10.5387 8.9102 10.1304 8.74603 10.0531C8.30342 9.84436 7.70981 9.88044 7.29114 10.1413ZM13.5814 10.056C13.2176 10.2286 12.8865 10.68 12.9596 10.9041C13.116 11.3833 13.3895 11.4468 13.8784 11.1177C14.3923 10.7716 14.9342 11.0829 14.9342 11.7242C14.9342 12.0451 14.8489 12.1824 14.2386 12.8428C13.5323 13.6072 13.3892 13.9486 13.6542 14.2373C13.9214 14.5284 14.2321 14.3705 14.9557 13.5754C15.6858 12.7733 15.9545 12.2771 15.9545 11.7313C15.9545 11.3692 15.7369 10.7593 15.5104 10.4863C15.0793 9.96694 14.1883 9.76817 13.5814 10.056ZM8.55292 14.0756C8.25009 14.4056 8.41732 14.6954 9.72437 16.1063C10.4299 16.8679 11.0769 17.4911 11.162 17.4911C11.3619 17.4911 11.6879 17.1359 11.6879 16.9182C11.6879 16.8254 11.1159 16.1206 10.4168 15.3519C9.12176 13.9279 8.85575 13.7457 8.55292 14.0756ZM12.6762 14.5434C12.4966 14.7595 12.4748 15.1755 12.634 15.3489C12.8003 15.53 13.2151 15.4952 13.3894 15.2853C13.569 15.0691 13.5908 14.6532 13.4316 14.4798C13.2653 14.2986 12.8505 14.3335 12.6762 14.5434Z" fill="url(#paint0_linear_2097_1291)"/>
<defs>
<linearGradient id="paint0_linear_2097_1291" x1="11.1775" y1="0.0251465" x2="11.1775" y2="22.3415" gradientUnits="userSpaceOnUse">
<stop stop-color="#FD9149"/>
<stop offset="0.9999" stop-color="#FFD588"/>
<stop offset="1" stop-color="#FD9149" stop-opacity="0"/>
</linearGradient>
</defs>
</svg>
