<svg width="22" height="26" viewBox="0 0 22 26" fill="none" xmlns="http://www.w3.org/2000/svg">
<path fill-rule="evenodd" clip-rule="evenodd" d="M10.2704 0.30146C10.0139 0.574242 9.99477 0.684979 9.96026 2.09761L9.9235 3.60293L10.9472 3.63935L11.971 3.67577L11.9707 2.12016C11.9704 0.618898 11.9607 0.554733 11.6936 0.287702C11.3047 -0.101343 10.6433 -0.094915 10.2704 0.30146ZM3.38755 2.99918C3.02861 3.19415 2.798 3.70904 2.89543 4.09741C2.93501 4.25539 3.4693 4.87764 4.08264 5.48027L5.1979 6.57591L5.89469 5.87912L6.59136 5.18245L5.96945 4.54182C5.62743 4.18954 5.20117 3.73126 5.02232 3.52343C4.45251 2.86171 3.94191 2.69786 3.38755 2.99918ZM16.8919 3.59898C16.449 4.02197 15.9211 4.51724 15.7189 4.6997L15.3515 5.03145L16.0606 5.79488L16.7697 6.55831L17.9223 5.38712C18.9029 4.39049 19.0747 4.1618 19.0747 3.85259C19.0747 3.35777 18.5492 2.83003 18.0565 2.83003C17.7669 2.83003 17.5419 2.97865 16.8919 3.59898ZM10.4481 4.37053C7.49248 4.72473 5.35792 6.45322 4.41293 9.25772C4.22912 9.80306 4.16507 10.265 4.16248 11.062C4.15616 13.0772 4.70432 14.4538 6.12326 15.9854C6.6209 16.5225 7.07445 17.084 7.13117 17.2331C7.18778 17.3823 7.23458 17.7928 7.23492 18.1454C7.23604 19.3242 7.62768 20.1175 8.35773 20.4198L8.69637 20.5601L8.47276 20.8444C8.19197 21.2013 8.18655 21.6725 8.45922 22.0093C8.66401 22.2622 8.66401 22.2741 8.45922 22.494C8.12713 22.8504 8.18701 23.3939 8.59612 23.7382C8.78692 23.8988 8.97874 24.0301 9.02238 24.0301C9.06613 24.0301 9.15962 24.1833 9.23032 24.3704C9.41131 24.8502 9.95 25.0452 11.0929 25.0446C12.1302 25.0441 12.657 24.8305 12.892 24.3145C12.9621 24.1605 13.112 24.0051 13.2251 23.9693C13.5136 23.8777 13.8875 23.3711 13.8875 23.0716C13.8875 22.9333 13.7784 22.6815 13.645 22.512C13.499 22.3264 13.4475 22.1745 13.5153 22.1303C13.6847 22.0199 13.8875 21.5928 13.8875 21.3464C13.8875 21.2267 13.7887 21.003 13.6679 20.8496L13.4484 20.5705L13.833 20.387C14.4719 20.0823 14.754 19.5083 14.8409 18.3354C14.9241 17.211 14.8796 17.3014 15.9612 16.0657C16.8634 15.0351 17.3963 13.9856 17.6551 12.73C18.3153 9.52757 17.0031 6.70649 14.113 5.11445C13.2255 4.62561 11.4043 4.25585 10.4481 4.37053ZM12.1349 6.2729C13.624 6.66082 15.0651 7.81115 15.6429 9.07346C16.2088 10.3094 16.1905 12.215 15.6007 13.4754C15.4141 13.8742 14.9443 14.5384 14.5112 15.0156C13.282 16.3699 13.1914 16.5464 13.0486 17.8618L12.9237 19.012L11.0807 19.043C9.91639 19.0627 9.18521 19.0306 9.09534 18.9561C9.00885 18.8843 8.93375 18.4525 8.90364 17.8537C8.84376 16.6646 8.69851 16.3516 7.72669 15.3176C6.81802 14.3506 6.51907 13.8892 6.22126 12.9939C5.55966 11.0046 6.21821 8.54447 7.74169 7.31419C9.02746 6.27583 10.6603 5.88882 12.1349 6.2729ZM0.36416 10.1135C-0.0924315 10.4977 -0.124006 11.1566 0.29402 11.5745C0.562517 11.8431 0.619915 11.8514 2.21105 11.8514H3.85124V10.8365V9.82155H2.28119C0.756588 9.82155 0.700994 9.83001 0.36416 10.1135ZM18.2123 10.4136C18.2514 10.7392 18.2839 11.196 18.2844 11.4285L18.2854 11.8514H19.6218C21.097 11.8514 21.5659 11.7426 21.8301 11.3394C22.1 10.9273 22.0478 10.5219 21.677 10.1512L21.3474 9.82155H19.7443H18.1411L18.2123 10.4136ZM3.87695 16.3926C3.01463 17.2594 2.94911 17.3582 2.94911 17.7921C2.94911 18.1751 3.01147 18.3115 3.29609 18.5509C3.90221 19.061 4.3111 18.9136 5.42276 17.784L6.14852 17.0465L5.69441 16.5069C5.44463 16.2101 5.16926 15.8532 5.08243 15.7136C4.99571 15.574 4.89772 15.4599 4.86468 15.4599C4.83175 15.4599 4.38722 15.8796 3.87695 16.3926ZM16.5939 16.0979C16.3148 16.4484 16.0364 16.8026 15.9752 16.8851C15.8928 16.9966 16.0528 17.2271 16.5954 17.7784C17.4541 18.6507 17.8523 18.8908 18.2694 18.7873C18.7853 18.6593 19.0747 18.2944 19.0747 17.7719C19.0747 17.334 19.0144 17.2453 18.13 16.382C17.6103 15.8749 17.1664 15.4601 17.1433 15.4603C17.1201 15.4606 16.873 15.7474 16.5939 16.0979Z" fill="#FF5500"/>
</svg>
