<svg width="16" height="15" viewBox="0 0 16 15" fill="none" xmlns="http://www.w3.org/2000/svg">
<path fill-rule="evenodd" clip-rule="evenodd" d="M1.07389 0.0458484C0.793948 0.113573 0.541756 0.262006 0.354529 0.469218C-0.0288706 0.893661 0.000519352 0.30862 0.000519352 7.51193C0.000519352 13.5948 0.00588621 13.9891 0.0911428 14.1705C0.223781 14.4528 0.506488 14.7434 0.781476 14.8801L1.02278 15H7.48858C13.5715 15 13.9658 14.9946 14.1472 14.9094C14.4295 14.7767 14.72 14.494 14.8567 14.219L14.9766 13.9777L14.991 10.0804C14.9988 7.93684 14.9871 6.18299 14.9649 6.18299C14.9427 6.18299 14.4822 6.62574 13.9416 7.16692L12.9587 8.15085L12.9454 10.5532L12.9321 12.9555H7.48858H2.04504V7.51193V2.06839L4.44736 2.0551L6.84967 2.04181L7.8336 1.05891C8.37478 0.518286 8.81752 0.0584734 8.81752 0.0371592C8.81752 -0.0123693 1.27947 -0.00383346 1.07389 0.0458484ZM11.7915 0.474483L11.319 0.948914L11.7555 1.24542C12.5163 1.76223 13.2743 2.51798 13.7954 3.27941L14.0645 3.67258L14.5334 3.20172L15.0023 2.73087L14.9483 2.30009C14.7642 0.832019 14.0849 0.189732 12.5469 0.0294922L12.264 0L11.7915 0.474483ZM7.51634 4.74938C5.85895 6.40707 4.51339 7.77179 4.52622 7.78202C4.53905 7.79224 4.7132 7.90786 4.91315 8.03891C5.6753 8.53839 6.46433 9.33028 7.02857 10.1618L7.24861 10.4862L10.2569 7.4784C12.2953 5.44047 13.2561 4.44597 13.2371 4.39404C13.2216 4.35187 13.1033 4.14149 12.9741 3.92651C12.5279 3.18394 11.8166 2.47259 11.074 2.02638C10.859 1.89721 10.6486 1.77889 10.6065 1.7634C10.5546 1.74439 9.55825 2.7071 7.51634 4.74938ZM3.56244 8.70323L3.39954 8.87129V10.2362V11.601H4.76436H6.12923L6.29504 11.4403L6.46085 11.2795L6.35403 11.0697C5.88338 10.1451 4.99611 9.24615 4.00968 8.69428L3.72528 8.53522L3.56244 8.70323Z" fill="#FFD588"/>
</svg>
