<svg width="82" height="18" viewBox="0 0 82 18" fill="none" xmlns="http://www.w3.org/2000/svg">
<path d="M7.48 14.32L4.5 9.86C4.36667 9.62 4.21333 9.43333 4.04 9.3C3.88 9.15333 3.7 9.04667 3.5 8.98C3.31333 8.91333 3.08667 8.88 2.82 8.88H0V6.82H3.82C4.64667 6.82 5.26667 6.65333 5.68 6.32C6.10667 5.97333 6.39333 5.5 6.54 4.9L6.92 5.1H0V3.4H6.92L6.5 3.68C6.39333 3.12 6.13333 2.69333 5.72 2.4C5.30667 2.09333 4.7 1.94 3.9 1.94H0V0.22H11.18V1.94H7.94L8.24 1.64C8.61333 1.86667 8.9 2.16667 9.1 2.54C9.31333 2.91333 9.44667 3.34 9.5 3.82L8.96 3.4H11.18V5.1H9.02L9.54 4.56C9.54 5.41333 9.34 6.15333 8.94 6.78C8.54 7.40667 7.98 7.89333 7.26 8.24C6.55333 8.57333 5.70667 8.74 4.72 8.74V8.52H5.42C6.07333 8.52 6.62667 8.64 7.08 8.88C7.53333 9.10667 7.94667 9.50667 8.32 10.08L11.24 14.32H7.48Z" fill="#AA6F01"/>
<path d="M22.9167 14.54C21.9301 14.54 20.9767 14.4 20.0567 14.12C19.1501 13.84 18.4167 13.4533 17.8567 12.96L18.8367 10.64C19.4367 11.08 20.0701 11.4133 20.7367 11.64C21.4034 11.8533 22.0901 11.96 22.7967 11.96C23.6234 11.96 24.2434 11.8067 24.6567 11.5C25.0701 11.1933 25.2767 10.74 25.2767 10.14C25.2767 9.58 25.0767 9.16 24.6767 8.88C24.2901 8.58667 23.7101 8.44 22.9367 8.44H20.5767V5.98H22.6567C23.3234 5.98 23.8567 5.82667 24.2567 5.52C24.6567 5.2 24.8567 4.76667 24.8567 4.22C24.8567 3.68667 24.6701 3.28 24.2967 3C23.9234 2.72 23.3834 2.58 22.6767 2.58C21.3301 2.58 20.1301 3.02667 19.0767 3.92L18.0767 1.64C18.6767 1.12 19.4034 0.72 20.2567 0.440001C21.1234 0.146667 22.0301 0 22.9767 0C24.4967 0 25.6834 0.34 26.5367 1.02C27.4034 1.68667 27.8367 2.62 27.8367 3.82C27.8367 4.64667 27.6034 5.36 27.1367 5.96C26.6701 6.54667 26.0301 6.94 25.2167 7.14V6.88C26.1767 7.04 26.9234 7.43333 27.4567 8.06C27.9901 8.68667 28.2567 9.47333 28.2567 10.42C28.2567 11.7 27.7767 12.7067 26.8167 13.44C25.8701 14.1733 24.5701 14.54 22.9167 14.54Z" fill="#AA6F01"/>
<path d="M35.9689 14.32V11.74H29.9289V9.58L36.4489 0.22H38.9689V9.4H40.8889V11.74H38.9689V14.32H35.9689ZM35.9689 9.4V3.9H36.4689L32.1689 10.12V9.4H35.9689Z" fill="#AA6F01"/>
<path d="M43.6211 17.2L42.4411 16.26C42.9078 15.7933 43.2411 15.3533 43.4411 14.94C43.6411 14.5267 43.7411 14.08 43.7411 13.6L44.3811 14.32H42.1811V11.12H45.4211V13.18C45.4211 13.94 45.2878 14.6333 45.0211 15.26C44.7544 15.8867 44.2878 16.5333 43.6211 17.2Z" fill="#AA6F01"/>
<path d="M51.2564 14.54C50.4831 14.54 49.7231 14.4067 48.9764 14.14C48.2297 13.86 47.5764 13.48 47.0164 13L48.0164 10.7C48.5097 11.1133 49.0297 11.4267 49.5764 11.64C50.1364 11.8533 50.7031 11.96 51.2764 11.96C52.3831 11.96 53.2231 11.6 53.7964 10.88C54.3697 10.1467 54.6564 9.07333 54.6564 7.66V6.36H54.9164C54.8231 6.98667 54.6031 7.52667 54.2564 7.98C53.9097 8.43333 53.4764 8.78 52.9564 9.02C52.4497 9.26 51.8831 9.38 51.2564 9.38C50.4564 9.38 49.7364 9.18667 49.0964 8.8C48.4697 8.4 47.9697 7.85333 47.5964 7.16C47.2364 6.46667 47.0564 5.68667 47.0564 4.82C47.0564 3.88667 47.2631 3.06 47.6764 2.34C48.0897 1.60667 48.6564 1.03333 49.3764 0.619999C50.0964 0.206667 50.9297 0 51.8764 0C53.7031 0 55.1097 0.62 56.0964 1.86C57.0831 3.08667 57.5764 4.82667 57.5764 7.08C57.5764 8.65333 57.3231 10 56.8164 11.12C56.3231 12.2267 55.6031 13.0733 54.6564 13.66C53.7097 14.2467 52.5764 14.54 51.2564 14.54ZM52.0564 6.96C52.4697 6.96 52.8364 6.86667 53.1564 6.68C53.4764 6.49333 53.7231 6.22667 53.8964 5.88C54.0831 5.53333 54.1764 5.14 54.1764 4.7C54.1764 4.23333 54.0831 3.83333 53.8964 3.5C53.7231 3.15333 53.4764 2.88667 53.1564 2.7C52.8364 2.5 52.4697 2.4 52.0564 2.4C51.6297 2.4 51.2564 2.5 50.9364 2.7C50.6164 2.88667 50.3697 3.15333 50.1964 3.5C50.0231 3.83333 49.9364 4.23333 49.9364 4.7C49.9364 5.14 50.0231 5.53333 50.1964 5.88C50.3697 6.22667 50.6164 6.49333 50.9364 6.68C51.2564 6.86667 51.6297 6.96 52.0564 6.96Z" fill="#AA6F01"/>
<path d="M65.1486 14.32V11.74H59.1086V9.58L65.6286 0.22H68.1486V9.4H70.0686V11.74H68.1486V14.32H65.1486ZM65.1486 9.4V3.9H65.6486L61.3486 10.12V9.4H65.1486Z" fill="#AA6F01"/>
<path d="M76.3808 14.54C74.7008 14.54 73.3808 14.18 72.4208 13.46C71.4741 12.74 71.0008 11.7467 71.0008 10.48C71.0008 9.48 71.3008 8.65333 71.9008 8C72.5008 7.34667 73.2741 6.96 74.2208 6.84V7.36C73.3674 7.17333 72.6741 6.76667 72.1408 6.14C71.6208 5.5 71.3608 4.73333 71.3608 3.84C71.3608 2.64 71.8074 1.7 72.7008 1.02C73.6075 0.34 74.8341 0 76.3808 0C77.9408 0 79.1674 0.34 80.0608 1.02C80.9541 1.7 81.4008 2.64 81.4008 3.84C81.4008 4.74667 81.1475 5.52 80.6408 6.16C80.1475 6.8 79.4874 7.18667 78.6608 7.32V6.84C79.5808 6.97333 80.3275 7.36667 80.9008 8.02C81.4875 8.67333 81.7808 9.49333 81.7808 10.48C81.7808 11.7467 81.3008 12.74 80.3408 13.46C79.3941 14.18 78.0741 14.54 76.3808 14.54ZM76.3808 12.16C77.2341 12.16 77.8675 12 78.2808 11.68C78.7075 11.36 78.9208 10.8867 78.9208 10.26C78.9208 9.63333 78.7075 9.16667 78.2808 8.86C77.8675 8.54 77.2341 8.38 76.3808 8.38C75.5408 8.38 74.9074 8.54 74.4808 8.86C74.0541 9.16667 73.8408 9.63333 73.8408 10.26C73.8408 10.8867 74.0541 11.36 74.4808 11.68C74.9074 12 75.5408 12.16 76.3808 12.16ZM76.3808 6C77.0874 6 77.6274 5.84 78.0008 5.52C78.3741 5.18667 78.5608 4.74 78.5608 4.18C78.5608 3.62 78.3741 3.18 78.0008 2.86C77.6274 2.54 77.0874 2.38 76.3808 2.38C75.6874 2.38 75.1541 2.54 74.7808 2.86C74.4074 3.18 74.2208 3.62 74.2208 4.18C74.2208 4.74 74.4074 5.18667 74.7808 5.52C75.1541 5.84 75.6874 6 76.3808 6Z" fill="#AA6F01"/>
</svg>
