<svg width="18" height="18" viewBox="0 0 18 18" fill="none" xmlns="http://www.w3.org/2000/svg">
<circle cx="9" cy="9" r="9" fill="url(#paint0_linear_11558_10)"/>
<path fill-rule="evenodd" clip-rule="evenodd" d="M9.28545 12.904C9.4118 12.8666 9.86842 12.4383 11.1743 11.1325C13.0329 9.27387 13.0547 9.24611 12.9778 8.8363C12.9403 8.63653 12.4919 8.12412 12.2848 8.04428C12.1205 7.98096 11.7924 7.98629 11.6583 8.05442C11.597 8.08556 10.9738 8.68171 10.2733 9.37923L8.9998 10.6474L7.72626 9.37923C7.0258 8.68171 6.4026 8.08556 6.34133 8.05442C6.18741 7.97625 5.84824 7.98353 5.68376 8.06861C5.44514 8.19201 5.05851 8.64077 5.02166 8.83711C4.94558 9.24269 4.97529 9.28092 6.75438 11.0671C7.66204 11.9783 8.47153 12.7657 8.55323 12.8167C8.73586 12.9309 9.06297 12.9699 9.28545 12.904Z" fill="white"/>
<defs>
<linearGradient id="paint0_linear_11558_10" x1="9" y1="0" x2="9" y2="18" gradientUnits="userSpaceOnUse">
<stop stop-color="#FD9149"/>
<stop offset="1" stop-color="#FFD588"/>
</linearGradient>
</defs>
</svg>
