<svg width="575" height="575" viewBox="0 0 575 575" fill="none" xmlns="http://www.w3.org/2000/svg">
<path d="M0.5 10C0.5 4.75331 4.7533 0.5 10 0.5H565C570.247 0.5 574.5 4.7533 574.5 10V232.19V273.81V574.5H385.947C382.771 574.5 379.805 572.913 378.043 570.27L360.98 544.676C359.033 541.755 355.754 540 352.243 540H248.242C244.562 540 241.151 541.926 239.251 545.077L224.274 569.907C222.555 572.757 219.468 574.5 216.139 574.5H0.5V10Z" stroke="#EFEFEF"/>
</svg>
