<svg width="20" height="22" viewBox="0 0 20 22" fill="none" xmlns="http://www.w3.org/2000/svg">
<path fill-rule="evenodd" clip-rule="evenodd" d="M2.28303 0.0290021C1.25831 0.164352 0.410176 0.880585 0.0943745 1.8773L0 2.17515V10.5786V18.9821L0.0943745 19.28C0.355925 20.1054 0.995697 20.7539 1.8263 21.0356L2.17002 21.1522L7.73334 21.1642C10.7932 21.1707 13.2962 21.1612 13.2957 21.1429C13.2953 21.1246 13.1905 21.0348 13.0629 20.9435C12.7772 20.7388 12.3214 20.2912 12.0946 19.9927L11.9249 19.7693H7.15076C1.81877 19.7693 2.15725 19.7884 1.79184 19.4667C1.68504 19.3727 1.5476 19.1907 1.48097 19.0551L1.36158 18.8119V10.5786V2.34535L1.48097 2.10222C1.5476 1.96657 1.68504 1.78455 1.79184 1.69055C2.1607 1.36586 1.6827 1.38786 8.33661 1.38892C14.2364 1.38986 14.2985 1.39071 14.4881 1.47636C14.7357 1.58822 14.9769 1.82271 15.1193 2.09005L15.2327 2.3028L15.244 7.30234L15.2553 12.3019H15.9362H16.6172L16.6057 7.19597L16.5942 2.09005L16.4781 1.77191C16.2474 1.13963 15.7588 0.580995 15.1901 0.299361C14.5558 -0.0148663 15.09 0.00896137 8.48859 0.000749352C5.224 -0.00329284 2.43148 0.00942942 2.28303 0.0290021ZM3.61542 2.80143C3.60338 2.83279 3.59874 3.23127 3.60512 3.68688L3.61669 4.51536H3.78689H3.95709V3.6431V2.77084L3.79719 2.75761C3.69273 2.74897 3.62971 2.76416 3.61542 2.80143ZM4.33774 2.80399C4.32625 2.83394 4.32208 3.23127 4.32846 3.68688L4.34003 4.51536H4.51023H4.68043V3.8918C4.68043 3.54885 4.69481 3.27713 4.71234 3.28798C4.72987 3.29883 4.74425 3.32926 4.74425 3.35555C4.74425 3.38185 4.87943 3.64872 5.04469 3.94856C5.35479 4.51132 5.40802 4.56293 5.64408 4.52953L5.74416 4.51536V3.6431V2.77084H5.59524H5.44632L5.42321 3.36653C5.41049 3.69416 5.39615 3.93303 5.3913 3.89742C5.3793 3.80921 4.82901 2.82122 4.77008 2.78211C4.68941 2.72859 4.36029 2.74522 4.33774 2.80399ZM6.00469 2.78365C5.98031 2.82309 6.48078 4.40371 6.54285 4.48345C6.56566 4.51272 6.66578 4.53664 6.76535 4.53664C6.86491 4.53664 6.96533 4.51272 6.98843 4.48345C7.03613 4.42316 7.55251 2.88449 7.55251 2.80271C7.55251 2.73186 7.23688 2.73225 7.17803 2.80322C7.15352 2.83271 7.0634 3.10553 6.97771 3.40955C6.79249 4.06651 6.78045 4.10246 6.76407 4.04732C6.75713 4.02392 6.68016 3.74628 6.59298 3.43035C6.50584 3.11443 6.41563 2.83203 6.39261 2.80275C6.34657 2.74433 6.03839 2.72914 6.00469 2.78365ZM8.16866 2.80888C7.99945 2.88262 7.78725 3.12842 7.7219 3.32649C7.63969 3.57549 7.69016 3.99396 7.82738 4.20131C8.15194 4.69173 8.99195 4.6322 9.24933 4.10051C9.4183 3.75147 9.34213 3.16885 9.09939 2.95329C8.88358 2.76165 8.4363 2.69225 8.16866 2.80888ZM9.64789 2.79867C9.60934 2.83722 9.59488 3.06881 9.59488 3.64642C9.59488 4.52617 9.603 4.5534 9.85804 4.52889L9.99909 4.51536V3.6431V2.77084L9.85 2.75824C9.76797 2.75135 9.67704 2.76952 9.64789 2.79867ZM10.8071 2.82666C10.0821 3.16557 10.1121 4.25049 10.8532 4.49511C11.0292 4.55319 11.5294 4.53383 11.597 4.4663C11.6218 4.44141 11.6293 4.37099 11.6137 4.30878C11.5867 4.20118 11.573 4.19624 11.3017 4.19624C10.9865 4.19624 10.8678 4.13969 10.7647 3.94048C10.6278 3.67557 10.7287 3.25441 10.9587 3.13132C11.0628 3.07558 11.3567 3.06226 11.4966 3.10694C11.5783 3.13302 11.5937 3.11749 11.6187 2.98371C11.6345 2.89955 11.6343 2.81752 11.6182 2.80143C11.6021 2.78535 11.4514 2.76654 11.2834 2.75956C11.0535 2.75008 10.9355 2.76671 10.8071 2.82666ZM11.912 2.80271C11.9003 2.83334 11.8959 3.23127 11.9022 3.68688L11.9138 4.51536L12.3819 4.52774C12.9967 4.544 13.0503 4.52974 13.0333 4.35436L13.0201 4.21752L12.6691 4.20518L12.318 4.1928V3.98179V3.77075H12.6372H12.9563V3.62183V3.4729H12.6372H12.318V3.28143V3.08996H12.661H13.004L12.9907 2.9304L12.9775 2.77084L12.4555 2.75888C12.0556 2.74973 11.9284 2.75999 11.912 2.80271ZM8.76942 3.19208C8.91668 3.33934 8.93987 3.43078 8.916 3.77075C8.89707 4.04111 8.71598 4.23879 8.48727 4.23879C8.44192 4.23879 8.34231 4.18292 8.26589 4.11463C8.13046 3.99362 8.12692 3.98162 8.12692 3.6431C8.12692 3.30458 8.13046 3.29258 8.26589 3.17157C8.4509 3.00626 8.58922 3.01188 8.76942 3.19208ZM2.74443 6.19636V6.53705L5.64843 6.52612L8.55242 6.51518L8.56484 6.18542L8.57727 5.85567H5.66085H2.74443V6.19636ZM2.74443 7.55794V7.89863L5.64843 7.8877L8.55242 7.87676L8.56484 7.547L8.57727 7.21725H5.66085H2.74443V7.55794ZM2.74443 12.6423V16.1952H6.96779H11.1912L11.2972 15.8228L11.4032 15.4505L11.4145 12.6104L11.4257 9.77021H12.2974H13.169V11.4296C13.169 12.7294 13.1806 13.0888 13.2222 13.0879C13.2515 13.0872 13.4094 13.0043 13.5732 12.9037L13.8711 12.7206L13.8822 10.905L13.8933 9.08942H8.31886H2.74443V12.6423ZM8.2333 12.6423V15.5144H5.82926H3.42522V12.6423V9.77021H5.82926H8.2333V12.6423ZM10.7012 12.6423V15.5144H9.8289H8.95664V12.6423V9.77021H9.8289H10.7012V12.6423ZM15.2752 13.0731C15.2284 13.0849 15.0783 13.1221 14.9417 13.1557C14.1229 13.3573 13.3286 13.856 12.8028 14.4988C12.0992 15.3587 11.7625 16.4746 11.8896 17.5248C12.0226 18.6237 12.5496 19.5825 13.3907 20.2557C14.9411 21.4964 17.1849 21.4326 18.6764 20.1053C19.207 19.6331 19.704 18.8035 19.8973 18.0673C20.033 17.5507 20.0344 16.6714 19.9004 16.1366C19.5428 14.7095 18.4699 13.5979 17.041 13.174C16.7827 13.0974 16.5921 13.0767 16.0411 13.0655C15.6667 13.0578 15.322 13.0612 15.2752 13.0731ZM16.267 14.0688C16.5093 14.2165 16.5304 14.3288 16.5304 15.4705V16.493L17.5622 16.4931C18.6971 16.4931 18.7897 16.5108 18.974 16.762C19.0942 16.9259 19.0942 17.2514 18.974 17.4153C18.7897 17.6666 18.6971 17.6843 17.5622 17.6843L16.5304 17.6844L16.5302 18.7375C16.5301 19.7069 16.5235 19.8014 16.447 19.9268C16.2159 20.3059 15.598 20.2809 15.4101 19.8849C15.3498 19.7579 15.339 19.5796 15.339 18.7118V17.6885L14.2571 17.6758C13.0212 17.6613 13.0072 17.6574 12.8538 17.2891C12.7757 17.1016 12.7754 17.0864 12.8464 16.9004C12.89 16.7864 12.9758 16.6673 13.0553 16.6106C13.1857 16.5176 13.2271 16.5139 14.2647 16.5016L15.339 16.4889V15.4585C15.339 14.3192 15.3551 14.2386 15.6156 14.0672C15.7853 13.9555 16.0825 13.9563 16.267 14.0688ZM5.38249 18.0673V18.4077H8.29712H11.2118V18.0673V17.7269H8.29712H5.38249V18.0673Z" fill="#FFD588"/>
</svg>
