<svg width="25" height="30" viewBox="0 0 25 30" fill="none" xmlns="http://www.w3.org/2000/svg">
<path d="M6.18306 1.78911L0 3.57831L0.0851996 11.794C0.170399 20.813 0.146056 20.5817 0.949367 22.1518C2.4221 25.0973 6.07351 27.6776 11.149 29.3694L12.4513 29.8076L13.3277 29.552C16.8695 28.4931 20.1071 26.6796 22.1884 24.5861C23.4421 23.3324 24.075 22.3587 24.5497 20.9469C24.8174 20.1435 24.8296 19.9975 24.9148 11.8427L25 3.55396L18.7561 1.77694C15.3116 0.791061 12.4757 -0.012249 12.4391 -7.62939e-05C12.4026 0.0120945 9.59104 0.815405 6.18306 1.78911ZM14.9951 6.56029C16.906 7.20538 18.4396 8.33731 19.5716 9.91959C20.2897 10.9298 20.7035 11.8792 20.9713 13.1937C21.3973 15.2263 21.1904 16.8086 20.2653 18.7195C19.815 19.6689 19.5472 20.034 18.6709 20.9225C17.5024 22.091 16.5166 22.7117 15.0195 23.2107C14.204 23.4907 13.8754 23.5272 12.4391 23.5272C10.9542 23.5272 10.6986 23.5028 9.8223 23.1864C6.21957 21.9449 3.79747 18.5978 3.79747 14.8612C3.79747 10.8324 6.66991 7.2784 10.6743 6.36555C11.7575 6.12212 13.9849 6.2195 14.9951 6.56029Z" fill="#FF6600"/>
<path d="M11.3314 7.53397C9.73692 7.7774 8.17899 8.61722 7.04705 9.83436C6.23157 10.7229 5.84208 11.3801 5.42825 12.5973C5.01443 13.8144 4.96574 15.6766 5.30654 16.8451C6.07334 19.4132 8.11813 21.4458 10.6254 22.0909C11.5505 22.3344 13.2179 22.3587 14.143 22.1518C15.4331 21.8475 16.7841 21.0929 17.7213 20.1435C19.2428 18.6221 19.8635 17.1007 19.8635 14.8977C19.8635 12.6946 19.2428 11.1732 17.7213 9.65179C16.7963 8.71459 15.3844 7.91128 14.2647 7.66785C13.3883 7.48528 12.0617 7.42443 11.3314 7.53397ZM15.6035 10.516V11.1854H14.5203H13.437L13.6926 11.794L13.9482 12.4025H14.7759H15.6035V13.0111V13.6197H14.7637H13.9239L13.7656 14.07C13.5709 14.6664 12.4755 15.7496 11.9765 15.8714C11.7574 15.9079 11.587 15.9931 11.587 16.0296C11.587 16.0783 12.2321 16.7599 13.011 17.5388L14.4472 18.9751L13.9847 19.4254L13.5344 19.8757L11.6722 18.0257C10.6498 17.0033 9.71258 16.1756 9.60304 16.1756C9.43264 16.1756 9.39612 16.0539 9.39612 15.5062V14.8368H10.309C11.3314 14.8368 11.8669 14.6664 12.3173 14.1795C12.7433 13.7049 12.5242 13.6197 10.8323 13.6197H9.39612V13.0111V12.4025H10.9054C11.7452 12.4025 12.4511 12.3538 12.4877 12.293C12.6215 12.0861 11.9521 11.441 11.4896 11.3071C11.2462 11.2462 10.6741 11.1854 10.2238 11.1854H9.39612V10.516V9.84653H12.4998H15.6035V10.516Z" fill="#FF6600"/>
</svg>
