<svg width="36" height="36" viewBox="0 0 36 36" fill="none" xmlns="http://www.w3.org/2000/svg">
<circle cx="18" cy="18" r="18" fill="#FD9149"/>
<circle cx="18" cy="18" r="18" fill="url(#paint0_radial_14_706)"/>
<path fill-rule="evenodd" clip-rule="evenodd" d="M16.4907 7.88552C13.1249 8.44824 10.1747 10.8273 8.90441 14.0036C7.84271 16.6576 7.91065 19.8331 9.08327 22.3706L9.50733 23.2881L8.64797 25.9646C8.17524 27.4366 7.80158 28.6508 7.81764 28.6626C7.8337 28.6745 9.04189 28.2874 10.5026 27.8025L13.1583 26.9208L13.8589 27.2461C16.3946 28.4236 19.6076 28.426 22.0708 27.2522C25.5766 25.5818 27.7943 21.9922 27.7943 17.9881C27.7943 13.2963 24.7877 9.27361 20.3979 8.09199C19.4828 7.84566 17.3905 7.7351 16.4907 7.88552ZM20.138 9.70456C22.6778 10.4371 24.8353 12.4642 25.7391 14.9669C26.8767 18.1173 26.1458 21.5874 23.8436 23.9663C22.2036 25.661 20.6262 26.3952 18.3904 26.5049C16.7634 26.5847 15.6292 26.3482 14.2959 25.6511L13.3529 25.1581L11.8554 25.6654C11.0319 25.9445 10.3354 26.1493 10.3079 26.1206C10.2803 26.092 10.4789 25.3837 10.749 24.5466L11.2403 23.0247L10.8919 22.4349C9.3449 19.8151 9.27869 16.5415 10.7175 13.8098C11.2976 12.7086 12.9012 11.0583 13.9613 10.4718C15.8393 9.43265 18.1848 9.14132 20.138 9.70456ZM14.0889 13.6332C13.2536 14.3647 12.9784 15.7312 13.426 16.9249C13.959 18.3466 15.8771 20.658 17.2312 21.5106C17.6129 21.751 18.4849 22.1471 19.1688 22.3909C20.5639 22.888 21.072 22.8874 21.917 22.3876C22.5582 22.0083 22.8691 21.5452 22.9435 20.8589L23.0046 20.2935L21.9088 19.7515C21.306 19.4534 20.7304 19.2095 20.6296 19.2095C20.5288 19.2093 20.1868 19.5131 19.8697 19.8844L19.2929 20.5594L18.485 20.1302C18.0407 19.8942 17.4282 19.4732 17.1241 19.1946C16.4892 18.6128 15.6906 17.5292 15.6906 17.2494C15.6906 17.1448 15.8574 16.8408 16.0612 16.5739C16.265 16.307 16.4317 16.0058 16.4317 15.9045C16.4317 15.6318 15.6836 13.7812 15.4679 13.5206C15.1885 13.1828 14.5428 13.2355 14.0889 13.6332Z" fill="white"/>
<defs>
<radialGradient id="paint0_radial_14_706" cx="0" cy="0" r="1" gradientUnits="userSpaceOnUse" gradientTransform="translate(18 18) rotate(90) scale(18)">
<stop stop-color="#FFD588"/>
<stop offset="1" stop-color="#FFD588" stop-opacity="0"/>
</radialGradient>
</defs>
</svg>
