<svg width="25" height="27" viewBox="0 0 25 27" fill="none" xmlns="http://www.w3.org/2000/svg">
<path fill-rule="evenodd" clip-rule="evenodd" d="M9.47926 0.0243954C9.28919 0.0696229 8.99971 0.237714 8.87597 0.374682C8.81401 0.443228 8.71907 0.592764 8.66497 0.706946L8.56662 0.914529L8.55023 2.54435C8.53424 4.13572 8.5322 4.17828 8.46425 4.34784C8.32406 4.6976 8.00383 5.05462 7.57196 5.34266C7.40142 5.4564 7.36368 5.49618 7.37553 5.54971C7.38359 5.58613 7.41264 5.74288 7.44016 5.89802C7.76092 7.70854 8.58423 9.40205 9.6648 10.4741C10.4449 11.2479 11.2491 11.6546 12.1719 11.742C14.2885 11.9422 16.3218 10.0461 17.2287 7.02636C17.4015 6.45088 17.598 5.51016 17.5531 5.47298C17.5407 5.46277 17.439 5.39008 17.3269 5.31148C16.8838 5.00062 16.6042 4.67807 16.4712 4.32409C16.4053 4.14891 16.4025 4.0887 16.3869 2.52868C16.372 1.02793 16.3666 0.904625 16.3107 0.773487C16.1691 0.441473 15.9926 0.257836 15.6657 0.102439L15.462 0.0055898L12.5315 0.00051232C10.8276 -0.0024339 9.55 0.00756435 9.47926 0.0243954ZM4.29959 6.91735C3.06415 7.30788 1.72105 7.8088 1.34212 8.02036C0.65145 8.406 0.172784 9.08019 0.0257239 9.87448C-0.0224812 10.1349 -0.000133784 10.6779 0.0693844 10.9338C0.0959003 11.0315 0.582308 12.315 1.15027 13.786C1.71826 15.257 2.88246 18.2729 3.73739 20.4881C4.59233 22.7032 5.34067 24.6143 5.40041 24.735C5.72944 25.3998 6.32803 25.8781 7.07784 26.0753L7.34425 26.1454H12.5001C17.3224 26.1454 17.6712 26.1419 17.8911 26.09C18.6657 25.9073 19.3465 25.3799 19.6893 24.6974C19.7343 24.6078 20.4891 22.6755 21.3667 20.4034C22.2443 18.1314 23.3959 15.1512 23.9257 13.7807C24.4555 12.4103 24.9091 11.2185 24.9337 11.1323C25.0086 10.87 25.0234 10.1724 24.9607 9.86153C24.8522 9.32457 24.6207 8.88809 24.238 8.49916C23.8148 8.0692 23.4945 7.91245 21.9898 7.39921C21.2026 7.13067 20.5599 6.88585 20.0956 6.67764C20.0721 6.66711 20.0461 6.72622 20.0224 6.84382C19.8421 7.74051 19.4908 8.75952 19.0678 9.61283C17.8463 12.0767 15.9212 13.7407 13.7893 14.1752C13.5933 14.2152 13.4266 14.2543 13.4187 14.2621C13.4108 14.27 13.8125 14.859 14.3112 15.5711L15.2181 16.8657L13.916 18.8189C12.8716 20.3855 12.6063 20.7641 12.5752 20.7319C12.4669 20.6199 9.99071 16.8723 10.0046 16.8414C10.0135 16.8215 10.4222 16.2341 10.9128 15.5359C11.6255 14.5218 11.7944 14.2626 11.7529 14.2472C11.7243 14.2366 11.5414 14.1975 11.3465 14.1603C9.11662 13.7346 7.0595 11.851 5.91715 9.18901C5.6955 8.67248 5.38044 7.71136 5.25965 7.18307C5.13766 6.64975 5.14221 6.66564 5.11205 6.66711C5.09861 6.66774 4.73299 6.78035 4.29959 6.91735Z" fill="#ffffff"/>
</svg>
