<svg width="18" height="18" viewBox="0 0 18 18" fill="none" xmlns="http://www.w3.org/2000/svg">
<circle cx="9" cy="9" r="7.03125" fill="#FFF2E9"/>
<path fill-rule="evenodd" clip-rule="evenodd" d="M8.93395 11.2687C9.03266 11.2395 9.38939 10.9049 10.4096 9.88466C11.8616 8.43263 11.8787 8.41095 11.8186 8.09078C11.7893 7.93471 11.439 7.53439 11.2772 7.47202C11.1489 7.42255 10.8925 7.42671 10.7877 7.47994C10.7398 7.50426 10.253 7.97001 9.70573 8.51495L8.71078 9.50569L7.71583 8.51495C7.16859 7.97001 6.68172 7.50426 6.63385 7.47994C6.5136 7.41887 6.24863 7.42456 6.12012 7.49102C5.9337 7.58743 5.63165 7.93802 5.60286 8.09141C5.54342 8.40827 5.56663 8.43814 6.95655 9.83356C7.66566 10.5455 8.29807 11.1606 8.3619 11.2005C8.50457 11.2897 8.76014 11.3201 8.93395 11.2687Z" fill="#FD9149"/>
</svg>
