<svg width="42" height="42" viewBox="0 0 42 42" fill="none" xmlns="http://www.w3.org/2000/svg">
<rect width="42" height="42" fill="url(#paint0_linear_12007_12)"/>
<path fill-rule="evenodd" clip-rule="evenodd" d="M9.03316 8.20533C8.89875 8.5558 9.18981 9.33597 9.60238 9.73104C9.95912 10.0724 10.0779 10.1082 10.8576 10.1082C11.6057 10.1082 11.7724 10.1533 12.1266 10.4513C12.3657 10.6525 12.5356 10.9169 12.5373 11.0901C12.5388 11.2528 12.6465 11.6203 12.7766 11.9067C13.0822 12.5796 13.7304 12.9122 14.5549 12.8193C15.3222 12.7328 15.9803 13.1234 15.9828 13.6665C15.9851 14.2116 16.3611 14.8994 16.8046 15.1697C17.274 15.4561 18.0328 15.4811 18.5249 15.2267C18.8453 15.061 18.9207 15.0671 19.2851 15.2887L19.6896 15.5348V16.74V17.9454L16.7509 19.6355L13.8122 21.3255L13.8149 25.8108L13.8177 30.296L17.6416 32.5001C19.7448 33.7123 21.5403 34.7007 21.6318 34.6966C21.7231 34.6924 23.494 33.7 25.5671 32.4911L29.3364 30.2935L29.3698 25.8228L29.4033 21.3521L26.463 19.6474L23.5228 17.9425V16.7606V15.5787L23.9471 15.3502C24.2842 15.1687 24.4269 15.1515 24.6414 15.2662C24.79 15.3457 25.1807 15.4107 25.5099 15.4107C26.0346 15.4107 26.1693 15.3496 26.6044 14.9147C27.0565 14.4624 27.1749 14.1501 27.1185 13.558C27.1117 13.4878 27.3205 13.2895 27.5824 13.1174C27.954 12.8732 28.2323 12.8029 28.8488 12.7979C29.5453 12.7922 29.6856 12.7467 30.0327 12.4142C30.4149 12.048 30.762 11.1782 30.6185 10.946C30.5797 10.883 30.7522 10.6631 31.0019 10.4573C31.3985 10.1305 31.5335 10.0903 32.068 10.1417C33.1553 10.2462 33.9985 9.52048 33.9995 8.47914L34 8H33.4471C32.9125 8 32.8961 8.01201 32.9475 8.36274C33.0489 9.05347 32.241 9.42145 31.7686 8.89951C31.6122 8.72676 31.5679 8.54622 31.6254 8.317C31.7065 7.99412 31.6936 7.98595 31.1614 8.0244L30.6141 8.06389V8.71948C30.6141 9.16936 30.5424 9.4548 30.3855 9.62946C30.1587 9.88181 30.1531 9.88194 29.6827 9.63662C29.1427 9.35501 28.4292 9.3867 27.9287 9.71456C27.3507 10.0933 27.0502 11.045 27.2739 11.788C27.3217 11.9467 27.2395 12.102 27.0249 12.259C26.7176 12.4837 26.6907 12.4841 26.3595 12.2667C26.1581 12.1344 25.7749 12.0401 25.4393 12.0401C24.436 12.0401 23.7783 12.7086 23.7783 13.7286C23.7783 14.127 23.7105 14.2759 23.4515 14.4455C23.1421 14.6482 23.0955 14.6456 22.5806 14.3963C21.9126 14.073 21.1658 14.0594 20.5762 14.3599C20.1716 14.5663 20.0997 14.5692 19.7829 14.3919C19.4979 14.2323 19.4345 14.1076 19.4344 13.7055C19.434 13.0305 19.0951 12.5162 18.4425 12.2003C17.8554 11.9161 17.2596 11.9393 16.8158 12.2638C16.6168 12.4092 16.5268 12.4049 16.2306 12.2348C15.9026 12.0466 15.885 11.9921 15.9493 11.3689C16.0328 10.5596 15.7049 9.92781 15.0366 9.61068C14.4761 9.34479 14.0998 9.35156 13.538 9.63802C13.0873 9.86776 13.0778 9.86712 12.7195 9.58142C12.396 9.32345 12.3607 9.22302 12.3914 8.64627L12.4256 8H11.9051C11.4014 8 11.3845 8.01367 11.3845 8.42164C11.3845 8.93516 11.1907 9.14994 10.7274 9.14994C10.2962 9.14994 9.95541 8.71373 10.0602 8.29592C10.1287 8.02351 10.094 8 9.62321 8C9.27158 8 9.08746 8.06401 9.03316 8.20533ZM14.7284 10.6391C15.1963 11.0625 14.8925 11.8331 14.2575 11.8331C13.9563 11.8331 13.5566 11.4162 13.5566 11.1019C13.5566 10.8678 14.0296 10.4276 14.2812 10.4276C14.3986 10.4276 14.5999 10.5228 14.7284 10.6391ZM29.3279 10.5973C29.5974 10.7944 29.6337 11.3602 29.3951 11.6476C29.1439 11.9503 28.4809 11.8362 28.2935 11.4579C27.9583 10.782 28.7171 10.1506 29.3279 10.5973ZM18.1279 13.182C18.4408 13.4011 18.5127 13.9811 18.2586 14.2352C17.8888 14.605 17.0065 14.2489 17.0065 13.7299C17.0065 13.4603 17.4373 12.9831 17.6807 12.9831C17.7705 12.9831 17.9718 13.0726 18.1279 13.182ZM25.7004 13.1138C26.1248 13.341 26.2521 13.7241 26.0204 14.0777C25.7979 14.4174 25.2212 14.5027 24.9538 14.2352C24.6997 13.9811 24.7716 13.4011 25.0845 13.182C25.4211 12.9461 25.393 12.9492 25.7004 13.1138ZM22.2166 15.3541C22.4643 15.5276 22.5006 15.6678 22.5006 16.4527V17.3526L22.0534 17.0887L21.6062 16.8248L21.159 17.0887L20.7118 17.3526V16.3879C20.7118 15.6042 20.7537 15.399 20.9354 15.2932C21.2688 15.099 21.895 15.1287 22.2166 15.3541ZM21.0905 19.2758L21.0859 20.2021L19.0245 21.3903L16.9631 22.5784L16.4093 22.2847C15.1685 21.6267 15.0399 21.7926 18.195 19.9785C19.7533 19.0825 21.0434 18.3495 21.0618 18.3495C21.08 18.3495 21.0931 18.7664 21.0905 19.2758ZM25.7298 20.3938C26.9007 21.0614 27.8605 21.6364 27.8626 21.6715C27.8648 21.7066 27.5057 21.93 27.0643 22.168L26.2621 22.6005L24.1927 21.4014L22.1233 20.2021L22.1204 19.2684L22.1173 18.3346L22.8591 18.7573C23.2671 18.9897 24.5589 19.7262 25.7298 20.3938ZM24.1936 22.5898L25.6949 23.47V25.8173V28.1644L23.7066 29.3261C22.6132 29.965 21.6502 30.4848 21.5665 30.4811C21.4829 30.4774 20.5521 29.965 19.498 29.3425L17.5814 28.2106V25.8078V23.4052L19.5619 22.236L21.5423 21.0668L22.1173 21.3882C22.4335 21.5649 23.3678 22.1057 24.1936 22.5898ZM21.4315 22.4701C21.3321 22.6281 20.7194 23.6775 20.0695 24.8019C19.4198 25.9263 18.7794 27.0279 18.6467 27.25L18.4053 27.6537L20.0066 28.5697L21.608 29.4857L23.2076 28.5637L24.8071 27.6417L24.7719 25.7896L24.7366 23.9374L23.2293 23.06C22.4002 22.5774 21.6972 22.1826 21.667 22.1826C21.6369 22.1826 21.5308 22.312 21.4315 22.4701ZM15.7811 23.1039L16.4954 23.5141V25.8879V28.2618L15.7811 28.6719C15.3884 28.8976 15.0146 29.0822 14.9506 29.0822C14.8839 29.0822 14.8343 27.7217 14.8343 25.8879C14.8343 24.0542 14.8839 22.6937 14.9506 22.6937C15.0146 22.6937 15.3884 22.8783 15.7811 23.1039ZM28.3781 25.8879C28.3781 27.6448 28.3452 29.0822 28.3051 29.0822C28.265 29.0822 27.892 28.8953 27.4761 28.667L26.7201 28.2517L26.7186 25.8865L26.7171 23.5214L27.4517 23.1106C27.8557 22.8846 28.2296 22.6983 28.2822 22.6966C28.3349 22.6951 28.3781 24.1311 28.3781 25.8879ZM19.6617 30.6155L21.0931 31.446L21.0941 32.3828L21.0951 33.3195L20.6799 33.0683C20.4515 32.9302 19.2009 32.2014 17.9009 31.4487C16.6008 30.696 15.5246 30.0684 15.5092 30.0538C15.494 30.0394 15.8345 29.8193 16.2659 29.5648L17.0504 29.1022L17.6402 29.4436C17.9646 29.6314 18.8743 30.1587 19.6617 30.6155ZM27.6424 29.9641C27.7289 30.0436 22.4342 33.1709 22.213 33.1709C22.1604 33.1709 22.1173 32.7799 22.1173 32.3022V31.4335L24.1283 30.2628L26.1393 29.0923L26.8434 29.4847C27.2307 29.7004 27.5902 29.9162 27.6424 29.9641Z" fill="white"/>
<defs>
<linearGradient id="paint0_linear_12007_12" x1="21" y1="0" x2="21" y2="42" gradientUnits="userSpaceOnUse">
<stop stop-color="#FD9149"/>
<stop offset="1" stop-color="#FFD588"/>
</linearGradient>
</defs>
</svg>
