<svg width="13" height="11" viewBox="0 0 13 11" fill="none" xmlns="http://www.w3.org/2000/svg">
<path fill-rule="evenodd" clip-rule="evenodd" d="M5.09929 0.0679718C3.97304 0.170358 2.61792 0.531147 1.74529 0.960915C0.911486 1.37154 0.153613 2.10341 0.0557412 2.59241C0.0240503 2.75114 -0.00104965 3.67839 3.37998e-05 4.65295C0.00174926 6.1742 0.0253142 6.47594 0.166975 6.78599C0.518826 7.55632 1.7099 8.33406 3.06782 8.68013C3.41164 8.76771 4.03986 9.0532 4.58474 9.36939C5.09631 9.66625 5.64941 9.98479 5.81383 10.0772C5.97833 10.1695 6.19466 10.2962 6.2947 10.3587C6.45568 10.4592 6.63219 10.3821 7.83283 9.68693C8.81263 9.11956 9.4358 8.82532 10.0785 8.62677C11.6093 8.15376 12.648 7.39625 12.8946 6.57309C13.0378 6.09529 13.034 3.0415 12.8897 2.55295C12.6322 1.68177 11.3244 0.807156 9.64111 0.380457C8.20374 0.0161471 6.76148 -0.0830791 5.09929 0.0679718ZM7.72449 0.696824C11.0766 1.0215 13.1021 2.46655 12.019 3.76064L11.7806 4.0455L11.3743 3.81915C9.06752 2.5339 4.42177 2.47991 1.83513 3.70827L1.18777 4.0157L1.01044 3.82086C0.585097 3.35317 0.533904 3.00701 0.816684 2.50962C1.31155 1.63897 3.0123 0.921008 5.10055 0.701248C6.14969 0.590827 6.62154 0.590014 7.72449 0.696824ZM7.57235 3.49276C8.13801 3.54287 8.95059 3.66972 9.3781 3.77463C10.126 3.95819 11.1034 4.3308 11.1034 4.43238C11.1034 4.55968 9.49954 5.11378 9.12765 5.11495C9.00937 5.1154 8.38729 4.81095 7.74516 4.43852C7.10313 4.06608 6.5364 3.76136 6.48584 3.76136C6.43518 3.76136 5.86953 4.06608 5.22885 4.43852C4.58817 4.81095 3.966 5.11567 3.84628 5.11567C3.39421 5.11567 1.89408 4.57386 1.89408 4.41053C1.89408 4.30318 3.04299 3.88641 3.79012 3.72281C5.12899 3.42965 6.15421 3.36726 7.57235 3.49276ZM2.56384 5.43141C3.04904 5.59817 3.46816 5.7568 3.49524 5.78389C3.57424 5.86289 3.58878 7.89237 3.51122 8.01787C3.36749 8.25054 1.83016 7.62828 1.21566 7.08873C0.705721 6.64108 0.63006 6.41636 0.63006 5.35042V4.40249L1.1558 4.76536C1.44834 4.96715 2.07312 5.26275 2.56384 5.43141ZM12.3217 6.18034C12.223 6.85416 11.5362 7.42866 10.2648 7.90104C9.35625 8.23854 9.38795 8.27366 9.38795 6.93018V5.76529L10.0386 5.56765C10.7235 5.35963 11.7159 4.88436 12.0966 4.58207L12.3223 4.40285L12.3504 5.09789C12.3658 5.48007 12.3529 5.96718 12.3217 6.18034ZM6.1376 5.0188C6.1376 5.35349 6.11015 5.38897 5.64499 5.65514C5.17053 5.92655 5.14218 5.93169 4.87754 5.79491C4.7264 5.71672 4.60307 5.62336 4.60343 5.58734C4.60406 5.53686 6.01381 4.67832 6.11502 4.66676C6.12748 4.66541 6.1376 4.82377 6.1376 5.0188ZM7.41932 4.99144C7.73234 5.17138 8.08546 5.37913 8.20392 5.45299L8.41943 5.58743L8.13927 5.76475L7.8592 5.94207L7.3144 5.65171C6.79245 5.37353 6.76961 5.34681 6.76961 5.01284C6.76961 4.82107 6.78776 4.66424 6.80988 4.66424C6.83209 4.66424 7.10629 4.8115 7.41932 4.99144ZM6.99668 6.2077L7.49191 6.48723L7.4901 7.088L7.48839 7.68887L6.98458 7.98338L6.48078 8.2779L5.97056 7.96758L5.46044 7.65736V7.09189V6.52642L5.95702 6.22774C6.23014 6.06342 6.46435 5.9288 6.47753 5.92862C6.49071 5.92844 6.72428 6.05403 6.99668 6.2077ZM4.61138 6.38584C4.84965 6.55549 4.87357 6.62077 4.87357 7.10082C4.87357 7.60309 4.85867 7.63822 4.56948 7.81689C4.40227 7.92027 4.244 8.00487 4.21781 8.00487C4.19172 8.00487 4.17429 7.59858 4.17908 7.102C4.18387 6.60542 4.22413 6.19912 4.26846 6.19912C4.3128 6.19912 4.4671 6.28318 4.61138 6.38584ZM8.75593 7.1103V8.02149L8.4625 7.85048C8.18514 7.68887 8.16762 7.6477 8.14306 7.0973C8.11841 6.54529 8.13006 6.50709 8.36878 6.35956C8.50719 6.27397 8.65102 6.20283 8.68822 6.20156C8.72542 6.20021 8.75593 6.60912 8.75593 7.1103ZM5.70873 8.54849C6.10744 8.79886 6.1376 8.844 6.1376 9.18981C6.1376 9.47439 6.11105 9.54111 6.02474 9.47349C5.96271 9.42492 5.61014 9.21075 5.24131 8.99767L4.57075 8.61025L4.77732 8.44304C5.05722 8.21633 5.20682 8.2333 5.70873 8.54849ZM8.12844 8.41351C8.27488 8.48927 8.39478 8.56691 8.39478 8.58614C8.39478 8.64375 6.96625 9.44947 6.86414 9.44947C6.81213 9.44947 6.76961 9.31061 6.76961 9.14096C6.76961 8.86396 6.81818 8.8041 7.24362 8.55608C7.7978 8.23294 7.78372 8.23529 8.12844 8.41351Z" fill="black"/>
</svg>
