<svg width="19" height="20" viewBox="0 0 19 20" fill="none" xmlns="http://www.w3.org/2000/svg">
<path d="M7.36297 0.994818C5.76606 1.34286 4.29199 2.10037 4.29199 2.57125C4.29199 2.80669 4.70146 3.2571 4.92666 3.2571C5.03926 3.2571 5.45896 3.10356 5.85819 2.90906C7.08658 2.32557 7.74172 2.18226 9.35911 2.1925C10.7103 2.1925 10.8536 2.21297 11.7647 2.52007C13.8632 3.24687 15.4806 4.65952 16.4224 6.56352C17.487 8.74392 17.487 11.385 16.4224 13.5654C15.4806 15.4694 13.8632 16.882 11.7647 17.6088C10.8536 17.9159 10.7103 17.9364 9.35911 17.9364C7.74172 17.9466 7.08658 17.8033 5.84795 17.2198C4.99832 16.8104 4.75264 16.8104 4.45578 17.2096C4.26128 17.4757 4.26128 17.5167 4.39436 17.7726C4.58885 18.1309 5.79677 18.7246 6.95351 19.0419C8.1 19.349 10.4032 19.3695 11.4986 19.0829C15.3885 18.049 18.1114 14.9166 18.5209 10.996C18.9917 6.44068 16.1357 2.33581 11.6112 1.08695C10.5466 0.790085 8.489 0.74914 7.36297 0.994818Z" fill="white"/>
<path d="M7.31184 5.35572C7.16853 5.48879 7.05592 5.70376 7.05592 5.8266C7.05592 5.99038 7.56775 6.57387 8.71425 7.73061L10.3726 9.39917H5.74564C1.25178 9.39917 1.10846 9.40941 0.913969 9.6039C0.647818 9.87005 0.647818 10.259 0.913969 10.5252C1.10846 10.7197 1.25178 10.7299 5.74564 10.7299H10.3726L8.71425 12.3985C7.56775 13.5552 7.05592 14.1387 7.05592 14.3025C7.05592 14.5687 7.48586 15.0293 7.73154 15.0293C7.82367 15.0293 8.38668 14.5584 8.9804 13.9749C12.6861 10.3614 12.7475 10.2898 12.6349 9.89053C12.5427 9.61414 8.45834 5.45808 8.05911 5.24311C7.68036 5.04862 7.59846 5.05885 7.31184 5.35572Z" fill="white"/>
</svg>
