<svg width="19" height="21" viewBox="0 0 19 21" fill="none" xmlns="http://www.w3.org/2000/svg">
<mask id="path-1-inside-1_14163_284" fill="white">
<path d="M8.72772 1.64955C8.40635 2.0132 8.03424 2.43606 7.89893 2.58829L7.65367 2.85891L6.30899 2.51217L4.96432 2.16543L4.74443 2.33457C4.533 2.4868 4.51609 2.56291 4.38078 3.83148C4.30466 4.55879 4.22009 5.17616 4.20318 5.19307C4.18626 5.21844 3.63655 5.2861 2.99381 5.35376C1.50536 5.51444 1.47153 5.5229 1.30239 5.77661C1.17554 5.97112 1.19245 6.03878 1.64068 7.29889C1.90285 8.0262 2.11427 8.63511 2.11427 8.64357C2.11427 8.66048 1.74216 8.94802 1.29394 9.2863C0.219885 10.0813 0 10.2927 0 10.5126C0 10.7325 0.219885 10.9439 1.28548 11.7389C1.74216 12.0771 2.11427 12.3647 2.11427 12.3731C2.11427 12.3816 1.90285 12.9821 1.64913 13.6925C1.00639 15.4684 0.955652 15.3839 2.95153 15.7898C3.61964 15.9336 4.17781 16.0604 4.19472 16.0774C4.22009 16.0943 4.28775 16.5848 4.3554 17.1599C4.52455 18.5215 4.533 18.5637 4.77826 18.7244C4.98123 18.8513 5.04043 18.8428 6.30899 18.3777C7.02785 18.1155 7.65367 17.921 7.67904 17.9548C7.71287 17.9802 8.05961 18.4284 8.4571 18.9443C8.85458 19.4686 9.24361 19.9253 9.31972 19.9761C9.58189 20.1283 9.86097 19.8915 10.7321 18.7667C11.2057 18.1578 11.6031 17.6588 11.6201 17.6588C11.637 17.6588 12.1698 17.9295 12.8125 18.2593C14.4363 19.105 14.4532 19.0881 14.6646 17.0753C14.7323 16.4072 14.8084 15.8406 14.8337 15.8236C14.8507 15.8067 15.4511 15.7306 16.17 15.6545C17.244 15.5446 17.4977 15.4938 17.6584 15.35C17.7599 15.257 17.8445 15.1302 17.8445 15.071C17.8445 15.0033 17.633 14.3775 17.3793 13.6755C17.1256 12.9736 16.9142 12.3816 16.9142 12.3731C16.9142 12.3647 17.354 12.0179 17.8868 11.6205C18.428 11.2145 18.9101 10.7917 18.9608 10.6817C19.0961 10.3773 18.927 10.1743 17.7176 9.25248C17.1341 8.79579 16.6605 8.41522 16.6605 8.39831C16.6605 8.3814 16.9142 7.89088 17.2186 7.32426C17.8868 6.06415 17.9206 5.92038 17.6584 5.68358C17.4977 5.53135 17.2609 5.48061 16.17 5.37913C15.4596 5.31147 14.8591 5.23536 14.8337 5.20998C14.8084 5.18461 14.7323 4.5757 14.6561 3.86531C14.5208 2.53754 14.4532 2.32612 14.1149 2.22463C14.0219 2.1908 13.4214 2.3684 12.6772 2.63903C11.9752 2.9012 11.3917 3.11262 11.3833 3.11262C11.3663 3.11262 11.0788 2.74051 10.7405 2.28383C9.93709 1.20978 9.73412 0.998351 9.50578 0.998351C9.37046 0.998351 9.12521 1.20132 8.72772 1.64955ZM10.1823 3.32405C10.5629 3.83994 10.9181 4.22896 11.0281 4.26279C11.138 4.28816 11.6708 4.13593 12.3474 3.89068C13.3368 3.52702 13.4975 3.48474 13.5398 3.61159C13.5652 3.68771 13.6413 4.2205 13.692 4.80404C13.7512 5.37913 13.8358 5.92038 13.8781 5.99649C13.9796 6.19946 14.1064 6.23329 15.2481 6.33478C15.8148 6.39398 16.3137 6.46163 16.3476 6.49546C16.3899 6.52929 16.1869 6.99443 15.9078 7.52723C15.5611 8.2038 15.4173 8.55899 15.4511 8.68585C15.4765 8.79579 15.9501 9.21865 16.5505 9.68379C17.1256 10.132 17.5654 10.521 17.5316 10.5549C17.4977 10.5887 17.0918 10.8932 16.6351 11.2314C16.1784 11.5782 15.7894 11.9249 15.764 12.0264C15.7387 12.1279 15.8993 12.6861 16.1361 13.3457C16.4998 14.3352 16.5421 14.4959 16.4152 14.5382C16.3391 14.5635 15.8063 14.6396 15.2228 14.6904C14.1403 14.8003 13.9204 14.8595 13.8443 15.071C13.8189 15.1386 13.7512 15.663 13.692 16.238C13.6328 16.8047 13.5652 17.3121 13.5314 17.3459C13.4975 17.3882 13.0662 17.2106 12.5842 16.9484C11.2987 16.2634 11.341 16.255 10.3515 17.5404C9.90326 18.124 9.50578 18.5722 9.47195 18.5299C9.43812 18.4961 9.13366 18.0901 8.79538 17.6335C8.44864 17.1768 8.1019 16.7877 8.00041 16.7708C7.89893 16.7455 7.32385 16.9061 6.68111 17.1429C6.05528 17.3713 5.53094 17.5489 5.51403 17.532C5.50557 17.5235 5.43791 17.0415 5.3618 16.4664C5.26877 15.7222 5.19266 15.3754 5.09117 15.2739C4.99814 15.1809 4.50763 15.0371 3.73804 14.8764C3.06993 14.7496 2.51176 14.6227 2.49484 14.5974C2.46947 14.5804 2.64707 14.0307 2.88387 13.388C3.13758 12.6861 3.28981 12.1363 3.26444 12.0264C3.23907 11.9249 2.86696 11.5866 2.39336 11.2314C1.93668 10.8932 1.53919 10.5887 1.50536 10.5633C1.46308 10.5295 1.83519 10.2081 2.3257 9.84447C2.83313 9.4639 3.23061 9.10871 3.26444 8.99876C3.28981 8.89728 3.13758 8.34757 2.89233 7.67946C2.66399 7.05363 2.48639 6.52083 2.5033 6.50392C2.52021 6.48701 3.0361 6.41935 3.65347 6.36015C4.27083 6.29249 4.84592 6.21638 4.92203 6.19101C5.15883 6.11489 5.22649 5.92038 5.31951 4.97319C5.37026 4.48267 5.42946 3.92451 5.45483 3.73845L5.50557 3.38325L6.62191 3.67079C7.23927 3.82302 7.82281 3.95833 7.9243 3.95833C8.05961 3.95833 8.30487 3.73845 8.77001 3.1972C9.13366 2.7828 9.44658 2.43606 9.47195 2.43606C9.49732 2.43606 9.81869 2.83354 10.1823 3.32405Z"/>
</mask>
<path d="M8.72772 1.64955C8.40635 2.0132 8.03424 2.43606 7.89893 2.58829L7.65367 2.85891L6.30899 2.51217L4.96432 2.16543L4.74443 2.33457C4.533 2.4868 4.51609 2.56291 4.38078 3.83148C4.30466 4.55879 4.22009 5.17616 4.20318 5.19307C4.18626 5.21844 3.63655 5.2861 2.99381 5.35376C1.50536 5.51444 1.47153 5.5229 1.30239 5.77661C1.17554 5.97112 1.19245 6.03878 1.64068 7.29889C1.90285 8.0262 2.11427 8.63511 2.11427 8.64357C2.11427 8.66048 1.74216 8.94802 1.29394 9.2863C0.219885 10.0813 0 10.2927 0 10.5126C0 10.7325 0.219885 10.9439 1.28548 11.7389C1.74216 12.0771 2.11427 12.3647 2.11427 12.3731C2.11427 12.3816 1.90285 12.9821 1.64913 13.6925C1.00639 15.4684 0.955652 15.3839 2.95153 15.7898C3.61964 15.9336 4.17781 16.0604 4.19472 16.0774C4.22009 16.0943 4.28775 16.5848 4.3554 17.1599C4.52455 18.5215 4.533 18.5637 4.77826 18.7244C4.98123 18.8513 5.04043 18.8428 6.30899 18.3777C7.02785 18.1155 7.65367 17.921 7.67904 17.9548C7.71287 17.9802 8.05961 18.4284 8.4571 18.9443C8.85458 19.4686 9.24361 19.9253 9.31972 19.9761C9.58189 20.1283 9.86097 19.8915 10.7321 18.7667C11.2057 18.1578 11.6031 17.6588 11.6201 17.6588C11.637 17.6588 12.1698 17.9295 12.8125 18.2593C14.4363 19.105 14.4532 19.0881 14.6646 17.0753C14.7323 16.4072 14.8084 15.8406 14.8337 15.8236C14.8507 15.8067 15.4511 15.7306 16.17 15.6545C17.244 15.5446 17.4977 15.4938 17.6584 15.35C17.7599 15.257 17.8445 15.1302 17.8445 15.071C17.8445 15.0033 17.633 14.3775 17.3793 13.6755C17.1256 12.9736 16.9142 12.3816 16.9142 12.3731C16.9142 12.3647 17.354 12.0179 17.8868 11.6205C18.428 11.2145 18.9101 10.7917 18.9608 10.6817C19.0961 10.3773 18.927 10.1743 17.7176 9.25248C17.1341 8.79579 16.6605 8.41522 16.6605 8.39831C16.6605 8.3814 16.9142 7.89088 17.2186 7.32426C17.8868 6.06415 17.9206 5.92038 17.6584 5.68358C17.4977 5.53135 17.2609 5.48061 16.17 5.37913C15.4596 5.31147 14.8591 5.23536 14.8337 5.20998C14.8084 5.18461 14.7323 4.5757 14.6561 3.86531C14.5208 2.53754 14.4532 2.32612 14.1149 2.22463C14.0219 2.1908 13.4214 2.3684 12.6772 2.63903C11.9752 2.9012 11.3917 3.11262 11.3833 3.11262C11.3663 3.11262 11.0788 2.74051 10.7405 2.28383C9.93709 1.20978 9.73412 0.998351 9.50578 0.998351C9.37046 0.998351 9.12521 1.20132 8.72772 1.64955ZM10.1823 3.32405C10.5629 3.83994 10.9181 4.22896 11.0281 4.26279C11.138 4.28816 11.6708 4.13593 12.3474 3.89068C13.3368 3.52702 13.4975 3.48474 13.5398 3.61159C13.5652 3.68771 13.6413 4.2205 13.692 4.80404C13.7512 5.37913 13.8358 5.92038 13.8781 5.99649C13.9796 6.19946 14.1064 6.23329 15.2481 6.33478C15.8148 6.39398 16.3137 6.46163 16.3476 6.49546C16.3899 6.52929 16.1869 6.99443 15.9078 7.52723C15.5611 8.2038 15.4173 8.55899 15.4511 8.68585C15.4765 8.79579 15.9501 9.21865 16.5505 9.68379C17.1256 10.132 17.5654 10.521 17.5316 10.5549C17.4977 10.5887 17.0918 10.8932 16.6351 11.2314C16.1784 11.5782 15.7894 11.9249 15.764 12.0264C15.7387 12.1279 15.8993 12.6861 16.1361 13.3457C16.4998 14.3352 16.5421 14.4959 16.4152 14.5382C16.3391 14.5635 15.8063 14.6396 15.2228 14.6904C14.1403 14.8003 13.9204 14.8595 13.8443 15.071C13.8189 15.1386 13.7512 15.663 13.692 16.238C13.6328 16.8047 13.5652 17.3121 13.5314 17.3459C13.4975 17.3882 13.0662 17.2106 12.5842 16.9484C11.2987 16.2634 11.341 16.255 10.3515 17.5404C9.90326 18.124 9.50578 18.5722 9.47195 18.5299C9.43812 18.4961 9.13366 18.0901 8.79538 17.6335C8.44864 17.1768 8.1019 16.7877 8.00041 16.7708C7.89893 16.7455 7.32385 16.9061 6.68111 17.1429C6.05528 17.3713 5.53094 17.5489 5.51403 17.532C5.50557 17.5235 5.43791 17.0415 5.3618 16.4664C5.26877 15.7222 5.19266 15.3754 5.09117 15.2739C4.99814 15.1809 4.50763 15.0371 3.73804 14.8764C3.06993 14.7496 2.51176 14.6227 2.49484 14.5974C2.46947 14.5804 2.64707 14.0307 2.88387 13.388C3.13758 12.6861 3.28981 12.1363 3.26444 12.0264C3.23907 11.9249 2.86696 11.5866 2.39336 11.2314C1.93668 10.8932 1.53919 10.5887 1.50536 10.5633C1.46308 10.5295 1.83519 10.2081 2.3257 9.84447C2.83313 9.4639 3.23061 9.10871 3.26444 8.99876C3.28981 8.89728 3.13758 8.34757 2.89233 7.67946C2.66399 7.05363 2.48639 6.52083 2.5033 6.50392C2.52021 6.48701 3.0361 6.41935 3.65347 6.36015C4.27083 6.29249 4.84592 6.21638 4.92203 6.19101C5.15883 6.11489 5.22649 5.92038 5.31951 4.97319C5.37026 4.48267 5.42946 3.92451 5.45483 3.73845L5.50557 3.38325L6.62191 3.67079C7.23927 3.82302 7.82281 3.95833 7.9243 3.95833C8.05961 3.95833 8.30487 3.73845 8.77001 3.1972C9.13366 2.7828 9.44658 2.43606 9.47195 2.43606C9.49732 2.43606 9.81869 2.83354 10.1823 3.32405Z" fill="black" stroke="black" stroke-width="2" mask="url(#path-1-inside-1_14163_284)"/>
<mask id="path-2-inside-2_14163_284" fill="white">
<path d="M6.21749 7.459C5.65086 7.71272 5.41406 8.18631 5.41406 9.07431C5.41406 9.75933 5.66778 10.2668 6.13292 10.5036C6.60651 10.7488 7.62136 10.7488 8.03576 10.5036C8.6193 10.1653 8.86456 9.52253 8.76307 8.65991C8.64467 7.73809 8.12879 7.3406 7.0632 7.34906C6.74183 7.34906 6.36126 7.3998 6.21749 7.459ZM7.52834 8.88825C7.52834 9.64093 7.42685 9.81853 7.02091 9.77625L6.72491 9.75088L6.69954 9.12505C6.68263 8.77831 6.69108 8.44848 6.71646 8.38083C6.74183 8.31317 6.90251 8.27088 7.14777 8.27088H7.52834V8.88825Z"/>
</mask>
<path d="M6.21749 7.459C5.65086 7.71272 5.41406 8.18631 5.41406 9.07431C5.41406 9.75933 5.66778 10.2668 6.13292 10.5036C6.60651 10.7488 7.62136 10.7488 8.03576 10.5036C8.6193 10.1653 8.86456 9.52253 8.76307 8.65991C8.64467 7.73809 8.12879 7.3406 7.0632 7.34906C6.74183 7.34906 6.36126 7.3998 6.21749 7.459ZM7.52834 8.88825C7.52834 9.64093 7.42685 9.81853 7.02091 9.77625L6.72491 9.75088L6.69954 9.12505C6.68263 8.77831 6.69108 8.44848 6.71646 8.38083C6.74183 8.31317 6.90251 8.27088 7.14777 8.27088H7.52834V8.88825Z" fill="black" stroke="black" stroke-width="2" mask="url(#path-2-inside-2_14163_284)"/>
<mask id="path-3-inside-3_14163_284" fill="white">
<path d="M10.6394 7.52612C10.4618 7.66989 7.27344 13.2177 7.27344 13.3869C7.27344 13.5729 8.3052 13.5729 8.46589 13.3784C8.73652 13.0571 11.8149 7.62761 11.7811 7.53458C11.7219 7.39081 10.817 7.39081 10.6394 7.52612Z"/>
</mask>
<path d="M10.6394 7.52612C10.4618 7.66989 7.27344 13.2177 7.27344 13.3869C7.27344 13.5729 8.3052 13.5729 8.46589 13.3784C8.73652 13.0571 11.8149 7.62761 11.7811 7.53458C11.7219 7.39081 10.817 7.39081 10.6394 7.52612Z" fill="black" stroke="black" stroke-width="2" mask="url(#path-3-inside-3_14163_284)"/>
<mask id="path-4-inside-4_14163_284" fill="white">
<path d="M11.2319 10.3934C10.8344 10.5118 10.4369 10.9516 10.31 11.4167C10.1916 11.8734 10.2677 12.6937 10.4707 13.0405C10.8936 13.7847 12.6019 13.9284 13.2108 13.2857C13.5237 12.9474 13.6421 12.4823 13.5998 11.8142C13.5491 11.1207 13.3461 10.7401 12.9064 10.5202C12.5258 10.3342 11.6716 10.275 11.2319 10.3934ZM12.3313 11.9664L12.3059 12.7106L11.9507 12.736L11.5871 12.7614V12.051C11.5871 11.6619 11.6124 11.3152 11.6463 11.2898C11.6716 11.256 11.8492 11.2306 12.0268 11.2306H12.3567L12.3313 11.9664Z"/>
</mask>
<path d="M11.2319 10.3934C10.8344 10.5118 10.4369 10.9516 10.31 11.4167C10.1916 11.8734 10.2677 12.6937 10.4707 13.0405C10.8936 13.7847 12.6019 13.9284 13.2108 13.2857C13.5237 12.9474 13.6421 12.4823 13.5998 11.8142C13.5491 11.1207 13.3461 10.7401 12.9064 10.5202C12.5258 10.3342 11.6716 10.275 11.2319 10.3934ZM12.3313 11.9664L12.3059 12.7106L11.9507 12.736L11.5871 12.7614V12.051C11.5871 11.6619 11.6124 11.3152 11.6463 11.2898C11.6716 11.256 11.8492 11.2306 12.0268 11.2306H12.3567L12.3313 11.9664Z" fill="black" stroke="black" stroke-width="2" mask="url(#path-4-inside-4_14163_284)"/>
</svg>
