<svg width="15" height="14" viewBox="0 0 15 14" fill="none" xmlns="http://www.w3.org/2000/svg">
<path fill-rule="evenodd" clip-rule="evenodd" d="M0.552699 0.0169345C0.332732 0.0795744 0.150047 0.21921 0.0656658 0.389185C-0.0350117 0.592021 -0.0172209 1.42859 0.100515 2.02879C0.227219 2.67461 0.464272 3.29852 0.807309 3.88898L1.02174 4.25805L1.02179 5.08598L1.02182 5.91392L0.809331 5.91473C0.487427 5.91601 0.254887 6.03668 0.100925 6.28235C-0.0708276 6.55638 -0.0202984 6.87243 0.236803 7.13218C0.484701 7.38261 1.0324 7.68657 1.23578 7.68657C1.43133 7.68657 1.88193 7.44225 2.16811 7.18102C2.38866 6.97972 2.43591 6.89333 2.45168 6.66224C2.46258 6.50278 2.45361 6.44765 2.3988 6.33698C2.26507 6.06702 1.89677 5.87243 1.5889 5.90908L1.46146 5.92425L1.4624 5.37113L1.46331 4.81801L1.52808 4.89437C1.89301 5.32461 2.53166 5.86398 3.09546 6.21806L3.33726 6.36991V7.10293V7.83596L3.19473 7.81954C2.84935 7.77976 2.47 7.99272 2.35619 8.29029C2.28974 8.46401 2.3073 8.69561 2.39872 8.8512C2.48908 9.00504 2.71496 9.20617 2.96585 9.35621C3.43568 9.63719 3.5504 9.65124 3.91503 9.47238C4.24468 9.3107 4.56863 9.04739 4.68352 8.84771C4.84997 8.55841 4.79074 8.25316 4.52297 8.02064C4.34486 7.86596 4.12014 7.79238 3.90434 7.81806L3.7769 7.83323V7.22073C3.7769 6.88383 3.78681 6.61215 3.79888 6.61696C3.81096 6.62177 3.95592 6.68576 4.12096 6.75916C4.98605 7.14389 5.97416 7.37989 6.97894 7.44179L7.26471 7.45938V8.35947C7.26471 8.85454 7.26057 9.25957 7.25553 9.25957C7.25049 9.25957 7.17731 9.23065 7.09293 9.19528C6.60287 8.98997 5.9729 9.0241 5.51869 9.28054C4.7522 9.71332 4.48044 10.5429 4.87113 11.2574C5.05745 11.598 5.55395 12.0475 6.16057 12.4247C6.6787 12.7468 7.29674 13.0257 7.49391 13.0263C7.78169 13.0272 8.77091 12.5145 9.36032 12.0588C9.48928 11.9591 9.68404 11.7896 9.7931 11.6821C10.1181 11.3619 10.3477 10.8911 10.2602 10.7244C10.2143 10.6369 10.0931 10.5971 9.9876 10.6351C9.90565 10.6646 9.88587 10.6966 9.79976 10.9392C9.7261 11.1469 9.62683 11.2773 9.35083 11.5292C8.92678 11.9162 8.31073 12.3088 7.7676 12.5383L7.49382 12.654L7.21072 12.5321C6.37259 12.1711 5.49991 11.523 5.26062 11.0837C4.94543 10.5051 5.23724 9.80689 5.90889 9.53253C6.08504 9.4606 6.13624 9.45156 6.37077 9.45105C6.70516 9.45031 6.81918 9.48129 7.11837 9.65422C7.32643 9.77446 7.37986 9.79408 7.49918 9.79408C7.6185 9.79408 7.67193 9.77446 7.88 9.65422C8.17936 9.48121 8.29288 9.45039 8.62973 9.45075C8.8771 9.45098 8.91101 9.45759 9.11553 9.54538C9.33101 9.63785 9.49808 9.76817 9.70597 10.0059C9.81081 10.1258 9.95243 10.1368 10.047 10.0325C10.1312 9.9395 10.1234 9.87719 10.0092 9.73012C9.69788 9.32916 9.23168 9.09438 8.68621 9.06384C8.37638 9.04648 8.10427 9.10214 7.75564 9.25422C7.74356 9.25949 7.73366 8.85782 7.73366 8.36159V7.45938L8.01942 7.44179C9.03053 7.37951 10.0217 7.14104 10.9034 6.74786C11.0542 6.68067 11.1874 6.62174 11.1995 6.61693C11.2116 6.61215 11.2215 6.88383 11.2215 7.22073V7.83323L11.094 7.81806C10.8782 7.79238 10.6535 7.86596 10.4754 8.02064C10.2079 8.25293 10.1484 8.55844 10.3145 8.84703C10.4918 9.15519 11.1565 9.59046 11.4498 9.59046C11.7478 9.59046 12.4188 9.15911 12.5996 8.8512C12.6911 8.69561 12.7086 8.46401 12.6422 8.29029C12.5284 7.99272 12.149 7.77976 11.8036 7.81954L11.6611 7.83596V7.10293V6.36991L11.9029 6.21806C12.4667 5.86398 13.1053 5.32461 13.4703 4.89437L13.5351 4.81801L13.536 5.37113L13.5369 5.92425L13.4095 5.90908C13.1102 5.87345 12.7494 6.05829 12.6097 6.31878C12.5201 6.48588 12.5152 6.7527 12.5988 6.91262C12.7523 7.2063 13.4744 7.68657 13.7626 7.68657C13.966 7.68657 14.5137 7.38261 14.7616 7.13218C15.0187 6.87243 15.0692 6.55638 14.8974 6.28235C14.7435 6.03668 14.5109 5.91601 14.189 5.91473L13.9765 5.91392L13.9766 5.08598L13.9766 4.25805L14.1911 3.88898C14.7483 2.92986 15.0369 1.82756 14.9962 0.814251C14.9818 0.454141 14.9442 0.343573 14.7884 0.202411C14.4323 -0.120181 13.849 -0.0469781 13.6175 0.349377C13.5412 0.480002 13.5369 0.506091 13.5369 0.836472C13.5369 2.69493 12.5685 4.2975 10.8334 5.31043C9.51188 6.08186 7.78917 6.36189 6.20957 6.06203C4.7155 5.77841 3.35851 4.98522 2.519 3.90478C2.4389 3.8017 2.35173 3.71015 2.32536 3.70136C2.16978 3.64952 2.01834 3.73008 2.01834 3.86467C2.01834 4.01647 2.51475 4.57687 3.0325 5.00955C3.83921 5.68372 4.81735 6.15415 5.9146 6.3957C6.80435 6.59156 7.85848 6.61401 8.7693 6.45648C10.4699 6.16234 11.9786 5.26871 12.9451 3.9831C13.1386 3.7256 13.4232 3.23921 13.5526 2.94493C13.8121 2.35441 13.9424 1.755 13.9672 1.03824C13.9766 0.765254 13.9961 0.521974 14.0106 0.497615C14.0251 0.473282 14.0777 0.435026 14.1275 0.412653C14.2445 0.360092 14.3848 0.382338 14.4774 0.468115C14.5472 0.53274 14.548 0.539714 14.5458 1.02134C14.5416 1.94281 14.3292 2.75209 13.8768 3.57082C12.9429 5.261 11.2172 6.47936 9.15516 6.90435C8.53597 7.03197 8.26202 7.05727 7.49918 7.05727C6.7554 7.05727 6.47605 7.03268 5.89549 6.91618C3.25634 6.38651 1.12265 4.51006 0.586522 2.24726C0.485991 1.82288 0.454249 1.53231 0.452226 1.01716L0.450292 0.525181L0.546016 0.450833C0.598656 0.409929 0.675153 0.376459 0.715981 0.376459C0.813171 0.376459 0.953592 0.440575 0.991635 0.502324C1.00825 0.529253 1.02182 0.692356 1.02185 0.86475C1.02191 1.61279 1.16054 2.28862 1.45167 2.95994C1.58878 3.27617 1.70482 3.34673 1.88516 3.22353C1.98877 3.15275 1.98015 3.09843 1.78894 2.61633C1.55631 2.02991 1.46173 1.51678 1.46117 0.838279C1.46091 0.527573 1.45364 0.477482 1.39209 0.362689C1.32189 0.231758 1.20213 0.126103 1.04287 0.0545796C0.939288 0.00807686 0.659297 -0.013431 0.552699 0.0169345ZM1.01963 6.35657C1.16799 6.44831 1.26298 6.44925 1.44109 6.36077C1.62061 6.27156 1.68958 6.26423 1.81593 6.32099C1.99516 6.40147 2.07192 6.62683 1.97534 6.789C1.91828 6.88485 1.62422 7.11317 1.42017 7.22007C1.26641 7.3006 1.25055 7.30378 1.16192 7.27192C0.993569 7.21136 0.607009 6.93899 0.519667 6.81939C0.422477 6.68627 0.413714 6.58351 0.489185 6.46131C0.597014 6.28671 0.831723 6.24038 1.01963 6.35657ZM13.5573 6.36077C13.7354 6.44925 13.8304 6.44831 13.9787 6.35657C14.1666 6.24038 14.4013 6.28671 14.5092 6.46131C14.5847 6.58351 14.5759 6.68627 14.4787 6.81939C14.3914 6.93899 14.0048 7.21136 13.8364 7.27192C13.7478 7.30378 13.732 7.3006 13.5782 7.22007C13.3741 7.11317 13.0801 6.88485 13.023 6.789C12.9706 6.70095 12.968 6.54549 13.0175 6.4605C13.065 6.37895 13.2325 6.28156 13.3252 6.28156C13.3651 6.28156 13.4696 6.3172 13.5573 6.36077ZM3.32445 8.26362C3.46051 8.35655 3.55652 8.3566 3.76474 8.26387C3.94927 8.18168 3.95665 8.18056 4.07685 8.21694C4.3292 8.29327 4.41294 8.54615 4.25039 8.74102C4.15083 8.86036 3.93866 9.01774 3.72121 9.13348L3.56291 9.21775L3.41346 9.14966C3.2173 9.06035 2.95304 8.87866 2.85213 8.76377C2.74298 8.63948 2.72464 8.46439 2.80864 8.34817C2.92118 8.19248 3.1624 8.15292 3.32445 8.26362ZM11.2507 8.27085C11.3709 8.34805 11.5402 8.34858 11.6593 8.27209C11.7818 8.19344 11.8943 8.17878 12.0216 8.22493C12.2257 8.29902 12.3046 8.51738 12.1932 8.70001C12.126 8.80997 11.8004 9.05182 11.5916 9.14671L11.4355 9.21775L11.2772 9.13348C11.0597 9.01774 10.8475 8.86036 10.748 8.74102C10.4836 8.4241 10.893 8.04121 11.2507 8.27085ZM5.8323 10.0371C5.58042 10.2211 5.50005 10.6337 5.6607 10.9178C5.75838 11.0905 5.80317 11.1261 5.92269 11.1261C5.98618 11.1261 6.03518 11.1044 6.08486 11.0543C6.16414 10.9742 6.16183 10.9427 6.06215 10.7458C5.98219 10.588 5.99673 10.4854 6.12182 10.3252C6.22645 10.191 6.23246 10.1016 6.14175 10.0276C6.05186 9.95426 5.94095 9.95764 5.8323 10.0371Z" fill="url(#paint0_linear_12767_860)"/>
<defs>
<linearGradient id="paint0_linear_12767_860" x1="7.5" y1="0" x2="7.5" y2="13.0263" gradientUnits="userSpaceOnUse">
<stop stop-color="#FD9149"/>
<stop offset="1" stop-color="#FFD588"/>
</linearGradient>
</defs>
</svg>
