<svg width="18" height="19" viewBox="0 0 18 19" fill="none" xmlns="http://www.w3.org/2000/svg">
<path d="M9.17088 1.08869C5.37618 1.95945 0.894024 6.47827 0.0874196 10.2546C-0.141729 11.3546 0.0874196 12.4545 0.683207 13.0961C1.00402 13.4444 1.76479 13.7927 2.18642 13.7927C2.50723 13.7927 2.5164 13.811 2.58056 14.1777C2.66305 14.7093 2.95636 15.3417 3.24967 15.6626C3.53382 15.965 4.31292 16.3592 4.62457 16.3592C5.00037 16.3592 5.19286 16.5242 5.19286 16.845C5.19286 17.2299 5.55949 17.9907 5.88947 18.3024C6.63191 18.9898 7.97014 19.1731 9.31754 18.7515C13.0481 17.6057 17.1453 13.2886 17.906 9.72302C18.291 7.88983 17.4661 6.41411 15.9262 6.19413L15.5046 6.13913L15.3671 5.58917C15.2846 5.2867 15.1471 4.91089 15.0646 4.75507C14.7529 4.15928 14.0288 3.71932 13.1489 3.57266C12.8189 3.51767 12.8006 3.49934 12.8006 3.17853C12.8006 2.75689 12.4523 2.00528 12.104 1.67531C11.4715 1.07952 10.2616 0.841208 9.17088 1.08869ZM10.9399 2.39942C11.1782 2.50941 11.3157 2.6744 11.4532 2.96771C11.6182 3.34351 11.6274 3.46267 11.5449 4.03096C11.2974 5.69916 10.225 7.49569 8.36428 9.35638C6.50359 11.2171 4.70706 12.2895 3.03886 12.537C2.47057 12.6195 2.35141 12.6103 1.97561 12.4453C-0.105066 11.5195 2.58056 6.37745 6.54942 3.69182C8.30928 2.50941 10.0691 1.98695 10.9399 2.39942ZM13.4514 4.96589C14.3955 5.34169 14.3955 6.69825 13.4422 8.61394C12.3056 10.9146 9.92249 13.2977 7.62183 14.4343C6.20111 15.1401 5.20202 15.3143 4.49624 14.9934C4.19377 14.856 4.08378 14.7368 3.95545 14.4068C3.7263 13.8019 3.77213 13.7194 4.53291 13.4627C5.37618 13.1786 5.77031 12.9861 6.75107 12.3445C9.59251 10.5113 11.8932 7.62401 12.6723 4.92006C12.7181 4.76424 13.0023 4.78257 13.4514 4.96589ZM16.0637 7.55069C16.9528 7.95399 16.9619 9.20972 16.1095 11.0154C14.9363 13.4719 12.4798 15.9284 10.0233 17.1016C7.92431 18.1007 6.53109 17.8991 6.44859 16.5792L6.43026 16.2583L7.09021 16.0475C10.225 15.0393 14.0655 11.1804 15.0921 7.99065C15.3212 7.29404 15.4129 7.25738 16.0637 7.55069Z" fill="black"/>
<path d="M9.27164 4.68175C7.12681 5.90082 4.89948 8.12815 3.68041 10.2638C3.45126 10.6671 3.26794 11.0246 3.26794 11.0704C3.26794 11.1987 3.69874 11.0613 4.41369 10.7221C4.99114 10.4471 5.1103 10.3371 5.60526 9.65887C6.31104 8.68727 7.6951 7.30321 8.66669 6.59744C9.34497 6.10247 9.45496 5.98332 9.72994 5.40586C10.0691 4.70925 10.2066 4.26012 10.0874 4.26012C10.0416 4.26012 9.67495 4.4526 9.27164 4.68175Z" fill="black"/>
</svg>
