<svg width="25" height="25" viewBox="0 0 25 25" fill="none" xmlns="http://www.w3.org/2000/svg">
<path fill-rule="evenodd" clip-rule="evenodd" d="M10.6699 0.0143928C9.03311 0.0769649 7.9155 0.33638 6.58339 0.962821C3.00093 2.64758 0.457727 6.7114 0.0428819 11.4139C-0.204281 14.2157 0.628629 17.4806 2.241 20.0302C3.13548 21.4446 4.35983 22.6875 5.63784 23.4787C6.99189 24.3169 8.6399 24.8308 10.2167 24.9065C11.2662 24.9569 13.7056 24.9872 14.1613 24.9555C14.9479 24.9008 16.0958 24.7088 16.7958 24.5148C19.198 23.8491 21.0035 22.647 22.4121 20.7753C23.8715 18.8362 24.7622 16.2796 24.9682 13.438C25.2202 9.96252 23.9564 6.02498 21.7693 3.47118C20.0062 1.41261 17.5745 0.179543 15.0143 0.0458664C14.2204 0.00439122 11.455 -0.0156119 10.6699 0.0143928ZM15.1455 0.968696C16.1433 1.09922 17.0325 1.36385 17.9328 1.7982C18.6909 2.16397 19.3252 2.57888 19.9749 3.13391C21.95 4.82138 23.2945 7.19653 23.8262 9.93749C24.0088 10.8786 24.0761 11.7107 24.0526 12.7348C24.0271 13.8428 23.9105 14.7003 23.6436 15.7402C22.7282 19.308 20.3291 22.2227 17.3233 23.4191C16.239 23.8507 15.3074 24.0288 14.1392 24.0278C12.8425 24.0266 11.7845 23.8117 10.6357 23.3159C8.94291 22.5853 7.48369 21.3506 6.36229 19.6997C4.6821 17.2262 3.90985 14.0969 4.2314 11.0647C4.48341 8.68839 5.36874 6.45373 6.76442 4.67105C6.97714 4.39935 7.41543 3.9009 7.59498 3.72647C8.74204 2.61208 9.97291 1.83402 11.3199 1.37185C11.9274 1.16345 12.5196 1.03021 13.2328 0.941505C13.5174 0.906093 14.807 0.924439 15.1455 0.968696ZM10.0604 1.18961C9.98304 1.23408 9.79392 1.32735 9.64014 1.39682L9.36051 1.52316L9.03067 1.50344C8.84924 1.49256 8.65862 1.47193 8.60705 1.45755C8.51919 1.43308 8.51722 1.4293 8.57579 1.39783C8.69975 1.33122 9.83111 1.12185 10.1229 1.11153C10.1885 1.10919 10.1784 1.12175 10.0604 1.18961ZM8.27106 1.83017C8.49884 1.8529 8.68518 1.8804 8.68518 1.89128C8.68518 1.92831 8.03449 2.35819 7.97683 2.35925C7.81911 2.36216 6.55986 2.21689 6.55986 2.19579C6.55986 2.16973 6.96304 1.95935 7.24746 1.83705C7.43868 1.75482 7.51078 1.75432 8.27106 1.83017ZM6.63799 2.62533C6.89585 2.65164 7.19624 2.6884 7.30553 2.70703L7.50425 2.74084L7.2274 3.02067L6.95054 3.30046L6.76301 3.28158C6.263 3.2312 5.25637 3.10265 5.20612 3.08277C5.16111 3.06493 5.22487 3.00739 5.51626 2.80267C5.87119 2.55332 5.88763 2.54553 6.02609 2.56122C6.10479 2.57013 6.38014 2.59898 6.63799 2.62533ZM5.0781 3.48268C5.21406 3.49949 5.57045 3.54309 5.87006 3.57954C6.58599 3.66664 6.56229 3.65592 6.41874 3.82773C6.35539 3.90356 6.24068 4.03554 6.1638 4.12106L6.02399 4.27655L5.26831 4.18738C4.39949 4.08483 4.17877 4.04583 4.16095 3.99157C4.14589 3.94566 4.47185 3.59354 4.60643 3.51031C4.71482 3.4433 4.74526 3.44152 5.0781 3.48268ZM4.77833 4.51531C5.63646 4.62401 5.68507 4.63295 5.68366 4.68133C5.68194 4.73906 5.42781 5.08074 5.33601 5.14875C5.253 5.21023 5.25256 5.2102 4.46566 5.11046C3.51282 4.98969 3.30935 4.95519 3.30935 4.91437C3.30935 4.87121 3.61231 4.49412 3.69513 4.43426C3.74364 4.39916 3.80196 4.39063 3.9032 4.40388C3.98055 4.41398 4.37436 4.46414 4.77833 4.51531ZM4.0205 5.45242C4.52139 5.52118 4.94251 5.57766 4.95636 5.57791C4.97017 5.57819 5.0009 5.59069 5.02459 5.60569C5.05916 5.62757 5.04056 5.68402 4.93082 5.89017C4.85556 6.03163 4.75177 6.19419 4.70019 6.25145L4.60643 6.3555L3.6219 6.21629C3.08041 6.13971 2.60543 6.0698 2.56637 6.06089C2.48313 6.04195 2.4882 6.02873 2.70417 5.6999C2.87698 5.43673 2.97902 5.3274 3.05178 5.3274C3.0837 5.3274 3.51961 5.38366 4.0205 5.45242ZM3.05932 6.53009C3.94239 6.65057 4.46578 6.74037 4.46578 6.77134C4.46578 6.83629 4.15764 7.44195 4.0977 7.49483C4.0339 7.55109 4.01459 7.55006 3.3348 7.45513C2.32945 7.31471 1.90492 7.24642 1.87951 7.22097C1.85172 7.19319 2.15711 6.58716 2.24819 6.48942C2.29704 6.43701 2.33746 6.42216 2.39809 6.43442C2.44375 6.44364 2.7413 6.48667 3.05932 6.53009ZM2.66132 7.74843C3.18105 7.8251 3.68182 7.89748 3.77418 7.90924L3.94208 7.93061L3.92451 8.07889C3.91485 8.16043 3.86482 8.32014 3.81328 8.43379C3.72161 8.63594 3.71701 8.64041 3.6004 8.64041C3.42522 8.64041 1.6456 8.38734 1.48876 8.34012C1.45866 8.33105 1.43407 8.29464 1.43407 8.25917C1.43407 8.19687 1.67779 7.609 1.70361 7.609C1.71061 7.609 2.14158 7.67173 2.66132 7.74843ZM1.98102 8.81131C2.25607 8.85319 2.66394 8.91552 2.88741 8.9498C3.11089 8.98406 3.35702 9.02178 3.43437 9.0336C3.65394 9.06713 3.65156 9.06104 3.57396 9.39053C3.47013 9.83131 3.48938 9.80687 3.26572 9.78149C3.1608 9.76959 2.63191 9.68692 2.09042 9.59775L1.10589 9.43563L1.10942 9.31955C1.11139 9.25569 1.15149 9.09786 1.19856 8.96881C1.3007 8.68873 1.24726 8.69951 1.98102 8.81131ZM8.22627 9.84382C7.52313 9.99665 6.97092 10.5592 6.68434 11.4146C6.59196 11.6903 6.58089 11.7637 6.56701 12.1923C6.54342 12.9209 6.63427 13.414 6.88866 13.9381C7.12398 14.4229 7.43096 14.7419 7.87997 14.9682C8.17314 15.1159 8.3812 15.1527 8.8102 15.1328C9.28584 15.1106 9.44771 15.049 9.77648 14.7649C9.91478 14.6454 10.0352 14.5476 10.0442 14.5476C10.0531 14.5476 10.0604 14.6222 10.0604 14.7135C10.0604 14.9794 10.089 14.9989 10.4954 15.0113L10.8418 15.0219V13.6283V12.2347H9.90412H8.96648V12.7192V13.2036L9.25558 13.204C9.63664 13.2044 9.77929 13.2289 9.77842 13.2937C9.77726 13.3796 9.66727 13.5927 9.56254 13.712C9.43314 13.8594 9.18345 13.9525 8.85555 13.9756C8.3607 14.0106 8.13316 13.8872 7.94157 13.4802C7.79295 13.1644 7.73748 12.8919 7.73898 12.4848C7.74166 11.7447 8.03365 11.1268 8.43311 11.0158C8.58114 10.9747 8.89368 10.9763 9.09359 11.0192C9.30169 11.0638 9.45583 11.2021 9.57463 11.4506L9.66559 11.6409L10.1521 11.6404C10.7722 11.6399 10.7909 11.6352 10.7637 11.4881C10.7522 11.426 10.6909 11.2486 10.6273 11.0939C10.2693 10.2221 9.64083 9.79218 8.73488 9.79931C8.56145 9.80068 8.33257 9.82072 8.22627 9.84382ZM2.24097 10.0132C2.86526 10.1142 3.38399 10.2049 3.39374 10.2146C3.41853 10.2394 3.32229 10.8903 3.28891 10.9237C3.27329 10.9393 2.92686 10.8979 2.48063 10.827C1.21741 10.6264 0.936864 10.5704 0.848444 10.5014C0.844381 10.4983 0.868978 10.349 0.90314 10.1698C0.937301 9.9905 0.965243 9.84032 0.965243 9.83597C0.965243 9.81231 1.21175 9.84657 2.24097 10.0132ZM13.1029 9.92108C12.8715 9.97055 12.5189 10.1372 12.3046 10.2983C12.0488 10.4906 11.8737 10.7052 11.7142 11.0216C11.5468 11.3539 11.4712 11.649 11.43 12.1323C11.3063 13.5792 11.7915 14.5375 12.8447 14.9266C13.1833 15.0517 13.5715 15.0801 13.8735 15.0017C14.5515 14.8257 15.1193 14.269 15.3251 13.5787C15.5216 12.9195 15.5091 11.9333 15.2965 11.3248C15.0144 10.5175 14.2835 9.94049 13.4984 9.90523C13.3523 9.89867 13.1743 9.9058 13.1029 9.92108ZM16.0613 12.4896V14.9324L16.5378 14.9118C16.7998 14.9004 17.4257 14.8819 17.9286 14.8706L18.843 14.8501V14.3238V13.7975H17.9679H17.0927V11.9415V10.0854L17.0224 10.0666C16.9837 10.0562 16.7516 10.0475 16.5067 10.0473L16.0613 10.0469V12.4896ZM19.3431 12.4752V14.8289L19.6009 14.8268C19.7428 14.8257 20.1924 14.8142 20.6001 14.8012L21.3414 14.7775L21.6061 14.6464C22.1041 14.3996 22.4302 13.9551 22.5958 13.2974C22.7 12.8835 22.7139 12.1637 22.6259 11.7365C22.5054 11.1514 22.269 10.7464 21.8926 10.4803C21.5174 10.2151 21.1831 10.1567 19.8979 10.1321L19.3431 10.1214V12.4752ZM2.10536 11.1526L3.22987 11.3462L3.25582 11.4857C3.28491 11.6421 3.26063 12.0772 3.22059 12.1172C3.19943 12.1384 1.30526 11.8374 0.854226 11.7412L0.730832 11.7149L0.737395 11.5138C0.74099 11.4032 0.752554 11.2258 0.763056 11.1197L0.782184 10.9267L0.881543 10.9428C0.936176 10.9517 1.48689 11.0461 2.10536 11.1526ZM13.7614 11.0633C13.8616 11.0894 13.9841 11.1395 14.0335 11.1747C14.2495 11.3285 14.3982 11.748 14.4259 12.2816C14.4625 12.9885 14.2373 13.6591 13.9066 13.8277C13.7507 13.9073 13.4234 13.9569 13.2601 13.9257C13.0337 13.8824 12.7687 13.6365 12.6359 13.3464C12.5001 13.0498 12.4625 12.2828 12.5619 11.839C12.6331 11.5215 12.8034 11.2702 13.0592 11.1054C13.1733 11.0317 13.2321 11.0158 13.3886 11.0158C13.4933 11.0158 13.6611 11.0372 13.7614 11.0633ZM21.109 11.2473C21.561 11.4384 21.8321 12.0865 21.7475 12.7734C21.6902 13.2388 21.4954 13.5437 21.156 13.6993C21.0096 13.7664 20.9386 13.7782 20.6801 13.7783C20.513 13.7784 20.3682 13.7703 20.3583 13.7604C20.3283 13.7304 20.3255 11.2535 20.3554 11.2072C20.3944 11.1465 20.9394 11.1755 21.109 11.2473ZM2.06698 12.3474L3.24685 12.5581V12.8848V13.2116L3.11401 13.1916C2.87157 13.155 1.04635 12.8268 0.871479 12.7883L0.699577 12.7504L0.690638 12.4264L0.681668 12.1023L0.784403 12.1195C0.84088 12.129 1.41803 12.2316 2.06698 12.3474ZM1.7935 13.345C2.54492 13.4826 3.12342 13.5971 3.22053 13.6274C3.249 13.6363 3.27985 13.6632 3.28907 13.6872C3.31345 13.7507 3.3779 14.2394 3.36374 14.2536C3.35714 14.2602 3.09257 14.2167 2.77577 14.157C2.459 14.0973 1.88335 13.9895 1.49657 13.9174C1.1098 13.8453 0.781621 13.7765 0.767337 13.7643C0.733426 13.7356 0.675698 13.2702 0.698639 13.2104C0.720705 13.1529 0.79256 13.1618 1.7935 13.345ZM1.47023 14.2984C2.58209 14.5043 3.41981 14.6808 3.44009 14.7134C3.45185 14.7322 3.48398 14.8749 3.51154 15.0305C3.53911 15.186 3.56971 15.3538 3.57952 15.4033L3.5974 15.4933L3.44556 15.4716C3.0049 15.4084 0.941552 15.0031 0.912454 14.974C0.894513 14.9561 0.778589 14.3257 0.777995 14.2428C0.777558 14.1838 0.908484 14.1943 1.47023 14.2984ZM2.39671 15.6748C3.09635 15.8136 3.68744 15.9452 3.71023 15.9674C3.74595 16.0023 3.84641 16.3066 3.91451 16.5863C3.93451 16.6682 3.93139 16.6708 3.83328 16.6533C3.53308 16.5998 1.37009 16.1663 1.27245 16.14C1.14871 16.1068 1.16052 16.1372 1.01447 15.4774C1.00612 15.4398 1.02147 15.4227 1.06348 15.4227C1.09711 15.4227 1.69704 15.5362 2.39671 15.6748ZM1.88845 16.6708C2.55602 16.7936 3.72292 17.0369 3.92642 17.0959C4.06822 17.1369 4.0992 17.1609 4.15658 17.2733C4.2475 17.4515 4.37777 17.8028 4.35964 17.8209C4.33583 17.8447 1.63131 17.2645 1.55962 17.2202C1.53471 17.2048 1.37993 16.8264 1.32621 16.6495C1.29904 16.5601 1.28276 16.5595 1.88845 16.6708ZM2.35861 17.8117C2.98868 17.9396 4.49051 18.2616 4.56567 18.2849C4.62443 18.3031 5.01418 19.0416 4.98199 19.0738C4.9602 19.0956 4.26719 18.9603 2.99681 18.6862C2.07701 18.4877 2.14099 18.5248 1.89345 18.047C1.75918 17.7878 1.7378 17.7043 1.80569 17.7043C1.81894 17.7043 2.06776 17.7526 2.35861 17.8117ZM3.34061 19.1534C4.82946 19.47 5.3252 19.5888 5.36305 19.6379C5.55873 19.8916 5.78011 20.2526 5.74351 20.2584C5.71976 20.2621 5.04778 20.1209 4.25022 19.9446L2.80006 19.6241L2.60153 19.3152C2.49232 19.1454 2.40297 18.9964 2.40297 18.9841C2.40297 18.9594 2.57355 18.9902 3.34061 19.1534ZM4.27316 20.3447C6.31051 20.8023 6.18671 20.7609 6.45222 21.0721C6.56298 21.2019 6.65362 21.3207 6.65362 21.3361C6.65362 21.3728 6.65543 21.3731 5.03731 21.0052L3.64119 20.6877L3.41278 20.4313C3.20078 20.1933 3.14824 20.1109 3.2084 20.1109C3.22165 20.1109 3.70079 20.2161 4.27316 20.3447ZM5.67913 21.5488C6.49872 21.7379 7.19324 21.9032 7.22243 21.916C7.29531 21.948 7.94266 22.5204 7.92547 22.5376C7.90938 22.5537 7.63802 22.4936 5.98164 22.1076L4.7627 21.8235L4.45034 21.5141C4.27854 21.344 4.14945 21.2049 4.16346 21.2049C4.17746 21.2049 4.85953 21.3596 5.67913 21.5488ZM7.19789 22.7682L8.75782 23.1127L9.25399 23.413C9.52688 23.5782 9.7441 23.7194 9.73672 23.7268C9.71941 23.7441 9.48953 23.6999 8.01321 23.3952C6.67181 23.1184 6.73291 23.1392 6.04931 22.7291C5.63424 22.4802 5.55273 22.4238 5.60821 22.4238C5.62459 22.4238 6.33995 22.5788 7.19789 22.7682Z" fill="#FD9149"/>
</svg>
