<svg width="15" height="12" viewBox="0 0 15 12" fill="none" xmlns="http://www.w3.org/2000/svg">
<path fill-rule="evenodd" clip-rule="evenodd" d="M9.5626 0.00354618C8.33331 0.117615 7.08608 0.497933 5.71021 1.17824C4.53143 1.76111 3.29537 2.60745 2.35227 3.47745C1.02969 4.69751 0.204153 5.9707 0.0239734 7.06819C-0.0169184 7.31721 -0.0038766 7.74049 0.0507523 7.93714C0.213568 8.52338 0.653737 9.1581 1.27392 9.7009C1.80271 10.1637 2.25098 10.435 2.92041 10.6974C4.08846 11.1552 5.46615 11.2797 6.83483 11.0512C8.47322 10.7777 10.1141 10.0286 11.7716 8.79748C13.704 7.36223 14.7496 5.97547 14.9766 4.54652C15.0114 4.32749 15.0065 3.7931 14.9677 3.58007C14.8998 3.20761 14.7942 2.90044 14.6233 2.57861C14.3263 2.01906 13.9369 1.58341 13.3648 1.17043C12.621 0.633557 11.7836 0.255831 10.9789 0.0942241C10.5644 0.0109696 10.5007 0.00456867 10.0512 0.000898969C9.81865 -0.000991906 9.59878 0.000198633 9.5626 0.00354618ZM10.6244 0.573764C10.7277 0.593779 10.8922 0.639524 10.9898 0.675423C11.1357 0.729082 11.1962 0.762123 11.3301 0.861275C11.4665 0.962261 11.5073 1.00351 11.5805 1.11493C11.7153 1.31987 11.763 1.47953 11.775 1.76672C11.7839 1.97919 11.7664 2.197 11.7292 2.337L11.719 2.37551H11.406C9.9071 2.37551 8.08624 2.95881 6.4908 3.95007C6.19249 4.13541 5.58327 4.58984 5.31561 4.82665C4.76596 5.31297 4.33377 5.80073 3.9815 6.33234C3.76589 6.65769 3.66122 6.84418 3.53056 7.13583C3.30565 7.63775 3.19463 8.13341 3.21594 8.54038L3.22594 8.73149L3.09155 8.74832C3.01763 8.75758 2.78802 8.76838 2.58131 8.77234C2.28086 8.77809 2.17154 8.77489 2.03633 8.7564C1.30506 8.65644 0.898242 8.36198 0.755403 7.82924C0.705698 7.64384 0.710471 7.23307 0.765118 6.9924C0.999325 5.9611 1.79769 4.80494 3.04638 3.68883C4.67128 2.23643 6.85151 1.07697 8.71389 0.674807C9.23927 0.561354 9.57035 0.526394 10.0606 0.532599C10.3918 0.536801 10.4587 0.541675 10.6244 0.573764ZM8.51939 1.0701C8.14261 1.1672 7.93507 1.38016 7.62258 1.99034C7.55551 2.1213 7.46044 2.31887 7.41131 2.42938C7.31559 2.6448 7.25836 2.71316 7.14401 2.74877C7.01991 2.78742 6.8225 2.75805 6.73979 2.68863C6.65534 2.61773 6.62612 2.48691 6.6752 2.39935C6.71055 2.33631 6.81686 2.27089 6.92911 2.2431C7.06477 2.20951 7.13841 2.14332 7.13841 2.05495C7.13841 1.97074 7.08176 1.90266 6.98107 1.86589C6.91708 1.84253 6.89723 1.84142 6.80805 1.85631C6.65675 1.88153 6.49504 1.94783 6.38135 2.03122C6.30148 2.0898 6.24919 2.15061 6.13762 2.31457C5.94658 2.5953 5.79539 2.93016 5.61679 3.46802C5.5441 3.68693 5.53354 3.70656 5.45995 3.75945C5.24914 3.911 4.89237 3.81579 4.86854 3.60164C4.86398 3.56069 4.87016 3.50483 4.88224 3.47752C4.91047 3.4138 5.0295 3.33364 5.12414 3.31465C5.27616 3.28414 5.36383 3.1981 5.34819 3.09473C5.33572 3.01222 5.29067 2.96639 5.18916 2.93293C5.10645 2.90566 5.0995 2.90549 4.98738 2.92811C4.66826 2.9925 4.45262 3.16276 4.25635 3.50536C4.06709 3.83569 3.97952 4.15865 3.92467 4.7286C3.91319 4.84801 3.8955 4.96942 3.88539 4.99841C3.84441 5.11585 3.6706 5.2015 3.50199 5.18734C3.17965 5.16027 3.08101 4.84703 3.34959 4.70328C3.52287 4.61051 3.54046 4.45552 3.38785 4.36605C3.26264 4.29264 3.10234 4.32092 2.92962 4.44688C2.80601 4.53704 2.71552 4.65896 2.6764 4.78813C2.60102 5.0369 2.59093 5.50126 2.6487 6.0631C2.69038 6.46873 2.68839 6.55889 2.63582 6.64143C2.58629 6.71923 2.45997 6.77355 2.32863 6.77352C2.20112 6.77351 2.11543 6.74321 2.03767 6.6707C1.98511 6.62168 1.97996 6.60775 1.97996 6.51457C1.97996 6.41974 1.98451 6.40805 2.04207 6.35466C2.17303 6.23321 2.18436 6.14013 2.07909 6.05077C1.88077 5.88241 1.56514 6.03856 1.45438 6.3598C1.3156 6.76227 1.75485 7.17874 2.31897 7.17957C2.66005 7.18007 2.97989 7.02928 3.12643 6.79887C3.17715 6.71913 3.19649 6.66487 3.21398 6.55335C3.2365 6.40974 3.23199 6.31734 3.17315 5.71689C3.16338 5.61719 3.15812 5.5336 3.16144 5.53112C3.16477 5.52864 3.19732 5.53589 3.23377 5.54724C3.58911 5.6579 4.05984 5.54751 4.27988 5.3019C4.37681 5.19372 4.42486 5.07362 4.45044 4.87567C4.52014 4.33607 4.56984 4.05629 4.59602 4.05629C4.60121 4.05629 4.63766 4.0753 4.67701 4.09854C4.78204 4.16054 4.9436 4.21127 5.08961 4.22812C5.45063 4.26978 5.85036 4.11476 6.00831 3.87184C6.04003 3.82307 6.09629 3.69177 6.13335 3.58007C6.20014 3.3788 6.31003 3.08948 6.3479 3.01523L6.36758 2.97669L6.4664 3.03228C6.66237 3.14251 6.90637 3.19044 7.13056 3.16275C7.2789 3.14443 7.46628 3.08154 7.58071 3.01165C7.68457 2.94821 7.80144 2.81973 7.84385 2.72236C7.92107 2.54509 8.10255 2.1713 8.11707 2.15965C8.12634 2.15221 8.16899 2.17162 8.21917 2.20608C8.39988 2.33023 8.67994 2.39215 8.92271 2.36163C9.07623 2.34233 9.27721 2.27331 9.3868 2.20225C9.58895 2.07118 9.72916 1.80722 9.65422 1.69878C9.56623 1.57146 9.37525 1.54245 9.23391 1.63495C9.18699 1.66565 9.16049 1.70022 9.13792 1.7602C9.11383 1.82416 9.0884 1.85564 9.02628 1.89831C8.75321 2.08592 8.32944 1.87139 8.46202 1.61265C8.50387 1.53097 8.59806 1.47128 8.73036 1.44261C8.94953 1.39513 9.03173 1.25357 8.91634 1.12231C8.85117 1.04818 8.68779 1.02669 8.51939 1.0701ZM12.6257 1.38942C12.813 1.50814 13.1242 1.74256 13.2632 1.86959C13.6963 2.26521 14.0385 2.79711 14.1925 3.31395C14.336 3.79553 14.3406 4.35376 14.2053 4.8441C13.9271 5.85171 13.201 6.83264 11.958 7.88006C11.6454 8.14344 10.9428 8.66725 10.5962 8.89536C9.01406 9.9365 7.49481 10.5038 5.99686 10.6128C5.64137 10.6387 4.9881 10.6221 4.65784 10.5788C3.77401 10.4628 2.97247 10.1779 2.31782 9.74711C2.13492 9.62674 1.70866 9.27454 1.72882 9.26044C1.73258 9.25782 1.79063 9.26421 1.85781 9.27463C2.08914 9.31056 2.46029 9.32449 2.76226 9.30859C3.25937 9.28242 3.72098 9.2102 4.282 9.07081C7.39115 8.29834 10.7867 5.85535 12.0304 3.49603C12.449 2.70199 12.5985 1.97389 12.4595 1.40639C12.4388 1.32206 12.4338 1.27398 12.4461 1.2794C12.4571 1.2842 12.5379 1.3337 12.6257 1.38942ZM11.527 2.9459C11.4718 3.10992 11.236 3.538 11.0273 3.8532C9.84268 5.64195 7.32419 7.47896 4.92094 8.30719C4.60329 8.41666 4.00493 8.59439 3.95406 8.59439C3.93141 8.59439 3.92604 8.43419 3.94312 8.26873C4.03272 7.40059 4.60427 6.39827 5.53687 5.47385C6.0306 4.98443 6.73718 4.45989 7.4015 4.0896C8.69202 3.37025 10.1973 2.91646 11.317 2.9092L11.5399 2.90776L11.527 2.9459ZM11.8071 4.79041C11.6752 4.8332 11.5147 5.0267 11.4664 5.20089C11.4187 5.37317 11.4265 5.75619 11.4862 6.17827C11.5657 6.74045 11.5532 6.87348 11.4113 6.97224C11.3373 7.02376 11.2719 7.03967 11.134 7.03967C11.0302 7.03967 11.0111 7.03523 10.9684 7.00115C10.8879 6.93678 10.8703 6.8984 10.8704 6.78756C10.8705 6.66424 10.9124 6.55991 10.9919 6.48536C11.096 6.38774 11.0529 6.23108 10.9078 6.17976C10.7679 6.13027 10.6799 6.15413 10.4912 6.29269C10.298 6.43458 10.1693 6.60252 10.0959 6.80856C10.0422 6.9592 10.0463 7.32112 10.1037 7.5074C10.1502 7.65802 10.1631 7.80651 10.1391 7.91234C10.1273 7.96392 10.1051 7.99418 10.0437 8.0419C9.96583 8.1025 9.96055 8.10416 9.84697 8.10416C9.69932 8.10416 9.59964 8.06808 9.52974 7.98935C9.48742 7.94169 9.47804 7.91551 9.47804 7.84504C9.47804 7.7553 9.47693 7.75708 9.6289 7.60136C9.7121 7.51613 9.67511 7.38996 9.55007 7.33236C9.49764 7.3082 9.46481 7.30372 9.37919 7.30902C9.27965 7.31516 9.26772 7.32004 9.18216 7.3894C8.96565 7.56489 8.8513 7.86395 8.7822 8.43539C8.74528 8.74066 8.73509 8.77189 8.65299 8.8312C8.47557 8.95937 8.1723 8.91759 8.07366 8.75139C8.00733 8.63962 8.03691 8.55456 8.19196 8.41109C8.31775 8.29469 8.1864 8.10416 7.98034 8.10416C7.877 8.10416 7.81768 8.13138 7.68384 8.24019C7.36108 8.50256 7.1299 8.87955 6.99559 9.36249C6.92803 9.60541 6.87247 9.66587 6.68426 9.70118C6.4117 9.75235 6.17306 9.53836 6.28331 9.34169C6.29878 9.31409 6.33636 9.27034 6.36684 9.24447C6.53011 9.10588 6.42692 8.90276 6.19317 8.90259C6.09956 8.90252 6.03541 8.9286 5.94062 9.00524C5.73575 9.1709 5.65939 9.43905 5.75805 9.64636C5.81618 9.7685 5.7448 9.92134 5.60685 9.97012C5.56551 9.98474 5.51054 10.0042 5.4847 10.0134C5.45886 10.0226 5.41816 10.0595 5.39427 10.0954C5.33613 10.1826 5.35186 10.2489 5.44772 10.3207C5.5114 10.3684 5.52717 10.3732 5.61873 10.3732C5.81108 10.3732 6.06611 10.2515 6.16329 10.1133C6.19865 10.063 6.21619 10.051 6.24578 10.0565C6.26646 10.0604 6.32962 10.0733 6.38612 10.0853C6.67936 10.1475 7.00835 10.0802 7.23399 9.91203C7.37713 9.80535 7.45098 9.69184 7.50732 9.49197C7.53249 9.40273 7.57941 9.26532 7.61164 9.1866L7.67021 9.04345L7.78176 9.12043C7.96194 9.24475 8.17091 9.30872 8.39694 9.30872C8.74126 9.30872 9.05307 9.17028 9.19642 8.95377C9.25349 8.86755 9.26665 8.82802 9.29033 8.67143C9.30547 8.57128 9.32229 8.46997 9.3277 8.4463L9.33755 8.40326L9.44538 8.44213C9.50469 8.46351 9.58346 8.48483 9.62043 8.4895L9.68767 8.49798L9.67944 8.57191C9.66271 8.72226 9.82013 8.82575 10.0086 8.7883C10.0987 8.77038 10.2752 8.63456 10.3824 8.50059C10.653 8.16258 10.7379 7.82583 10.6443 7.46263C10.6258 7.39095 10.6152 7.32895 10.6208 7.32481C10.6263 7.32068 10.6632 7.33379 10.7028 7.35394C10.8034 7.4052 10.9926 7.4459 11.129 7.44565C11.5021 7.44498 11.8238 7.30096 11.973 7.06768C12.0961 6.87539 12.1051 6.74133 12.0312 6.19484C12.0129 6.05922 12.0031 5.94434 12.0095 5.93956C12.0159 5.9348 12.0409 5.93879 12.065 5.94844C12.0892 5.95811 12.1948 5.96886 12.2997 5.97236C12.5993 5.98235 12.8121 5.92183 13.0033 5.77231C13.17 5.64198 13.2348 5.50934 13.2226 5.32388C13.2083 5.1066 13.0919 4.94138 12.9502 4.93715C12.7942 4.9325 12.7168 4.9614 12.6629 5.04436C12.6167 5.11548 12.6169 5.13357 12.6644 5.24672C12.7114 5.35843 12.6999 5.42683 12.6233 5.49191C12.566 5.54053 12.4339 5.583 12.3399 5.583C12.2134 5.583 12.0802 5.51542 12.0223 5.42192C11.9586 5.31898 11.9815 5.24565 12.1247 5.09487C12.1931 5.02281 12.2063 4.9472 12.1616 4.88295C12.0937 4.78517 11.9437 4.74604 11.8071 4.79041Z" fill="url(#paint0_linear_12767_861)"/>
<defs>
<linearGradient id="paint0_linear_12767_861" x1="7.5" y1="0" x2="7.5" y2="11.1628" gradientUnits="userSpaceOnUse">
<stop stop-color="#FD9149"/>
<stop offset="1" stop-color="#FFD588"/>
</linearGradient>
</defs>
</svg>
