<svg width="60" height="60" viewBox="0 0 60 60" fill="none" xmlns="http://www.w3.org/2000/svg">
<path fill-rule="evenodd" clip-rule="evenodd" d="M26.7837 0.19695C22.666 0.813896 18.3003 2.64327 14.8003 5.21805C11.2756 7.81076 7.44074 12.6361 5.77035 16.5803C5.12169 18.1121 5.10196 18.2899 5.53044 18.7627C6.18838 19.4895 6.78599 19.1173 7.51994 17.524C11.1494 9.64271 18.381 3.87525 26.3485 2.50714C29.0032 2.05131 33.6326 2.29732 36.2119 3.03087C43.1954 5.01689 49.4041 10.5675 52.6756 17.7485C53.3698 19.2723 54.7782 23.5836 54.7782 24.1845C54.7782 24.2518 54.2047 23.999 53.5035 23.623C52.0472 22.8417 51.2106 23.0076 51.3492 24.05C51.4551 24.846 55.1031 27.4951 56.1135 27.5095C56.8809 27.5207 60 23.5144 60 22.5175C60 21.7709 59.2904 21.2849 58.7445 21.6575C58.5614 21.7824 58.1045 22.2872 57.7294 22.7796C56.8315 23.9577 56.6227 23.9103 56.3828 22.4733C56.2725 21.8128 55.793 20.191 55.3172 18.8697C52.5825 11.2744 46.4271 4.67734 39.4883 1.90492C35.4666 0.298172 30.5338 -0.365222 26.7837 0.19695ZM20.1114 19.1682L14.3094 23.277L14.0918 30.443C13.972 34.384 13.9068 39.9151 13.9468 42.7339L14.0193 47.8591L25.4782 47.9283L36.9371 47.9978L41.6393 42.4828L46.3419 36.9681L46.3535 26.5165C46.3624 18.5253 46.2801 15.9906 46.0027 15.7481C45.7895 15.5617 41.5767 15.3544 35.7767 15.2449L25.9134 15.0591L20.1114 19.1682ZM28.5098 17.5288C28.358 17.6723 26.784 18.9696 25.0112 20.4117C21.9248 22.9228 21.7226 23.0339 20.239 23.0339C19.2623 23.0339 18.7917 22.9218 18.9655 22.7302C19.1169 22.563 20.8729 21.2699 22.8673 19.8563C25.8127 17.7684 26.7088 17.2841 27.6395 17.277C28.2698 17.2722 28.6615 17.3853 28.5098 17.5288ZM34.4577 17.5083C34.4504 17.6403 33.1377 18.8296 31.5407 20.151C27.0819 23.8402 27.5089 22.9561 27.5089 28.5003V33.3007L26.6015 32.7827C25.7402 32.2907 25.3288 32.2955 23.8102 32.8154L23.1574 33.0386V28.8469V24.6551L27.5814 20.987C31.5514 17.6957 32.1319 17.3164 33.2384 17.2937C33.9166 17.2796 34.4652 17.3763 34.4577 17.5083ZM42.1444 17.8667C41.993 18.0199 40.5834 19.2451 39.0125 20.5895L36.1562 23.0339H34.0083C32.827 23.0339 31.8656 22.9256 31.8723 22.7937C31.879 22.6617 33.2169 21.438 34.8458 20.0747L37.8074 17.5961L40.1137 17.5922C41.4369 17.59 42.3025 17.7069 42.1444 17.8667ZM44.3347 27.4586V36.0475L40.8535 40.1053L37.3723 44.1632L37.3732 39.2843C37.3737 36.601 37.4581 32.1696 37.5608 29.4372L37.7474 24.469L40.9686 21.6837C42.74 20.1519 44.2224 18.8924 44.2621 18.8841C44.3019 18.8761 44.3347 22.7347 44.3347 27.4586ZM21.3513 30.4946C21.4438 36.7454 21.4804 36.8159 23.876 35.385L25.3686 34.4935L26.8916 35.3456C29.4865 36.7976 29.5396 36.7009 29.5396 30.5401V25.2762H32.6321H35.7242L35.5331 32.5354C35.4277 36.5276 35.3416 41.2124 35.3416 42.946V46.0973H25.6233H15.905L15.9064 39.1303C15.907 35.2982 15.9926 30.5362 16.0961 28.5477L16.285 24.9325L18.7784 25.0241L21.2718 25.116L21.3513 30.4946ZM1.85314 27.5444C0.483877 29.1473 -0.0583182 30.0157 0.00492335 30.5042C0.135758 31.5129 1.04899 31.5466 1.96599 30.5766L2.76493 29.7316L2.96538 32.3887C3.96535 45.6434 12.5453 56.4781 24.3924 59.4466C27.7564 60.2894 33.3562 60.1542 36.8106 59.1461C46.6322 56.2811 54.0805 47.9248 56.5113 37.044C57.2847 33.5829 57.2255 32.8384 56.1663 32.7036C55.5072 32.6196 55.3494 32.7503 55.1997 33.5044C54.3576 37.7474 53.717 39.9429 52.5865 42.4616C49.4395 49.4729 43.348 54.9418 36.3569 57.0326C33.0588 58.0192 27.1791 58.0189 23.8827 57.0323C19.199 55.6302 15.3166 53.0987 11.9579 49.2564C7.64671 44.3247 5.38278 38.7363 4.97084 32.0117L4.78517 28.9769L5.73351 30.1698C6.7416 31.4373 7.48425 31.6641 8.07113 30.8835C8.36035 30.4985 8.34353 30.263 7.98439 29.6823C7.2191 28.4442 4.4269 25.2762 4.10112 25.2762C3.93054 25.2762 2.91897 26.2971 1.85314 27.5444Z" fill="#FD9149"/>
<path fill-rule="evenodd" clip-rule="evenodd" d="M26.7837 0.19695C22.666 0.813896 18.3003 2.64327 14.8003 5.21805C11.2756 7.81076 7.44074 12.6361 5.77035 16.5803C5.12169 18.1121 5.10196 18.2899 5.53044 18.7627C6.18838 19.4895 6.78599 19.1173 7.51994 17.524C11.1494 9.64271 18.381 3.87525 26.3485 2.50714C29.0032 2.05131 33.6326 2.29732 36.2119 3.03087C43.1954 5.01689 49.4041 10.5675 52.6756 17.7485C53.3698 19.2723 54.7782 23.5836 54.7782 24.1845C54.7782 24.2518 54.2047 23.999 53.5035 23.623C52.0472 22.8417 51.2106 23.0076 51.3492 24.05C51.4551 24.846 55.1031 27.4951 56.1135 27.5095C56.8809 27.5207 60 23.5144 60 22.5175C60 21.7709 59.2904 21.2849 58.7445 21.6575C58.5614 21.7824 58.1045 22.2872 57.7294 22.7796C56.8315 23.9577 56.6227 23.9103 56.3828 22.4733C56.2725 21.8128 55.793 20.191 55.3172 18.8697C52.5825 11.2744 46.4271 4.67734 39.4883 1.90492C35.4666 0.298172 30.5338 -0.365222 26.7837 0.19695ZM20.1114 19.1682L14.3094 23.277L14.0918 30.443C13.972 34.384 13.9068 39.9151 13.9468 42.7339L14.0193 47.8591L25.4782 47.9283L36.9371 47.9978L41.6393 42.4828L46.3419 36.9681L46.3535 26.5165C46.3624 18.5253 46.2801 15.9906 46.0027 15.7481C45.7895 15.5617 41.5767 15.3544 35.7767 15.2449L25.9134 15.0591L20.1114 19.1682ZM28.5098 17.5288C28.358 17.6723 26.784 18.9696 25.0112 20.4117C21.9248 22.9228 21.7226 23.0339 20.239 23.0339C19.2623 23.0339 18.7917 22.9218 18.9655 22.7302C19.1169 22.563 20.8729 21.2699 22.8673 19.8563C25.8127 17.7684 26.7088 17.2841 27.6395 17.277C28.2698 17.2722 28.6615 17.3853 28.5098 17.5288ZM34.4577 17.5083C34.4504 17.6403 33.1377 18.8296 31.5407 20.151C27.0819 23.8402 27.5089 22.9561 27.5089 28.5003V33.3007L26.6015 32.7827C25.7402 32.2907 25.3288 32.2955 23.8102 32.8154L23.1574 33.0386V28.8469V24.6551L27.5814 20.987C31.5514 17.6957 32.1319 17.3164 33.2384 17.2937C33.9166 17.2796 34.4652 17.3763 34.4577 17.5083ZM42.1444 17.8667C41.993 18.0199 40.5834 19.2451 39.0125 20.5895L36.1562 23.0339H34.0083C32.827 23.0339 31.8656 22.9256 31.8723 22.7937C31.879 22.6617 33.2169 21.438 34.8458 20.0747L37.8074 17.5961L40.1137 17.5922C41.4369 17.59 42.3025 17.7069 42.1444 17.8667ZM44.3347 27.4586V36.0475L40.8535 40.1053L37.3723 44.1632L37.3732 39.2843C37.3737 36.601 37.4581 32.1696 37.5608 29.4372L37.7474 24.469L40.9686 21.6837C42.74 20.1519 44.2224 18.8924 44.2621 18.8841C44.3019 18.8761 44.3347 22.7347 44.3347 27.4586ZM21.3513 30.4946C21.4438 36.7454 21.4804 36.8159 23.876 35.385L25.3686 34.4935L26.8916 35.3456C29.4865 36.7976 29.5396 36.7009 29.5396 30.5401V25.2762H32.6321H35.7242L35.5331 32.5354C35.4277 36.5276 35.3416 41.2124 35.3416 42.946V46.0973H25.6233H15.905L15.9064 39.1303C15.907 35.2982 15.9926 30.5362 16.0961 28.5477L16.285 24.9325L18.7784 25.0241L21.2718 25.116L21.3513 30.4946ZM1.85314 27.5444C0.483877 29.1473 -0.0583182 30.0157 0.00492335 30.5042C0.135758 31.5129 1.04899 31.5466 1.96599 30.5766L2.76493 29.7316L2.96538 32.3887C3.96535 45.6434 12.5453 56.4781 24.3924 59.4466C27.7564 60.2894 33.3562 60.1542 36.8106 59.1461C46.6322 56.2811 54.0805 47.9248 56.5113 37.044C57.2847 33.5829 57.2255 32.8384 56.1663 32.7036C55.5072 32.6196 55.3494 32.7503 55.1997 33.5044C54.3576 37.7474 53.717 39.9429 52.5865 42.4616C49.4395 49.4729 43.348 54.9418 36.3569 57.0326C33.0588 58.0192 27.1791 58.0189 23.8827 57.0323C19.199 55.6302 15.3166 53.0987 11.9579 49.2564C7.64671 44.3247 5.38278 38.7363 4.97084 32.0117L4.78517 28.9769L5.73351 30.1698C6.7416 31.4373 7.48425 31.6641 8.07113 30.8835C8.36035 30.4985 8.34353 30.263 7.98439 29.6823C7.2191 28.4442 4.4269 25.2762 4.10112 25.2762C3.93054 25.2762 2.91897 26.2971 1.85314 27.5444Z" fill="url(#paint0_linear_11277_13)"/>
<defs>
<linearGradient id="paint0_linear_11277_13" x1="30" y1="0" x2="30" y2="60" gradientUnits="userSpaceOnUse">
<stop offset="0.323897" stop-color="#FFD588"/>
<stop offset="1" stop-color="#FD9149" stop-opacity="0"/>
</linearGradient>
</defs>
</svg>
