<svg width="55" height="55" viewBox="0 0 55 55" fill="none" xmlns="http://www.w3.org/2000/svg">
<path fill-rule="evenodd" clip-rule="evenodd" d="M25.1517 0.232237C23.1784 0.832601 21.0067 2.527 19.6119 4.5542C18.9438 5.52523 10.7731 20.9122 2.88988 36.0457C0.527945 40.5797 0 42.2003 0 44.9165C0 49.6791 2.96395 53.2235 8.08668 54.5873C9.257 54.8991 12.9949 54.9726 27.5029 54.9699C38.6221 54.9677 45.9317 54.8599 46.6825 54.6866C49.9217 53.94 52.8793 51.7088 54.1716 49.037C54.6614 48.0242 54.8695 47.0524 54.9502 45.4008C55.131 41.7016 55.2451 41.9777 47.1949 26.6477C45.678 23.7592 43.7191 20.0277 42.8418 18.3554C35.5478 4.45137 35.3029 4.03427 33.4385 2.3501C31.651 0.735028 29.7769 -0.024549 27.6411 0.0006044C26.6529 0.0122137 25.5326 0.116421 25.1517 0.232237ZM29.7863 3.87865C32.0189 4.95942 31.45 3.97595 47.1129 33.8344C51.544 42.2812 51.4052 41.9642 51.6048 44.1017C51.8923 47.1809 50.5561 49.3869 47.5427 50.808L46.0224 51.5247H27.5029H8.98335L7.46309 50.808C4.42561 49.3756 3.11294 47.1856 3.40676 44.04C3.60025 41.967 3.66438 41.8324 12.017 25.9567C14.9367 20.4077 18.4162 13.7907 19.7493 11.2522C21.0827 8.71363 22.5927 6.14688 23.1052 5.54817C24.95 3.39272 27.4777 2.76112 29.7863 3.87865ZM23.2193 18.8391C23.2196 18.8773 23.5925 22.5776 24.0477 27.0623C24.503 31.5471 24.8759 35.434 24.8762 35.7002C24.877 36.127 25.1866 36.1839 27.5029 36.1839C29.8192 36.1839 30.1288 36.127 30.1296 35.7002C30.1299 35.434 30.5028 31.5471 30.958 27.0623C31.4133 22.5776 31.7861 18.8773 31.7864 18.8391C31.787 18.801 29.8593 18.77 27.5029 18.77C25.1465 18.77 23.2188 18.801 23.2193 18.8391ZM26.34 39.9505C25.1899 40.5175 24.6691 41.9249 25.1656 43.1235C25.5064 43.9466 26.6629 44.7526 27.5029 44.7526C28.3429 44.7526 29.4994 43.9466 29.8402 43.1235C30.3604 41.8675 29.7885 40.3906 28.5872 39.8886C27.4462 39.4121 27.4313 39.4124 26.34 39.9505Z" fill="#FD9149"/>
</svg>
