<svg width="11" height="3" viewBox="0 0 11 3" fill="none" xmlns="http://www.w3.org/2000/svg">
<rect width="11" height="3" rx="1.5" fill="#FD9149"/>
<rect width="11" height="3" rx="1.5" fill="url(#paint0_radial_135_689)"/>
<defs>
<radialGradient id="paint0_radial_135_689" cx="0" cy="0" r="1" gradientUnits="userSpaceOnUse" gradientTransform="translate(5.5 1.5) rotate(90) scale(1.5 5.5)">
<stop stop-color="#FFD588"/>
<stop offset="1" stop-color="#FFD588" stop-opacity="0"/>
</radialGradient>
</defs>
</svg>
