<svg width="60" height="61" viewBox="0 0 60 61" fill="none" xmlns="http://www.w3.org/2000/svg">
<path fill-rule="evenodd" clip-rule="evenodd" d="M30.9679 0.391909C29.3823 1.26349 28.6599 3.11789 29.2752 4.73651C29.4242 5.12792 29.4552 5.45691 29.3445 5.46745C29.2339 5.47827 28.02 5.51683 26.6469 5.55372C22.3175 5.66912 20.6828 7.21117 20.6828 11.1796C20.6828 12.9719 20.8767 13.4926 21.5447 13.4926C22.0507 13.4926 22.0698 13.8745 22.0698 23.946C22.0698 34.0072 22.0917 34.4449 22.6537 35.6061C23.054 36.4325 23.5747 36.9842 24.3073 37.3579C25.3242 37.8769 25.9958 37.9035 38.0828 37.9035C52.4032 37.9035 52.1092 37.944 53.3419 35.7942C53.953 34.7279 53.9614 34.5709 53.9661 24.1224L53.9705 13.5311L54.5947 13.4426C55.1725 13.3605 55.2249 13.1938 55.2998 11.2013C55.3972 8.61674 54.917 7.37789 53.4418 6.407C52.6002 5.85303 51.991 5.72987 49.5322 5.61641C47.2974 5.5135 46.6469 5.39755 46.7379 5.11821C46.8034 4.9182 46.9063 4.25522 46.9671 3.64495C47.1992 1.31425 44.8716 -0.536818 42.5742 0.151682C41.6521 0.42797 41.188 0.86182 39.879 2.67212C39.0091 3.87463 38.1727 4.86245 38.0202 4.86716C37.8676 4.87188 37.1405 4.00251 36.4043 2.93537C35.6684 1.8685 34.7765 0.805508 34.4226 0.573604C33.3646 -0.119612 32.0267 -0.189794 30.9679 0.391909ZM33.8054 1.91121C34.174 2.25463 34.9333 3.18086 35.4925 3.9695L36.5092 5.40365L34.3518 5.50878C31.979 5.62418 31.1324 5.32709 30.6175 4.19752C30.0505 2.95284 31.1745 1.3653 32.6647 1.30593C32.9232 1.29539 33.4364 1.5678 33.8054 1.91121ZM44.9676 1.96808C45.7823 2.78252 45.8589 4.01722 45.1493 4.89351C44.7032 5.44443 44.3867 5.51183 42.1672 5.52792C40.8019 5.53763 39.7015 5.45108 39.7223 5.33541C39.7947 4.93318 42.1733 1.79609 42.5919 1.55088C43.3448 1.10954 44.2721 1.27237 44.9676 1.96808ZM52.647 7.50494C53.5697 8.10938 53.9705 9.08666 53.9705 10.7316V12.1056H38.0202H22.0698V10.8434C22.0698 8.7008 23.0071 7.42088 24.7888 7.13073C25.3531 7.03863 31.6983 6.98454 38.8892 7.01033C50.401 7.05167 52.0457 7.11075 52.647 7.50494ZM52.5835 23.9088C52.5835 35.207 52.5461 35.5107 51.0656 36.1851C50.536 36.4264 46.9393 36.5165 37.8407 36.5165H25.3431L24.3999 35.5734L23.4568 34.6302V24.0614V13.4926H38.0202H52.5835V23.9088ZM29.658 18.9065C29.5634 19.1534 29.5961 19.4652 29.7307 19.5995C29.8655 19.734 32.9324 19.8816 36.5461 19.9276L43.1168 20.0114L43.9684 20.8278C45.0386 21.8539 45.4561 23.2586 45.0835 24.5796C44.4452 26.8431 43.3625 27.4282 39.5187 27.5866C37.7247 27.6604 36.4945 27.6049 36.4945 27.4501C36.4945 27.3064 36.869 26.8301 37.3267 26.3915C38.2665 25.4911 38.3738 25.0079 37.6923 24.746C37.0856 24.5133 33.9943 27.5142 34.0062 28.3247C34.0106 28.6346 34.7571 29.6352 35.6648 30.5483C37.229 32.1217 37.3403 32.1833 37.7949 31.7289C38.2496 31.2743 38.2193 31.1927 37.2188 30.168L36.163 29.0867L39.4496 28.9833C42.2466 28.8953 42.9018 28.7855 43.8502 28.2451C45.8672 27.0961 46.9854 24.7549 46.5157 22.6644C46.1895 21.2134 45.6408 20.3839 44.359 19.4058L43.3354 18.6244L36.5827 18.5412C30.5706 18.4671 29.8111 18.5074 29.658 18.9065ZM0.0627443 36.0802C-0.240729 36.8711 0.636957 37.0572 5.02955 37.1335C7.45983 37.1756 9.41714 37.3038 9.37886 37.4181C9.34058 37.5324 9.30951 41.6831 9.30951 46.6416V55.657H4.76214C1.07941 55.657 0.185909 55.7322 0.0627443 56.0528C-0.267913 56.9147 0.585639 57.0578 5.59849 56.9813L10.5528 56.9053L10.6962 56.0731L10.8399 55.2409L14.1903 55.1635L17.5407 55.0858L23.758 57.5902C30.5049 60.3078 31.5942 60.5281 34.0939 59.6795C35.4193 59.2293 57.4055 45.4374 58.9037 44.1161C61.1479 42.1369 59.7151 38.4583 56.7001 38.4583C56.0504 38.4583 54.5775 39.2778 48.3532 43.1014C45.605 44.7899 44.539 45.5927 44.539 45.9739C44.539 46.269 44.731 46.5029 44.9734 46.5029C45.2122 46.5029 47.8778 45.0049 50.8964 43.1741C53.9153 41.3433 56.6299 39.8453 56.9287 39.8453C57.7567 39.8453 58.6863 40.867 58.6863 41.7768C58.6863 42.318 58.4394 42.773 57.9234 43.1824C56.5306 44.2878 35.2678 57.6742 34.0276 58.2265C32.078 59.095 30.3903 58.8102 25.3986 56.7702C17.7604 53.6486 18.0026 53.7152 14.2902 53.7152H10.9739L10.9589 50.7332C10.932 45.3719 10.9284 39.994 10.9514 39.4986C10.972 39.0572 11.3797 39.0131 15.4306 39.0131C18.2409 39.0131 20.1108 39.1305 20.4931 39.3307C20.8262 39.5055 21.9741 40.4756 23.0437 41.4861C24.3126 42.685 25.3844 43.4426 26.1273 43.6651C26.8824 43.8914 29.3753 44.0063 33.5291 44.0063C39.7187 44.0063 39.8013 44.014 40.5567 44.6637C41.5448 45.5137 41.6136 47.0546 40.704 47.9653C40.1262 48.5442 39.7838 48.5922 35.3086 48.722C30.7615 48.8541 30.5304 48.8876 30.5304 49.4155C30.5304 49.942 30.7426 49.9745 34.6914 50.0524C39.5913 50.149 40.3636 50.0413 41.4743 49.1068C43.1284 47.7148 43.1273 45.1616 41.4718 43.5744L40.6205 42.758L33.4828 42.6193L26.3453 42.4806L25.2477 41.6035C24.644 41.1211 23.7134 40.2678 23.1794 39.7075C21.4448 37.8869 21.0584 37.7795 15.6897 37.6261L10.8352 37.4874L10.7484 36.5859L10.6613 35.6844H5.43815C1.16984 35.6844 0.187018 35.7568 0.0627443 36.0802ZM25.2449 49.0236C24.8751 49.6222 25.6835 49.9359 27.4097 49.8635C27.977 49.84 28.1725 49.6893 28.1725 49.2768C28.1725 48.7969 27.9875 48.722 26.8019 48.722C26.048 48.722 25.3475 48.8577 25.2449 49.0236ZM5.9985 53.0003C5.56798 53.5191 5.84121 53.9926 6.57132 53.9926C6.98603 53.9926 7.10614 53.8381 7.0404 53.3901C6.92944 52.6375 6.44899 52.4575 5.9985 53.0003Z" fill="#FD9149"/>
<path fill-rule="evenodd" clip-rule="evenodd" d="M30.9679 0.391909C29.3823 1.26349 28.6599 3.11789 29.2752 4.73651C29.4242 5.12792 29.4552 5.45691 29.3445 5.46745C29.2339 5.47827 28.02 5.51683 26.6469 5.55372C22.3175 5.66912 20.6828 7.21117 20.6828 11.1796C20.6828 12.9719 20.8767 13.4926 21.5447 13.4926C22.0507 13.4926 22.0698 13.8745 22.0698 23.946C22.0698 34.0072 22.0917 34.4449 22.6537 35.6061C23.054 36.4325 23.5747 36.9842 24.3073 37.3579C25.3242 37.8769 25.9958 37.9035 38.0828 37.9035C52.4032 37.9035 52.1092 37.944 53.3419 35.7942C53.953 34.7279 53.9614 34.5709 53.9661 24.1224L53.9705 13.5311L54.5947 13.4426C55.1725 13.3605 55.2249 13.1938 55.2998 11.2013C55.3972 8.61674 54.917 7.37789 53.4418 6.407C52.6002 5.85303 51.991 5.72987 49.5322 5.61641C47.2974 5.5135 46.6469 5.39755 46.7379 5.11821C46.8034 4.9182 46.9063 4.25522 46.9671 3.64495C47.1992 1.31425 44.8716 -0.536818 42.5742 0.151682C41.6521 0.42797 41.188 0.86182 39.879 2.67212C39.0091 3.87463 38.1727 4.86245 38.0202 4.86716C37.8676 4.87188 37.1405 4.00251 36.4043 2.93537C35.6684 1.8685 34.7765 0.805508 34.4226 0.573604C33.3646 -0.119612 32.0267 -0.189794 30.9679 0.391909ZM33.8054 1.91121C34.174 2.25463 34.9333 3.18086 35.4925 3.9695L36.5092 5.40365L34.3518 5.50878C31.979 5.62418 31.1324 5.32709 30.6175 4.19752C30.0505 2.95284 31.1745 1.3653 32.6647 1.30593C32.9232 1.29539 33.4364 1.5678 33.8054 1.91121ZM44.9676 1.96808C45.7823 2.78252 45.8589 4.01722 45.1493 4.89351C44.7032 5.44443 44.3867 5.51183 42.1672 5.52792C40.8019 5.53763 39.7015 5.45108 39.7223 5.33541C39.7947 4.93318 42.1733 1.79609 42.5919 1.55088C43.3448 1.10954 44.2721 1.27237 44.9676 1.96808ZM52.647 7.50494C53.5697 8.10938 53.9705 9.08666 53.9705 10.7316V12.1056H38.0202H22.0698V10.8434C22.0698 8.7008 23.0071 7.42088 24.7888 7.13073C25.3531 7.03863 31.6983 6.98454 38.8892 7.01033C50.401 7.05167 52.0457 7.11075 52.647 7.50494ZM52.5835 23.9088C52.5835 35.207 52.5461 35.5107 51.0656 36.1851C50.536 36.4264 46.9393 36.5165 37.8407 36.5165H25.3431L24.3999 35.5734L23.4568 34.6302V24.0614V13.4926H38.0202H52.5835V23.9088ZM29.658 18.9065C29.5634 19.1534 29.5961 19.4652 29.7307 19.5995C29.8655 19.734 32.9324 19.8816 36.5461 19.9276L43.1168 20.0114L43.9684 20.8278C45.0386 21.8539 45.4561 23.2586 45.0835 24.5796C44.4452 26.8431 43.3625 27.4282 39.5187 27.5866C37.7247 27.6604 36.4945 27.6049 36.4945 27.4501C36.4945 27.3064 36.869 26.8301 37.3267 26.3915C38.2665 25.4911 38.3738 25.0079 37.6923 24.746C37.0856 24.5133 33.9943 27.5142 34.0062 28.3247C34.0106 28.6346 34.7571 29.6352 35.6648 30.5483C37.229 32.1217 37.3403 32.1833 37.7949 31.7289C38.2496 31.2743 38.2193 31.1927 37.2188 30.168L36.163 29.0867L39.4496 28.9833C42.2466 28.8953 42.9018 28.7855 43.8502 28.2451C45.8672 27.0961 46.9854 24.7549 46.5157 22.6644C46.1895 21.2134 45.6408 20.3839 44.359 19.4058L43.3354 18.6244L36.5827 18.5412C30.5706 18.4671 29.8111 18.5074 29.658 18.9065ZM0.0627443 36.0802C-0.240729 36.8711 0.636957 37.0572 5.02955 37.1335C7.45983 37.1756 9.41714 37.3038 9.37886 37.4181C9.34058 37.5324 9.30951 41.6831 9.30951 46.6416V55.657H4.76214C1.07941 55.657 0.185909 55.7322 0.0627443 56.0528C-0.267913 56.9147 0.585639 57.0578 5.59849 56.9813L10.5528 56.9053L10.6962 56.0731L10.8399 55.2409L14.1903 55.1635L17.5407 55.0858L23.758 57.5902C30.5049 60.3078 31.5942 60.5281 34.0939 59.6795C35.4193 59.2293 57.4055 45.4374 58.9037 44.1161C61.1479 42.1369 59.7151 38.4583 56.7001 38.4583C56.0504 38.4583 54.5775 39.2778 48.3532 43.1014C45.605 44.7899 44.539 45.5927 44.539 45.9739C44.539 46.269 44.731 46.5029 44.9734 46.5029C45.2122 46.5029 47.8778 45.0049 50.8964 43.1741C53.9153 41.3433 56.6299 39.8453 56.9287 39.8453C57.7567 39.8453 58.6863 40.867 58.6863 41.7768C58.6863 42.318 58.4394 42.773 57.9234 43.1824C56.5306 44.2878 35.2678 57.6742 34.0276 58.2265C32.078 59.095 30.3903 58.8102 25.3986 56.7702C17.7604 53.6486 18.0026 53.7152 14.2902 53.7152H10.9739L10.9589 50.7332C10.932 45.3719 10.9284 39.994 10.9514 39.4986C10.972 39.0572 11.3797 39.0131 15.4306 39.0131C18.2409 39.0131 20.1108 39.1305 20.4931 39.3307C20.8262 39.5055 21.9741 40.4756 23.0437 41.4861C24.3126 42.685 25.3844 43.4426 26.1273 43.6651C26.8824 43.8914 29.3753 44.0063 33.5291 44.0063C39.7187 44.0063 39.8013 44.014 40.5567 44.6637C41.5448 45.5137 41.6136 47.0546 40.704 47.9653C40.1262 48.5442 39.7838 48.5922 35.3086 48.722C30.7615 48.8541 30.5304 48.8876 30.5304 49.4155C30.5304 49.942 30.7426 49.9745 34.6914 50.0524C39.5913 50.149 40.3636 50.0413 41.4743 49.1068C43.1284 47.7148 43.1273 45.1616 41.4718 43.5744L40.6205 42.758L33.4828 42.6193L26.3453 42.4806L25.2477 41.6035C24.644 41.1211 23.7134 40.2678 23.1794 39.7075C21.4448 37.8869 21.0584 37.7795 15.6897 37.6261L10.8352 37.4874L10.7484 36.5859L10.6613 35.6844H5.43815C1.16984 35.6844 0.187018 35.7568 0.0627443 36.0802ZM25.2449 49.0236C24.8751 49.6222 25.6835 49.9359 27.4097 49.8635C27.977 49.84 28.1725 49.6893 28.1725 49.2768C28.1725 48.7969 27.9875 48.722 26.8019 48.722C26.048 48.722 25.3475 48.8577 25.2449 49.0236ZM5.9985 53.0003C5.56798 53.5191 5.84121 53.9926 6.57132 53.9926C6.98603 53.9926 7.10614 53.8381 7.0404 53.3901C6.92944 52.6375 6.44899 52.4575 5.9985 53.0003Z" fill="url(#paint0_linear_10290_11)"/>
<defs>
<linearGradient id="paint0_linear_10290_11" x1="30" y1="-2.97433e-07" x2="35" y2="42" gradientUnits="userSpaceOnUse">
<stop stop-color="#FFD588"/>
<stop offset="1" stop-color="#FFD588" stop-opacity="0"/>
</linearGradient>
</defs>
</svg>
