<svg width="18" height="16" viewBox="0 0 18 16" fill="none" xmlns="http://www.w3.org/2000/svg">
<path fill-rule="evenodd" clip-rule="evenodd" d="M10.6718 0.264902C10.6718 0.479321 10.7006 0.529804 10.8231 0.529804C10.9457 0.529804 10.9745 0.479321 10.9745 0.264902C10.9745 0.0504828 10.9457 0 10.8231 0C10.7006 0 10.6718 0.0504828 10.6718 0.264902ZM8.22642 0.740893C8.1057 0.874328 8.10911 0.891887 8.28931 1.0612C8.46877 1.22975 8.48754 1.2327 8.60863 1.1116C8.72981 0.990507 8.7261 0.971661 8.54574 0.791376C8.3597 0.605263 8.35047 0.603825 8.22642 0.740893ZM13.0914 0.797204C12.9251 0.974234 12.9215 0.995578 13.0389 1.11289C13.1562 1.23021 13.1751 1.2293 13.3184 1.09957C13.4969 0.938056 13.5134 0.809692 13.371 0.691394C13.2935 0.627137 13.2278 0.652037 13.0914 0.797204ZM9.4847 1.30385C9.38351 1.43713 9.08235 2.19316 9.08235 2.31396C9.08235 2.3683 9.30283 2.59369 9.57235 2.81477C9.96433 3.13629 10.0362 3.22658 9.93186 3.26624C9.86011 3.29349 9.63275 3.38053 9.42665 3.45962L9.05193 3.60335L8.36704 2.85405C7.60889 2.02453 7.3692 1.8556 7.09983 1.9608C6.82864 2.06677 0 9.04429 0 9.21549C0 9.39721 0.228648 9.61216 0.421951 9.61216C0.512245 9.61216 1.83047 8.34896 3.91563 6.26418L7.26429 2.91612L7.82876 3.47688L8.39323 4.03756L7.98823 4.47495C7.30728 5.21055 6.96564 6.09191 6.96405 7.11754C6.96132 8.83675 8.00193 10.3042 9.63365 10.8822C10.0841 11.0417 10.3158 11.0756 10.9556 11.0753L11.7314 11.0749V12.9169V14.7588H10.2606H8.78983L8.76576 13.5214C8.74812 12.6127 8.71414 12.2507 8.63793 12.159C8.54892 12.052 8.35168 12.0341 7.26089 12.0341C5.6468 12.0341 5.75216 11.9272 5.75216 13.5647V14.7588H4.27628H2.80039V11.8979C2.80039 9.7736 2.77701 9.01356 2.70957 8.94612C2.58098 8.81753 2.22752 8.8335 2.08675 8.9742C1.98253 9.0785 1.96784 9.47865 1.96784 12.2233C1.96784 14.968 1.98253 15.3682 2.08675 15.4725C2.18915 15.5749 2.49742 15.5914 4.30436 15.5914C5.83579 15.5914 6.42758 15.5669 6.49388 15.5006C6.55731 15.4371 6.58471 15.0262 6.58471 14.1382V12.8667H7.26588H7.94706V14.1382C7.94706 15.0262 7.97446 15.4371 8.03788 15.5006C8.10419 15.5669 8.69681 15.5914 10.231 15.5914H12.3334L12.4509 15.412C12.5517 15.2582 12.5654 14.9181 12.5473 13.0278C12.5356 11.8152 12.5431 10.8234 12.5639 10.8239C12.5847 10.8244 12.7721 10.8788 12.9802 10.945C13.8156 11.2103 15.0212 11.0763 15.9265 10.6175C17.2271 9.95843 18.1359 8.25791 17.9833 6.76878C17.8172 5.14712 16.8039 3.8877 15.2425 3.36244C14.7078 3.18253 14.5661 3.16543 13.8884 3.19941C13.4722 3.2203 12.9914 3.28918 12.82 3.35252C12.538 3.45682 12.4682 3.45584 12.0823 3.34216C11.8478 3.27313 11.6561 3.19964 11.6561 3.17882C11.6562 3.15801 11.8605 2.97591 12.1101 2.77421C12.3597 2.57243 12.5614 2.36807 12.5582 2.32009C12.555 2.27203 12.461 2.01136 12.3492 1.74078L12.1461 1.24882L10.852 1.22816C9.87313 1.21249 9.54011 1.23096 9.4847 1.30385ZM10.3652 1.78264C10.1961 1.9627 10.1771 1.96694 10.0872 1.84387C9.93587 1.63702 9.96985 1.58941 10.2687 1.58941H10.5468L10.3652 1.78264ZM11.6557 1.62831C11.6557 1.64966 11.615 1.73231 11.5653 1.81185C11.4815 1.94605 11.4679 1.94733 11.3785 1.82979C11.2362 1.64262 11.2557 1.58941 11.4665 1.58941C11.5705 1.58941 11.6557 1.6069 11.6557 1.62831ZM11.022 2.10567C10.9552 2.11906 10.8311 2.11906 10.7461 2.10567C10.5981 2.08243 10.5971 2.07365 10.7199 1.89935L10.8482 1.71732L10.9959 1.89935C11.1253 2.05897 11.1285 2.0844 11.022 2.10567ZM9.72357 2.10696C9.55971 2.14101 9.52217 2.09326 9.58469 1.93023C9.63381 1.80224 9.64198 1.8027 9.74166 1.93833C9.83309 2.06275 9.83074 2.0847 9.72357 2.10696ZM12.0561 1.96784C12.0856 2.08084 12.0583 2.11922 11.9487 2.11922C11.8252 2.11922 11.8146 2.09507 11.8827 1.96784C11.9273 1.88459 11.9756 1.81647 11.9901 1.81647C12.0046 1.81647 12.0343 1.88459 12.0561 1.96784ZM11.5257 2.78473C11.2396 3.03631 11.1658 3.06431 10.8126 3.05553C10.4801 3.04728 10.3658 3.00293 10.0806 2.77171L9.74264 2.49765L10.7938 2.5009L11.8449 2.50408L11.5257 2.78473ZM11.4792 3.56505C11.7428 3.61092 11.9584 3.6751 11.9584 3.70772C11.9584 3.86522 11.6063 3.97837 11.2773 3.92653C10.7785 3.84804 10.0197 3.98276 9.47744 4.24623C8.23406 4.85043 7.48606 6.2949 7.72023 7.63955C8.18358 10.3005 11.4476 11.2997 13.2465 9.33136C13.9266 8.58722 14.2482 7.56099 14.0873 6.64798C13.9734 6.00132 13.6224 5.29289 13.213 4.88351C13.0225 4.693 12.8667 4.52475 12.8667 4.50954C12.8667 4.49433 12.9563 4.45944 13.0657 4.43196C13.3063 4.37156 13.507 4.53913 13.8962 5.12563C14.8397 6.54694 14.6804 8.33488 13.4965 9.61367C11.8074 11.4381 8.75531 10.9514 7.67943 8.68591C6.55572 6.31965 8.18547 3.65307 10.8548 3.49043C10.9346 3.48558 11.2156 3.51911 11.4792 3.56505ZM15.2027 3.71809C16.9769 4.3285 17.994 6.23413 17.5189 8.05794C17.0431 9.88463 15.1497 11.0569 13.3118 10.6628L12.9169 10.5781L13.0999 10.4373C13.2503 10.3216 13.3644 10.3045 13.7396 10.3415C14.5223 10.4187 15.4257 10.1459 16.1073 9.62646C16.7713 9.12043 17.2565 8.05991 17.2565 7.11451C17.2565 4.31359 13.9133 2.83831 11.8788 4.74144C10.5269 6.00593 10.47 8.00648 11.7475 9.35725C12.1237 9.7549 12.1245 9.75695 11.9338 9.80478C11.692 9.86548 11.5857 9.80304 11.2558 9.40622C10.5476 8.55459 10.2772 7.33529 10.5576 6.25873C11.0949 4.19575 13.2171 3.03502 15.2027 3.71809ZM11.2016 4.28082C11.2016 4.30413 11.0827 4.47889 10.9374 4.66924C9.79108 6.17048 9.81553 8.22127 10.9966 9.6419L11.3045 10.0122L10.7255 9.97508C9.95668 9.92573 9.31585 9.61678 8.79089 9.04247C8.27297 8.47581 8.07308 7.94328 8.06695 7.11451C8.06279 6.54573 8.08965 6.41313 8.29893 5.96991C8.42911 5.69418 8.65798 5.33308 8.80761 5.16756C9.1071 4.83598 9.8072 4.42992 10.2644 4.3226C10.599 4.24411 11.2016 4.21716 11.2016 4.28082ZM14.6943 4.34137C15.2554 4.47344 15.7039 4.74364 16.1451 5.21532C16.7036 5.81233 16.8332 6.16806 16.8369 7.11451C16.8398 7.82278 16.8181 7.95645 16.6368 8.34336C16.2 9.27513 15.2724 9.90953 14.2505 9.97515L13.6783 10.0119L13.983 9.60383C14.5961 8.78294 14.8345 8.08595 14.8345 7.11451C14.8345 6.13634 14.5217 5.244 13.9615 4.6239C13.8172 4.4642 13.6992 4.31223 13.6992 4.28604C13.6992 4.20528 14.2449 4.23563 14.6943 4.34137ZM12.9916 5.1864C13.5402 5.76654 13.7308 6.27144 13.7343 7.15394C13.7368 7.77389 13.7145 7.88265 13.4918 8.33503C13.3439 8.6352 13.0955 8.9745 12.8668 9.18839L12.4873 9.54344L12.2093 9.33182C11.841 9.05148 11.3905 8.34328 11.2755 7.86396C11.1304 7.259 11.2119 6.40056 11.4617 5.90353C11.6906 5.44828 12.302 4.76824 12.4826 4.76824C12.5451 4.76824 12.7741 4.95639 12.9916 5.1864Z" fill="#FD9149"/>
<path fill-rule="evenodd" clip-rule="evenodd" d="M10.6718 0.264902C10.6718 0.479321 10.7006 0.529804 10.8231 0.529804C10.9457 0.529804 10.9745 0.479321 10.9745 0.264902C10.9745 0.0504828 10.9457 0 10.8231 0C10.7006 0 10.6718 0.0504828 10.6718 0.264902ZM8.22642 0.740893C8.1057 0.874328 8.10911 0.891887 8.28931 1.0612C8.46877 1.22975 8.48754 1.2327 8.60863 1.1116C8.72981 0.990507 8.7261 0.971661 8.54574 0.791376C8.3597 0.605263 8.35047 0.603825 8.22642 0.740893ZM13.0914 0.797204C12.9251 0.974234 12.9215 0.995578 13.0389 1.11289C13.1562 1.23021 13.1751 1.2293 13.3184 1.09957C13.4969 0.938056 13.5134 0.809692 13.371 0.691394C13.2935 0.627137 13.2278 0.652037 13.0914 0.797204ZM9.4847 1.30385C9.38351 1.43713 9.08235 2.19316 9.08235 2.31396C9.08235 2.3683 9.30283 2.59369 9.57235 2.81477C9.96433 3.13629 10.0362 3.22658 9.93186 3.26624C9.86011 3.29349 9.63275 3.38053 9.42665 3.45962L9.05193 3.60335L8.36704 2.85405C7.60889 2.02453 7.3692 1.8556 7.09983 1.9608C6.82864 2.06677 0 9.04429 0 9.21549C0 9.39721 0.228648 9.61216 0.421951 9.61216C0.512245 9.61216 1.83047 8.34896 3.91563 6.26418L7.26429 2.91612L7.82876 3.47688L8.39323 4.03756L7.98823 4.47495C7.30728 5.21055 6.96564 6.09191 6.96405 7.11754C6.96132 8.83675 8.00193 10.3042 9.63365 10.8822C10.0841 11.0417 10.3158 11.0756 10.9556 11.0753L11.7314 11.0749V12.9169V14.7588H10.2606H8.78983L8.76576 13.5214C8.74812 12.6127 8.71414 12.2507 8.63793 12.159C8.54892 12.052 8.35168 12.0341 7.26089 12.0341C5.6468 12.0341 5.75216 11.9272 5.75216 13.5647V14.7588H4.27628H2.80039V11.8979C2.80039 9.7736 2.77701 9.01356 2.70957 8.94612C2.58098 8.81753 2.22752 8.8335 2.08675 8.9742C1.98253 9.0785 1.96784 9.47865 1.96784 12.2233C1.96784 14.968 1.98253 15.3682 2.08675 15.4725C2.18915 15.5749 2.49742 15.5914 4.30436 15.5914C5.83579 15.5914 6.42758 15.5669 6.49388 15.5006C6.55731 15.4371 6.58471 15.0262 6.58471 14.1382V12.8667H7.26588H7.94706V14.1382C7.94706 15.0262 7.97446 15.4371 8.03788 15.5006C8.10419 15.5669 8.69681 15.5914 10.231 15.5914H12.3334L12.4509 15.412C12.5517 15.2582 12.5654 14.9181 12.5473 13.0278C12.5356 11.8152 12.5431 10.8234 12.5639 10.8239C12.5847 10.8244 12.7721 10.8788 12.9802 10.945C13.8156 11.2103 15.0212 11.0763 15.9265 10.6175C17.2271 9.95843 18.1359 8.25791 17.9833 6.76878C17.8172 5.14712 16.8039 3.8877 15.2425 3.36244C14.7078 3.18253 14.5661 3.16543 13.8884 3.19941C13.4722 3.2203 12.9914 3.28918 12.82 3.35252C12.538 3.45682 12.4682 3.45584 12.0823 3.34216C11.8478 3.27313 11.6561 3.19964 11.6561 3.17882C11.6562 3.15801 11.8605 2.97591 12.1101 2.77421C12.3597 2.57243 12.5614 2.36807 12.5582 2.32009C12.555 2.27203 12.461 2.01136 12.3492 1.74078L12.1461 1.24882L10.852 1.22816C9.87313 1.21249 9.54011 1.23096 9.4847 1.30385ZM10.3652 1.78264C10.1961 1.9627 10.1771 1.96694 10.0872 1.84387C9.93587 1.63702 9.96985 1.58941 10.2687 1.58941H10.5468L10.3652 1.78264ZM11.6557 1.62831C11.6557 1.64966 11.615 1.73231 11.5653 1.81185C11.4815 1.94605 11.4679 1.94733 11.3785 1.82979C11.2362 1.64262 11.2557 1.58941 11.4665 1.58941C11.5705 1.58941 11.6557 1.6069 11.6557 1.62831ZM11.022 2.10567C10.9552 2.11906 10.8311 2.11906 10.7461 2.10567C10.5981 2.08243 10.5971 2.07365 10.7199 1.89935L10.8482 1.71732L10.9959 1.89935C11.1253 2.05897 11.1285 2.0844 11.022 2.10567ZM9.72357 2.10696C9.55971 2.14101 9.52217 2.09326 9.58469 1.93023C9.63381 1.80224 9.64198 1.8027 9.74166 1.93833C9.83309 2.06275 9.83074 2.0847 9.72357 2.10696ZM12.0561 1.96784C12.0856 2.08084 12.0583 2.11922 11.9487 2.11922C11.8252 2.11922 11.8146 2.09507 11.8827 1.96784C11.9273 1.88459 11.9756 1.81647 11.9901 1.81647C12.0046 1.81647 12.0343 1.88459 12.0561 1.96784ZM11.5257 2.78473C11.2396 3.03631 11.1658 3.06431 10.8126 3.05553C10.4801 3.04728 10.3658 3.00293 10.0806 2.77171L9.74264 2.49765L10.7938 2.5009L11.8449 2.50408L11.5257 2.78473ZM11.4792 3.56505C11.7428 3.61092 11.9584 3.6751 11.9584 3.70772C11.9584 3.86522 11.6063 3.97837 11.2773 3.92653C10.7785 3.84804 10.0197 3.98276 9.47744 4.24623C8.23406 4.85043 7.48606 6.2949 7.72023 7.63955C8.18358 10.3005 11.4476 11.2997 13.2465 9.33136C13.9266 8.58722 14.2482 7.56099 14.0873 6.64798C13.9734 6.00132 13.6224 5.29289 13.213 4.88351C13.0225 4.693 12.8667 4.52475 12.8667 4.50954C12.8667 4.49433 12.9563 4.45944 13.0657 4.43196C13.3063 4.37156 13.507 4.53913 13.8962 5.12563C14.8397 6.54694 14.6804 8.33488 13.4965 9.61367C11.8074 11.4381 8.75531 10.9514 7.67943 8.68591C6.55572 6.31965 8.18547 3.65307 10.8548 3.49043C10.9346 3.48558 11.2156 3.51911 11.4792 3.56505ZM15.2027 3.71809C16.9769 4.3285 17.994 6.23413 17.5189 8.05794C17.0431 9.88463 15.1497 11.0569 13.3118 10.6628L12.9169 10.5781L13.0999 10.4373C13.2503 10.3216 13.3644 10.3045 13.7396 10.3415C14.5223 10.4187 15.4257 10.1459 16.1073 9.62646C16.7713 9.12043 17.2565 8.05991 17.2565 7.11451C17.2565 4.31359 13.9133 2.83831 11.8788 4.74144C10.5269 6.00593 10.47 8.00648 11.7475 9.35725C12.1237 9.7549 12.1245 9.75695 11.9338 9.80478C11.692 9.86548 11.5857 9.80304 11.2558 9.40622C10.5476 8.55459 10.2772 7.33529 10.5576 6.25873C11.0949 4.19575 13.2171 3.03502 15.2027 3.71809ZM11.2016 4.28082C11.2016 4.30413 11.0827 4.47889 10.9374 4.66924C9.79108 6.17048 9.81553 8.22127 10.9966 9.6419L11.3045 10.0122L10.7255 9.97508C9.95668 9.92573 9.31585 9.61678 8.79089 9.04247C8.27297 8.47581 8.07308 7.94328 8.06695 7.11451C8.06279 6.54573 8.08965 6.41313 8.29893 5.96991C8.42911 5.69418 8.65798 5.33308 8.80761 5.16756C9.1071 4.83598 9.8072 4.42992 10.2644 4.3226C10.599 4.24411 11.2016 4.21716 11.2016 4.28082ZM14.6943 4.34137C15.2554 4.47344 15.7039 4.74364 16.1451 5.21532C16.7036 5.81233 16.8332 6.16806 16.8369 7.11451C16.8398 7.82278 16.8181 7.95645 16.6368 8.34336C16.2 9.27513 15.2724 9.90953 14.2505 9.97515L13.6783 10.0119L13.983 9.60383C14.5961 8.78294 14.8345 8.08595 14.8345 7.11451C14.8345 6.13634 14.5217 5.244 13.9615 4.6239C13.8172 4.4642 13.6992 4.31223 13.6992 4.28604C13.6992 4.20528 14.2449 4.23563 14.6943 4.34137ZM12.9916 5.1864C13.5402 5.76654 13.7308 6.27144 13.7343 7.15394C13.7368 7.77389 13.7145 7.88265 13.4918 8.33503C13.3439 8.6352 13.0955 8.9745 12.8668 9.18839L12.4873 9.54344L12.2093 9.33182C11.841 9.05148 11.3905 8.34328 11.2755 7.86396C11.1304 7.259 11.2119 6.40056 11.4617 5.90353C11.6906 5.44828 12.302 4.76824 12.4826 4.76824C12.5451 4.76824 12.7741 4.95639 12.9916 5.1864Z" fill="url(#paint0_radial_204_12)"/>
<defs>
<radialGradient id="paint0_radial_204_12" cx="0" cy="0" r="1" gradientUnits="userSpaceOnUse" gradientTransform="translate(9 7.79569) rotate(90) scale(12.7043 14.6669)">
<stop stop-color="#FFD588"/>
<stop offset="1" stop-color="#FFD588" stop-opacity="0"/>
</radialGradient>
</defs>
</svg>
