<svg width="9" height="5" viewBox="0 0 9 5" fill="none" xmlns="http://www.w3.org/2000/svg">
<path fill-rule="evenodd" clip-rule="evenodd" d="M0.435492 0.261977C0.00876516 0.690185 -0.154671 0.45027 2.11353 2.72493C3.80324 4.41942 4.07 4.67301 4.16292 4.67301C4.25583 4.67301 4.52259 4.41942 6.2123 2.72493C8.4805 0.45027 8.31707 0.690185 7.89034 0.261977C7.46557 -0.16431 7.65368 -0.284775 5.78738 1.60885C4.91243 2.49658 4.18145 3.22293 4.16292 3.22293C4.14438 3.22293 3.4134 2.49658 2.53845 1.60885C0.672156 -0.284775 0.860267 -0.16431 0.435492 0.261977Z" fill="#012433"/>
</svg>
