<svg width="20" height="20" viewBox="0 0 20 20" fill="none" xmlns="http://www.w3.org/2000/svg">
<path fill-rule="evenodd" clip-rule="evenodd" d="M6.79358 0.371109C5.29331 0.680242 3.93596 1.29938 2.85813 2.16624C-0.744034 5.06329 -0.9707 9.85796 2.34533 13.0093L3.0419 13.6712L2.74347 15.1507C2.57942 15.9643 2.46192 16.6473 2.48255 16.6684C2.50308 16.6895 3.42438 16.4059 4.52966 16.0382L6.53947 15.3697L8.36906 15.3601C9.91689 15.3521 10.3239 15.3178 11.0118 15.1372C13.8474 14.3926 16.0089 12.5193 16.9261 10.0114C17.191 9.2869 17.2104 9.13097 17.2039 7.77267C17.1976 6.4466 17.1722 6.24687 16.9269 5.59522C16.5118 4.49262 15.9875 3.67988 15.1492 2.83969C13.9818 1.66964 12.7596 0.963094 11.1134 0.50689C10.1772 0.247397 7.76214 0.171477 6.79358 0.371109ZM10.1153 2.03669C11.6067 2.33171 12.7466 2.9089 13.7668 3.88584C17.119 7.09591 15.4438 12.1725 10.6006 13.4799C9.95663 13.6539 9.55412 13.6958 8.62317 13.6861C7.98027 13.6794 7.29417 13.6359 7.09851 13.5893C6.8076 13.5201 6.56884 13.5639 5.78893 13.8296C5.26444 14.0083 4.81823 14.1382 4.79749 14.1184C4.77666 14.0985 4.80573 13.8501 4.86183 13.5665C4.91804 13.2828 4.96297 13.002 4.96175 12.9425C4.96063 12.8828 4.70357 12.6588 4.39071 12.4447C3.24986 11.664 2.40998 10.5846 2.00503 9.37868C1.71077 8.50258 1.70863 7.13309 2.00005 6.264C3.02137 3.21861 6.61824 1.34494 10.1153 2.03669ZM3.99837 6.86825C3.67158 7.04763 3.54768 7.26128 3.54422 7.65101C3.53619 8.55436 4.77625 8.82213 5.19319 8.00696C5.33905 7.72187 5.35084 7.60166 5.25835 7.34752C5.08057 6.8592 4.45099 6.61966 3.99837 6.86825ZM7.91633 7.0232C7.50396 7.41809 7.49959 7.83108 7.90383 8.21817C8.49032 8.77969 9.38092 8.42958 9.38092 7.63748C9.38092 7.14896 9.12041 6.86562 8.59643 6.78425C8.27758 6.73471 8.18295 6.7679 7.91633 7.0232ZM11.9696 7.03517C11.7668 7.22936 11.6725 7.41721 11.6725 7.62667C11.6725 8.0454 12.15 8.50268 12.5873 8.50268C13.0246 8.50268 13.5021 8.0454 13.5021 7.62667C13.5021 7.41721 13.4077 7.22936 13.205 7.03517C12.8055 6.65265 12.3691 6.65265 11.9696 7.03517ZM18.94 9.84482C18.4954 9.93222 18.3016 10.238 18.2276 10.9688C18.146 11.7755 17.8669 12.6429 17.4916 13.2561C17.1199 13.8635 16.2293 14.7572 15.6266 15.1275C15.2173 15.379 15.1247 15.4838 15.1671 15.647C15.1964 15.7594 15.2514 16.0386 15.2894 16.2673L15.3584 16.6833L14.5124 16.3846L13.6663 16.0859L12.4915 16.2087C11.5137 16.3109 11.2784 16.368 11.088 16.5494C10.7629 16.8591 10.779 17.3894 11.1236 17.7193C11.3844 17.9691 11.4022 17.9716 12.4533 17.91L13.5186 17.8476L15.5596 18.5291C16.682 18.904 17.6174 19.1944 17.6381 19.1746C17.6588 19.1547 17.541 18.4865 17.3763 17.6896L17.0769 16.2407L17.5182 15.8743C18.5681 15.0023 19.5668 13.3374 19.8499 11.9865C20.0478 11.0429 20.05 10.4536 19.8564 10.1891C19.684 9.95325 19.239 9.78613 18.94 9.84482Z" fill="#FD9149"/>
</svg>
