<svg width="42" height="42" viewBox="0 0 42 42" fill="none" xmlns="http://www.w3.org/2000/svg">
<circle cx="21.2764" cy="20.7237" r="20.7237" fill="url(#paint0_linear_12165_17)"/>
<path fill-rule="evenodd" clip-rule="evenodd" d="M13.0243 14.1207C12.672 14.2988 12.2522 14.6694 12.0136 15.0127L11.6055 15.6001V20.2497V24.8994L12.0136 25.4867C12.2522 25.8301 12.672 26.2007 13.0243 26.3788C13.6266 26.6834 13.6295 26.6836 20.816 26.6836C28.0025 26.6836 28.0054 26.6834 28.6077 26.3788C28.96 26.2007 29.3798 25.8301 29.6184 25.4867L30.0265 24.8994V20.2497V15.6001L29.6184 15.0127C29.3798 14.6694 28.96 14.2988 28.6077 14.1207C28.0054 13.8161 28.0025 13.8159 20.816 13.8159C13.6295 13.8159 13.6266 13.8161 13.0243 14.1207ZM24.1345 19.9126C24.1345 19.9932 19.4071 23.1493 19.0985 23.2747C19.0374 23.2996 18.9874 21.7604 18.9874 19.8542V16.3886L21.561 18.1037C22.9764 19.047 24.1345 19.861 24.1345 19.9126Z" fill="white"/>
<defs>
<linearGradient id="paint0_linear_12165_17" x1="21.7369" y1="-13.8158" x2="20.8159" y2="55.2632" gradientUnits="userSpaceOnUse">
<stop stop-color="#FD9149"/>
<stop offset="1" stop-color="#FFD588"/>
</linearGradient>
</defs>
</svg>
