<svg width="18" height="19" viewBox="0 0 18 19" fill="none" xmlns="http://www.w3.org/2000/svg">
<path fill-rule="evenodd" clip-rule="evenodd" d="M4.71429 1.92098C2.44554 2.97248 0.456643 3.90623 0.294643 3.99613L0 4.15941V8.71545V13.2716L0.241071 13.4216C0.373714 13.5041 2.40021 14.4525 4.7445 15.5293L9.00686 17.487L10.1284 16.9739C10.7452 16.6917 11.25 16.4466 11.25 16.4292C11.25 16.4118 11.2025 16.2728 11.1445 16.1201L11.039 15.8427L10.495 16.1184C10.1957 16.27 9.83336 16.4387 9.68979 16.4934L9.42857 16.5926L9.42911 12.5506L9.42964 8.50866L10.8311 7.86581C11.6019 7.51224 12.2766 7.20688 12.3305 7.18727C12.3861 7.16702 12.4286 7.67713 12.4286 8.36659V9.5817L12.9151 9.87549C13.1826 10.0372 13.4677 10.1694 13.5486 10.1694C13.6295 10.1694 13.941 9.87591 14.2407 9.5172L14.7857 8.86491V7.44977V6.03463L16.0714 5.43216L17.3571 4.82959V7.70145V10.5733L17.6213 10.7463C17.7664 10.8415 17.9111 10.9194 17.9427 10.9194C17.9742 10.9194 18 9.38723 18 7.51448V4.1097L13.5603 2.0502C11.1185 0.917592 9.05743 -0.0050152 8.97997 2.05167e-05C8.90261 0.00505623 6.98304 0.869485 4.71429 1.92098ZM13.0528 2.5287L16.9449 4.31713L15.9992 4.75695C14.1999 5.59395 14.9007 5.72981 10.4479 3.68134C8.29704 2.69188 6.56486 1.85445 6.59882 1.82048C6.71818 1.70091 8.84121 0.750342 9 0.745306C9.08839 0.74252 10.9122 1.54502 13.0528 2.5287ZM9.67468 4.0212C11.8081 5.00038 13.5646 5.81091 13.578 5.82238C13.5914 5.83384 13.3931 5.94495 13.1373 6.06924L12.6721 6.2952L9.57707 4.87341C7.87489 4.09138 6.09643 3.27216 5.625 3.05273L4.76786 2.65384L5.14286 2.45188C5.34911 2.34066 5.58043 2.24777 5.65682 2.24531C5.73332 2.24284 7.54136 3.04191 9.67468 4.0212ZM8.00893 4.83966C10.0862 5.79174 11.7857 6.6012 11.7857 6.63848C11.7857 6.67577 11.1598 6.98659 10.3947 7.32923L9.00364 7.95227L5.54646 6.36827C3.645 5.49709 1.87232 4.67434 1.60714 4.53977L1.125 4.29527L1.82143 3.97888C2.20446 3.80488 2.83125 3.51559 3.21429 3.33602C3.59732 3.15634 3.98304 3.03173 4.07143 3.05906C4.15982 3.08638 5.93164 3.88759 8.00893 4.83966ZM5.49 7.01702L8.78357 8.50866L8.78464 12.5622C8.78529 14.7917 8.74639 16.5998 8.69829 16.5801C8.65029 16.5604 6.81814 15.7272 4.62686 14.7285L0.642857 12.9127V8.86513V4.81759L1.41964 5.17148C1.84693 5.36606 3.67854 6.19652 5.49 7.01702ZM14.1385 7.57116C14.1343 8.68031 14.1228 8.73623 13.8281 9.08081C13.5629 9.39066 13.4918 9.42249 13.2966 9.31813C13.0887 9.20681 13.0714 9.10706 13.0714 8.01752V6.83745L13.5268 6.63077C13.7773 6.51709 14.0184 6.42302 14.0625 6.42174C14.1066 6.42045 14.1409 6.93774 14.1385 7.57116ZM14.4643 10.9131C13.8474 11.0513 13.5336 11.211 13.0874 11.6142C11.8294 12.7507 11.875 14.6248 13.2106 16.6797C13.775 17.5482 14.8746 18.9015 15.0158 18.9015C15.2291 18.9015 16.7464 16.8219 17.2046 15.9015C17.9465 14.4111 18.0208 13.4029 17.468 12.3196C17.2305 11.854 16.6083 11.275 16.1328 11.0769C15.6784 10.8877 14.913 10.8124 14.4643 10.9131ZM1.17857 11.7154C1.17857 12.3022 1.21232 12.4299 1.39286 12.5265C1.59696 12.6357 1.60714 12.6079 1.60714 11.9447C1.60714 11.358 1.57339 11.2303 1.39286 11.1337C1.18875 11.0245 1.17857 11.0522 1.17857 11.7154ZM1.92857 12.1426C1.92857 12.7078 1.96146 12.8479 2.09443 12.8479C2.22964 12.8479 2.25429 12.7259 2.22836 12.1868C2.20854 11.7775 2.14543 11.5089 2.0625 11.4814C1.96446 11.4491 1.92857 11.6262 1.92857 12.1426ZM2.57143 12.3643C2.57143 12.9372 2.60668 13.0736 2.77864 13.1656C3.09814 13.3366 3.10714 13.3211 3.10714 12.5973C3.10714 11.9768 3.084 11.9076 2.83929 11.796L2.57143 11.674V12.3643ZM3.32143 12.7291C3.32143 13.2714 3.35689 13.3951 3.54075 13.4935C3.753 13.6071 3.75911 13.5874 3.72825 12.8823C3.70232 12.2888 3.66171 12.1471 3.50893 12.118C3.34714 12.0871 3.32143 12.1708 3.32143 12.7291ZM15.9374 12.4002C16.8966 13.0832 16.7671 14.6363 15.7092 15.1383C14.6573 15.6374 13.4464 14.8705 13.4464 13.7051C13.4464 13.1156 13.6731 12.7321 14.2599 12.3295C14.7101 12.0205 15.4477 12.0516 15.9374 12.4002Z" fill="#FD9149"/>
<path fill-rule="evenodd" clip-rule="evenodd" d="M4.71429 1.92098C2.44554 2.97248 0.456643 3.90623 0.294643 3.99613L0 4.15941V8.71545V13.2716L0.241071 13.4216C0.373714 13.5041 2.40021 14.4525 4.7445 15.5293L9.00686 17.487L10.1284 16.9739C10.7452 16.6917 11.25 16.4466 11.25 16.4292C11.25 16.4118 11.2025 16.2728 11.1445 16.1201L11.039 15.8427L10.495 16.1184C10.1957 16.27 9.83336 16.4387 9.68979 16.4934L9.42857 16.5926L9.42911 12.5506L9.42964 8.50866L10.8311 7.86581C11.6019 7.51224 12.2766 7.20688 12.3305 7.18727C12.3861 7.16702 12.4286 7.67713 12.4286 8.36659V9.5817L12.9151 9.87549C13.1826 10.0372 13.4677 10.1694 13.5486 10.1694C13.6295 10.1694 13.941 9.87591 14.2407 9.5172L14.7857 8.86491V7.44977V6.03463L16.0714 5.43216L17.3571 4.82959V7.70145V10.5733L17.6213 10.7463C17.7664 10.8415 17.9111 10.9194 17.9427 10.9194C17.9742 10.9194 18 9.38723 18 7.51448V4.1097L13.5603 2.0502C11.1185 0.917592 9.05743 -0.0050152 8.97997 2.05167e-05C8.90261 0.00505623 6.98304 0.869485 4.71429 1.92098ZM13.0528 2.5287L16.9449 4.31713L15.9992 4.75695C14.1999 5.59395 14.9007 5.72981 10.4479 3.68134C8.29704 2.69188 6.56486 1.85445 6.59882 1.82048C6.71818 1.70091 8.84121 0.750342 9 0.745306C9.08839 0.74252 10.9122 1.54502 13.0528 2.5287ZM9.67468 4.0212C11.8081 5.00038 13.5646 5.81091 13.578 5.82238C13.5914 5.83384 13.3931 5.94495 13.1373 6.06924L12.6721 6.2952L9.57707 4.87341C7.87489 4.09138 6.09643 3.27216 5.625 3.05273L4.76786 2.65384L5.14286 2.45188C5.34911 2.34066 5.58043 2.24777 5.65682 2.24531C5.73332 2.24284 7.54136 3.04191 9.67468 4.0212ZM8.00893 4.83966C10.0862 5.79174 11.7857 6.6012 11.7857 6.63848C11.7857 6.67577 11.1598 6.98659 10.3947 7.32923L9.00364 7.95227L5.54646 6.36827C3.645 5.49709 1.87232 4.67434 1.60714 4.53977L1.125 4.29527L1.82143 3.97888C2.20446 3.80488 2.83125 3.51559 3.21429 3.33602C3.59732 3.15634 3.98304 3.03173 4.07143 3.05906C4.15982 3.08638 5.93164 3.88759 8.00893 4.83966ZM5.49 7.01702L8.78357 8.50866L8.78464 12.5622C8.78529 14.7917 8.74639 16.5998 8.69829 16.5801C8.65029 16.5604 6.81814 15.7272 4.62686 14.7285L0.642857 12.9127V8.86513V4.81759L1.41964 5.17148C1.84693 5.36606 3.67854 6.19652 5.49 7.01702ZM14.1385 7.57116C14.1343 8.68031 14.1228 8.73623 13.8281 9.08081C13.5629 9.39066 13.4918 9.42249 13.2966 9.31813C13.0887 9.20681 13.0714 9.10706 13.0714 8.01752V6.83745L13.5268 6.63077C13.7773 6.51709 14.0184 6.42302 14.0625 6.42174C14.1066 6.42045 14.1409 6.93774 14.1385 7.57116ZM14.4643 10.9131C13.8474 11.0513 13.5336 11.211 13.0874 11.6142C11.8294 12.7507 11.875 14.6248 13.2106 16.6797C13.775 17.5482 14.8746 18.9015 15.0158 18.9015C15.2291 18.9015 16.7464 16.8219 17.2046 15.9015C17.9465 14.4111 18.0208 13.4029 17.468 12.3196C17.2305 11.854 16.6083 11.275 16.1328 11.0769C15.6784 10.8877 14.913 10.8124 14.4643 10.9131ZM1.17857 11.7154C1.17857 12.3022 1.21232 12.4299 1.39286 12.5265C1.59696 12.6357 1.60714 12.6079 1.60714 11.9447C1.60714 11.358 1.57339 11.2303 1.39286 11.1337C1.18875 11.0245 1.17857 11.0522 1.17857 11.7154ZM1.92857 12.1426C1.92857 12.7078 1.96146 12.8479 2.09443 12.8479C2.22964 12.8479 2.25429 12.7259 2.22836 12.1868C2.20854 11.7775 2.14543 11.5089 2.0625 11.4814C1.96446 11.4491 1.92857 11.6262 1.92857 12.1426ZM2.57143 12.3643C2.57143 12.9372 2.60668 13.0736 2.77864 13.1656C3.09814 13.3366 3.10714 13.3211 3.10714 12.5973C3.10714 11.9768 3.084 11.9076 2.83929 11.796L2.57143 11.674V12.3643ZM3.32143 12.7291C3.32143 13.2714 3.35689 13.3951 3.54075 13.4935C3.753 13.6071 3.75911 13.5874 3.72825 12.8823C3.70232 12.2888 3.66171 12.1471 3.50893 12.118C3.34714 12.0871 3.32143 12.1708 3.32143 12.7291ZM15.9374 12.4002C16.8966 13.0832 16.7671 14.6363 15.7092 15.1383C14.6573 15.6374 13.4464 14.8705 13.4464 13.7051C13.4464 13.1156 13.6731 12.7321 14.2599 12.3295C14.7101 12.0205 15.4477 12.0516 15.9374 12.4002Z" fill="url(#paint0_radial_204_14)"/>
<defs>
<radialGradient id="paint0_radial_204_14" cx="0" cy="0" r="1" gradientUnits="userSpaceOnUse" gradientTransform="translate(9 9.45076) rotate(90) scale(15.5492 14.8076)">
<stop stop-color="#FFD588"/>
<stop offset="1" stop-color="#FFD588" stop-opacity="0"/>
</radialGradient>
</defs>
</svg>
