<svg width="49" height="49" viewBox="0 0 49 49" fill="none" xmlns="http://www.w3.org/2000/svg">
<rect x="25" y="-4" width="40" height="40" rx="10" transform="rotate(45.6756 25 -4)" fill="#ECEBEA"/>
</svg>
