<svg width="22" height="23" viewBox="0 0 22 23" fill="none" xmlns="http://www.w3.org/2000/svg">
<path fill-rule="evenodd" clip-rule="evenodd" d="M8.38694 0.210918C6.28604 0.761667 4.64137 2.26504 3.97785 4.24131C3.80537 4.75511 3.75486 5.17215 3.75486 6.08355C3.75486 7.12076 3.72923 7.28736 3.54052 7.47607C3.35245 7.66414 3.31795 7.8836 3.25932 9.26491C3.19802 10.7091 3.20923 10.8598 3.39463 11.0864C3.66226 11.4133 4.32696 11.5029 4.85336 11.283L5.25001 11.1173V9.40684C5.25001 7.80575 5.23634 7.68913 5.03641 7.58212C4.84375 7.47906 4.82282 7.35848 4.82282 6.35246C4.82282 5.48901 4.87622 5.07432 5.05938 4.51631C5.51945 3.11493 6.64893 2.00617 8.19652 1.43673C8.93544 1.16493 9.00625 1.15906 11.1334 1.19291L13.3131 1.22773L14.1651 1.64391C15.2631 2.18024 16.1267 3.02522 16.5992 4.02558C16.9168 4.69797 16.9452 4.84984 16.9812 6.0686C17.0174 7.29633 17.0049 7.39928 16.7952 7.59461C16.5864 7.78909 16.5704 7.91553 16.5704 9.36668C16.5704 10.6453 16.6013 10.9635 16.7402 11.1171C16.9448 11.343 16.8838 11.5774 16.473 12.1444C15.7901 13.0873 14.2148 13.7941 12.4859 13.9336C11.5216 14.0115 11.3976 14.0648 11.5087 14.3541C11.6026 14.5988 12.903 14.5791 13.9255 14.3176C15.5383 13.9051 16.7101 13.1007 17.2777 12.0164C17.5449 11.5061 17.6291 11.4291 17.9849 11.369C18.2156 11.33 18.4339 11.2163 18.4942 11.1038C18.5521 10.9954 18.5996 10.1845 18.5996 9.30164C18.5996 7.84494 18.5812 7.68656 18.4005 7.58991C18.2286 7.49785 18.1934 7.30551 18.1415 6.17112C18.1084 5.44939 18.0074 4.62834 17.9169 4.3465C17.2425 2.24635 15.4146 0.621764 13.2063 0.159656C12.0866 -0.0745491 9.36551 -0.045714 8.38694 0.210918ZM9.13718 1.69646C8.30278 1.93536 7.62943 2.33211 7.14137 2.87239C6.30697 3.79586 5.99758 4.81694 5.99758 6.64679C5.99758 7.50127 5.94814 8.02778 5.84454 8.27565C5.42654 9.27612 5.59261 10.4539 6.2556 11.1909C6.45157 11.4087 6.76951 11.9665 6.96206 12.4305C7.15461 12.8943 7.54837 13.627 7.83704 14.0586C8.43008 14.9453 8.4319 15.0811 7.8568 15.5861C7.42833 15.9623 6.71365 16.3369 5.19661 16.9803C1.40181 18.5899 0.313875 19.6392 0.0753983 21.9195L0 22.6404H10.9585C20.4212 22.6404 21.9251 22.6194 21.9763 22.4859C22.0801 22.2155 21.8265 20.9478 21.5462 20.3355C21.2308 19.6466 20.3969 18.7953 19.5338 18.2812C19.2067 18.0863 18.298 17.6403 17.5144 17.29C15.0702 16.1972 14.5493 15.924 14.0724 15.4844L13.6096 15.0579H12.4813C11.3895 15.0579 11.3457 15.0488 11.1316 14.7765C10.8362 14.4011 10.8498 13.9771 11.1665 13.6796C11.3777 13.4811 11.6083 13.4223 12.4748 13.3455C13.5713 13.2483 14.3816 13.0511 14.7933 12.7814C14.9263 12.6942 15.0951 12.4223 15.1686 12.1771C15.2421 11.9319 15.4501 11.5787 15.6308 11.3922C16.3644 10.6352 16.5963 9.40428 16.2135 8.29925C16.0873 7.93486 16.0364 7.42427 16.0364 6.51992C16.0364 5.57765 15.9848 5.08543 15.8352 4.60516C15.327 2.97225 14.3386 2.04184 12.7024 1.65609C11.7796 1.43854 9.96657 1.45905 9.13718 1.69646Z" fill="#FD9149"/>
</svg>
