<svg width="95" height="31" viewBox="0 0 95 31" fill="none" xmlns="http://www.w3.org/2000/svg">
<path d="M3.87738 17.9031C7.02094 7.28496 16.7752 0 27.8489 0H94.625V21C94.625 26.5228 90.1479 31 84.625 31H0L3.87738 17.9031Z" fill="#FD9149"/>
<path d="M3.87738 17.9031C7.02094 7.28496 16.7752 0 27.8489 0H94.625V21C94.625 26.5228 90.1479 31 84.625 31H0L3.87738 17.9031Z" fill="url(#paint0_linear_2301_2)"/>
<path d="M34.564 20.11C33.9407 20.11 33.365 20.033 32.837 19.879C32.3163 19.7177 31.869 19.4977 31.495 19.219L31.935 18.108C32.1843 18.284 32.4447 18.4343 32.716 18.559C32.9873 18.6763 33.277 18.768 33.585 18.834C33.893 18.8927 34.2193 18.922 34.564 18.922C35.1433 18.922 35.5613 18.8267 35.818 18.636C36.0747 18.4453 36.203 18.196 36.203 17.888C36.203 17.6167 36.115 17.4113 35.939 17.272C35.763 17.1253 35.4477 17.0043 34.993 16.909L33.75 16.656C33.0387 16.5093 32.507 16.2637 32.155 15.919C31.803 15.5743 31.627 15.1123 31.627 14.533C31.627 14.049 31.7553 13.6273 32.012 13.268C32.2687 12.9087 32.628 12.63 33.09 12.432C33.552 12.234 34.091 12.135 34.707 12.135C35.257 12.135 35.7667 12.2157 36.236 12.377C36.7053 12.531 37.0977 12.7547 37.413 13.048L36.973 14.104C36.6577 13.84 36.313 13.6457 35.939 13.521C35.565 13.389 35.147 13.323 34.685 13.323C34.1643 13.323 33.7573 13.4257 33.464 13.631C33.178 13.829 33.035 14.104 33.035 14.456C33.035 14.7273 33.123 14.9437 33.299 15.105C33.4823 15.2663 33.7903 15.391 34.223 15.479L35.455 15.721C36.1883 15.8677 36.731 16.1097 37.083 16.447C37.435 16.777 37.611 17.2243 37.611 17.789C37.611 18.251 37.4863 18.658 37.237 19.01C36.9877 19.3547 36.6357 19.626 36.181 19.824C35.7263 20.0147 35.1873 20.11 34.564 20.11ZM41.5218 20.11C40.5905 20.11 39.8608 19.8533 39.3328 19.34C38.8048 18.8267 38.5408 18.1227 38.5408 17.228C38.5408 16.6487 38.6545 16.1427 38.8818 15.71C39.1092 15.2773 39.4245 14.94 39.8278 14.698C40.2385 14.456 40.7152 14.335 41.2578 14.335C41.7932 14.335 42.2405 14.4487 42.5998 14.676C42.9592 14.9033 43.2305 15.2223 43.4138 15.633C43.6045 16.0437 43.6998 16.524 43.6998 17.074V17.437H39.6518V16.711H42.7208L42.5338 16.865C42.5338 16.3517 42.4238 15.9593 42.2038 15.688C41.9912 15.4167 41.6795 15.281 41.2688 15.281C40.8142 15.281 40.4622 15.4423 40.2128 15.765C39.9708 16.0877 39.8498 16.5387 39.8498 17.118V17.261C39.8498 17.8623 39.9965 18.3133 40.2898 18.614C40.5905 18.9073 41.0122 19.054 41.5548 19.054C41.8702 19.054 42.1635 19.0137 42.4348 18.933C42.7135 18.845 42.9775 18.7057 43.2268 18.515L43.6338 19.439C43.3698 19.6517 43.0545 19.8167 42.6878 19.934C42.3212 20.0513 41.9325 20.11 41.5218 20.11ZM44.8642 20V11.904H46.2392V20H44.8642ZM50.4164 20.11C49.485 20.11 48.7554 19.8533 48.2274 19.34C47.6994 18.8267 47.4354 18.1227 47.4354 17.228C47.4354 16.6487 47.549 16.1427 47.7764 15.71C48.0037 15.2773 48.319 14.94 48.7224 14.698C49.133 14.456 49.6097 14.335 50.1524 14.335C50.6877 14.335 51.135 14.4487 51.4944 14.676C51.8537 14.9033 52.125 15.2223 52.3084 15.633C52.499 16.0437 52.5944 16.524 52.5944 17.074V17.437H48.5464V16.711H51.6154L51.4284 16.865C51.4284 16.3517 51.3184 15.9593 51.0984 15.688C50.8857 15.4167 50.574 15.281 50.1634 15.281C49.7087 15.281 49.3567 15.4423 49.1074 15.765C48.8654 16.0877 48.7444 16.5387 48.7444 17.118V17.261C48.7444 17.8623 48.891 18.3133 49.1844 18.614C49.485 18.9073 49.9067 19.054 50.4494 19.054C50.7647 19.054 51.058 19.0137 51.3294 18.933C51.608 18.845 51.872 18.7057 52.1214 18.515L52.5284 19.439C52.2644 19.6517 51.949 19.8167 51.5824 19.934C51.2157 20.0513 50.827 20.11 50.4164 20.11ZM56.3107 20.11C55.7387 20.11 55.2364 19.9927 54.8037 19.758C54.3784 19.5233 54.0484 19.1897 53.8137 18.757C53.5791 18.317 53.4617 17.7963 53.4617 17.195C53.4617 16.5937 53.5791 16.0803 53.8137 15.655C54.0557 15.2297 54.3894 14.9033 54.8147 14.676C55.2401 14.4487 55.7387 14.335 56.3107 14.335C56.6774 14.335 57.0331 14.3937 57.3777 14.511C57.7297 14.621 58.0157 14.7823 58.2357 14.995L57.8177 15.952C57.6197 15.7687 57.3961 15.633 57.1467 15.545C56.9047 15.4497 56.6664 15.402 56.4317 15.402C55.9404 15.402 55.5554 15.556 55.2767 15.864C55.0054 16.172 54.8697 16.6193 54.8697 17.206C54.8697 17.7927 55.0054 18.2437 55.2767 18.559C55.5554 18.8743 55.9404 19.032 56.4317 19.032C56.6591 19.032 56.8937 18.988 57.1357 18.9C57.3851 18.812 57.6124 18.6763 57.8177 18.493L58.2357 19.439C58.0084 19.6517 57.7187 19.8167 57.3667 19.934C57.0221 20.0513 56.6701 20.11 56.3107 20.11ZM61.6992 20.11C61.0392 20.11 60.5405 19.9377 60.2032 19.593C59.8659 19.2483 59.6972 18.7313 59.6972 18.042V15.479H58.6302V14.445H59.6972V13.026L61.0722 12.674V14.445H62.5572V15.479H61.0722V17.954C61.0722 18.3353 61.1455 18.603 61.2922 18.757C61.4389 18.911 61.6405 18.988 61.8972 18.988C62.0365 18.988 62.1539 18.977 62.2492 18.955C62.3519 18.933 62.4509 18.9037 62.5462 18.867V19.956C62.4215 20.0073 62.2822 20.044 62.1282 20.066C61.9815 20.0953 61.8385 20.11 61.6992 20.11ZM66.1215 20.11C65.1901 20.11 64.4605 19.8533 63.9325 19.34C63.4045 18.8267 63.1405 18.1227 63.1405 17.228C63.1405 16.6487 63.2541 16.1427 63.4815 15.71C63.7088 15.2773 64.0241 14.94 64.4275 14.698C64.8381 14.456 65.3148 14.335 65.8575 14.335C66.3928 14.335 66.8401 14.4487 67.1995 14.676C67.5588 14.9033 67.8301 15.2223 68.0135 15.633C68.2041 16.0437 68.2995 16.524 68.2995 17.074V17.437H64.2515V16.711H67.3205L67.1335 16.865C67.1335 16.3517 67.0235 15.9593 66.8035 15.688C66.5908 15.4167 66.2791 15.281 65.8685 15.281C65.4138 15.281 65.0618 15.4423 64.8125 15.765C64.5705 16.0877 64.4495 16.5387 64.4495 17.118V17.261C64.4495 17.8623 64.5961 18.3133 64.8895 18.614C65.1901 18.9073 65.6118 19.054 66.1545 19.054C66.4698 19.054 66.7631 19.0137 67.0345 18.933C67.3131 18.845 67.5771 18.7057 67.8265 18.515L68.2335 19.439C67.9695 19.6517 67.6541 19.8167 67.2875 19.934C66.9208 20.0513 66.5321 20.11 66.1215 20.11ZM71.6198 20.11C71.1358 20.11 70.7068 19.9963 70.3328 19.769C69.9662 19.5343 69.6802 19.2007 69.4748 18.768C69.2695 18.3353 69.1668 17.8183 69.1668 17.217C69.1668 16.6157 69.2695 16.1023 69.4748 15.677C69.6802 15.2443 69.9662 14.9143 70.3328 14.687C70.7068 14.4523 71.1358 14.335 71.6198 14.335C72.0818 14.335 72.4888 14.4487 72.8408 14.676C73.2002 14.896 73.4385 15.1967 73.5558 15.578H73.4128V11.904H74.7878V20H73.4348V18.823H73.5668C73.4495 19.219 73.2112 19.5343 72.8518 19.769C72.4998 19.9963 72.0892 20.11 71.6198 20.11ZM72.0048 19.054C72.4375 19.054 72.7858 18.9037 73.0498 18.603C73.3138 18.295 73.4458 17.833 73.4458 17.217C73.4458 16.601 73.3138 16.1427 73.0498 15.842C72.7858 15.5413 72.4375 15.391 72.0048 15.391C71.5722 15.391 71.2202 15.5413 70.9488 15.842C70.6848 16.1427 70.5528 16.601 70.5528 17.217C70.5528 17.833 70.6848 18.295 70.9488 18.603C71.2202 18.9037 71.5722 19.054 72.0048 19.054Z" fill="#302F2F"/>
<defs>
<linearGradient id="paint0_linear_2301_2" x1="20.5707" y1="22.3049" x2="83.5561" y2="23.3647" gradientUnits="userSpaceOnUse">
<stop stop-color="#FFD588"/>
<stop offset="1" stop-color="#FFD588" stop-opacity="0"/>
</linearGradient>
</defs>
</svg>
