<svg width="13" height="13" viewBox="0 0 13 13" fill="none" xmlns="http://www.w3.org/2000/svg">
<path fill-rule="evenodd" clip-rule="evenodd" d="M5.50279 0.751442C2.94998 1.17727 0.929162 1.52178 0.839196 1.5465C0.393624 1.66892 0.133856 1.88499 0.0343754 2.21591C0.00798065 2.30374 0.00586646 2.59787 0.00118274 6.84674C-0.00221622 9.91025 0.00168689 11.4498 0.0132011 11.5871C0.0346844 11.8436 0.0611442 11.9445 0.160869 12.1506C0.333744 12.5078 0.622671 12.7712 0.987595 12.9044C1.27426 13.009 0.891513 13.0026 6.56808 12.9978L11.7315 12.9933L11.869 12.9564C12.0438 12.9094 12.2722 12.8007 12.4004 12.7035C12.5141 12.6174 12.6719 12.4537 12.7482 12.3429C12.829 12.2254 12.9229 12.0117 12.9632 11.8534L13 11.709V7.9932V4.27737L12.9642 4.14321C12.9237 3.99156 12.8261 3.77347 12.7465 3.65661C12.6694 3.54353 12.4953 3.36623 12.3808 3.28423C12.2519 3.19188 12.0406 3.09169 11.8779 3.04571L11.7478 3.00895L6.38099 3.00073C1.3511 2.99302 1.00835 2.99074 0.920624 2.96433C0.646545 2.8818 0.5302 2.77355 0.507236 2.57967L0.497397 2.49671L0.552529 2.4965C0.582843 2.4964 1.88469 2.43813 3.44553 2.36704C5.00636 2.29594 7.45068 2.18559 8.87735 2.12182C10.304 2.05806 11.4811 2.00287 11.4931 1.99918C11.5111 1.99365 11.5137 1.88556 11.5078 1.3949C11.5014 0.855989 11.4975 0.786632 11.468 0.688183C11.3376 0.252692 10.9597 0.0436792 10.2434 0.0108141L10.0076 0L5.50279 0.751442ZM11.2887 7.04037C11.6334 7.14949 11.8899 7.41964 11.9771 7.76522C12.0194 7.93303 12.0027 8.19338 11.9395 8.35406C11.812 8.67783 11.5423 8.90641 11.2024 8.97879C10.8708 9.0494 10.4915 8.92246 10.259 8.66305C10.1669 8.56028 10.0625 8.3579 10.0311 8.22086C10.0029 8.09823 10.0063 7.87621 10.0383 7.75129C10.1278 7.40224 10.4328 7.10473 10.7828 7.02508C10.9081 6.99656 11.1759 7.00466 11.2887 7.04037Z" fill="#FFD588"/>
</svg>
