<svg width="20" height="20" viewBox="0 0 20 20" fill="none" xmlns="http://www.w3.org/2000/svg">
<path d="M17.7965 0.32405C17.6076 0.746283 17.2632 2.43522 17.3187 2.60189C17.3521 2.67967 17.4965 2.74634 17.641 2.74634C17.9187 2.74634 17.941 2.69078 18.2965 1.14629C18.3965 0.724061 18.4521 0.312938 18.4188 0.235158C18.3188 -0.00929284 17.9187 0.0573757 17.7965 0.32405Z" fill="url(#paint0_linear_18788_357)"/>
<path d="M6.07399 2.71295L2.42944 5.02413L2.10721 6.19083C1.02941 10.1687 0.929403 10.6021 1.05163 10.8021C1.10719 10.9132 2.21833 12.2132 3.49614 13.6799C5.54064 16.0133 5.8851 16.3689 6.22955 16.4355C6.45178 16.48 8.11849 16.6689 9.94076 16.8578C12.7297 17.1578 13.2742 17.1911 13.4297 17.0578C13.5297 16.98 14.5409 15.8578 15.6854 14.5688L17.7632 12.2243L18.6077 9.7687C19.1632 8.15755 19.4299 7.24641 19.3744 7.11307C19.1743 6.62417 17.5521 3.64631 17.4299 3.54631C17.2965 3.4352 9.94076 0.412891 9.79631 0.412891C9.76298 0.412891 8.08516 1.44625 6.07399 2.71295ZM12.8964 2.56851C14.2409 3.12408 15.3298 3.57964 15.3187 3.59076C15.3076 3.60187 14.2742 3.72409 13.0186 3.84632C11.763 3.97966 10.563 4.11299 10.3519 4.14633L9.96298 4.20188L10.0852 2.89074C10.1519 2.1685 10.2185 1.55737 10.2297 1.54626C10.2408 1.4907 10.0408 1.41292 12.8964 2.56851ZM9.31852 1.99071C9.28519 2.13516 9.21852 2.72407 9.17407 3.31297L9.09629 4.39078L7.24069 6.24638L5.38508 8.10199L4.4295 6.79084C3.76281 5.87971 3.49614 5.44636 3.57392 5.36858C3.74059 5.20191 9.16296 1.76848 9.28519 1.75737C9.32963 1.74626 9.35186 1.85738 9.31852 1.99071ZM16.5743 4.37967C16.5743 4.513 15.3298 9.69092 15.2854 9.73537C15.1965 9.82426 6.52956 11.5243 6.474 11.4576C6.44067 11.4243 6.27399 10.8354 6.10732 10.1576L5.80731 8.91312L7.72959 6.99085L9.64075 5.06857L13.0297 4.7019C14.8853 4.49078 16.4409 4.32411 16.4965 4.313C16.5409 4.313 16.5743 4.33522 16.5743 4.37967ZM17.9632 6.26861L18.541 7.3353L17.941 9.05757C17.6187 10.002 17.3076 10.8465 17.2632 10.9243C17.1965 11.0354 17.041 10.9465 16.6632 10.5465L16.1409 10.0243L16.7187 7.55753C17.041 6.20194 17.3187 5.12413 17.341 5.14635C17.3632 5.16858 17.6521 5.66859 17.9632 6.26861ZM3.96282 7.64642C4.90729 8.94646 4.95174 9.04646 5.24063 10.2132C5.55175 11.4243 5.55175 11.4243 5.31841 11.3465C5.18508 11.3021 4.38505 11.0465 3.52947 10.791C2.68501 10.5243 1.97388 10.2909 1.95165 10.2687C1.91832 10.2465 2.94057 6.30194 2.9739 6.30194C2.98502 6.30194 3.42947 6.91307 3.96282 7.64642ZM16.1632 11.3243L16.7743 12.0021L15.2076 13.7799C14.3409 14.7577 13.5075 15.7022 13.352 15.88L13.0742 16.2022L10.1519 14.2244L7.21846 12.2465L11.2075 11.4576C13.3964 11.0132 15.2742 10.6576 15.3742 10.6465C15.4742 10.6354 15.8298 10.9465 16.1632 11.3243ZM4.61839 12.0243C5.90732 12.4243 5.9851 12.4688 8.70739 14.3022C10.8408 15.7466 11.3964 16.1689 11.1075 16.1244C10.6408 16.0578 6.62956 15.6355 6.474 15.6355C6.41844 15.6355 5.54064 14.6911 4.5295 13.5355C3.14058 11.9465 2.76279 11.4465 2.99613 11.5243C3.1628 11.5799 3.88504 11.8021 4.61839 12.0243Z" fill="url(#paint1_linear_18788_357)"/>
<path d="M2.51832 2.43524C2.47388 2.70191 2.46277 3.11303 2.48499 3.35748C2.51832 3.74638 2.55166 3.80194 2.79611 3.80194C3.05167 3.80194 3.085 3.7575 3.16278 3.04636C3.2739 2.13523 3.22945 1.96856 2.86278 1.96856C2.62944 1.96856 2.57388 2.03523 2.51832 2.43524Z" fill="url(#paint2_linear_18788_357)"/>
<path d="M18.9967 2.41294C18.2967 2.77961 18.2078 2.86851 18.3078 3.12407C18.4078 3.37963 18.7078 3.3463 19.4078 3.00184C19.9412 2.73517 20.019 2.65739 19.9967 2.41294C19.9523 2.03515 19.7412 2.03515 18.9967 2.41294Z" fill="url(#paint3_linear_18788_357)"/>
<path d="M0.0961352 2.3796C-0.148316 2.61294 0.062801 2.99073 0.851711 3.69075C1.69618 4.44633 2.04063 4.56855 2.1073 4.1241C2.12952 3.95742 1.89618 3.66853 1.29617 3.10185C0.507258 2.34627 0.262806 2.20182 0.0961352 2.3796Z" fill="url(#paint4_linear_18788_357)"/>
<path d="M0.507415 5.01305C0.362967 5.39083 0.551861 5.53528 1.09632 5.50195C1.58522 5.46861 1.62967 5.44639 1.62967 5.19083C1.62967 4.93527 1.58522 4.91304 1.09632 4.87971C0.707421 4.85749 0.551861 4.89082 0.507415 5.01305Z" fill="url(#paint5_linear_18788_357)"/>
<path d="M13.9852 17.2245C13.863 17.5578 14.163 17.7356 15.0741 17.8356C16.1075 17.9578 16.2408 17.9245 16.2408 17.58C16.2408 17.2578 16.1297 17.2245 14.9852 17.1245C14.2074 17.0689 14.0408 17.08 13.9852 17.2245Z" fill="url(#paint6_linear_18788_357)"/>
<path d="M12.1299 18.5134C11.8743 19.0245 11.9299 19.3023 12.2965 19.3023C12.4743 19.3023 12.5965 19.1801 12.741 18.869C12.9632 18.3689 12.9077 18.0801 12.5854 18.0801C12.4299 18.0801 12.2854 18.2245 12.1299 18.5134Z" fill="url(#paint7_linear_18788_357)"/>
<path d="M13.5411 18.1578C13.3967 18.3023 13.4634 18.6023 13.8078 19.2357C14.0856 19.7357 14.1967 19.8579 14.3967 19.8357C14.7523 19.7801 14.7412 19.4357 14.3523 18.7134C14.03 18.1245 13.7523 17.9356 13.5411 18.1578Z" fill="url(#paint8_linear_18788_357)"/>
<defs>
<linearGradient id="paint0_linear_18788_357" x1="17.8706" y1="2.74634" x2="17.8706" y2="0.0835414" gradientUnits="userSpaceOnUse">
<stop stop-color="#F77433"/>
<stop offset="1" stop-color="#FEAF38" stop-opacity="0.99"/>
</linearGradient>
<linearGradient id="paint1_linear_18788_357" x1="10.1963" y1="17.1323" x2="10.1963" y2="0.412891" gradientUnits="userSpaceOnUse">
<stop stop-color="#F77433"/>
<stop offset="1" stop-color="#FEAF38" stop-opacity="0.99"/>
</linearGradient>
<linearGradient id="paint2_linear_18788_357" x1="2.8451" y1="3.80194" x2="2.8451" y2="1.96856" gradientUnits="userSpaceOnUse">
<stop stop-color="#F77433"/>
<stop offset="1" stop-color="#FEAF38" stop-opacity="0.99"/>
</linearGradient>
<linearGradient id="paint3_linear_18788_357" x1="19.1369" y1="3.29175" x2="19.1369" y2="2.1296" gradientUnits="userSpaceOnUse">
<stop stop-color="#F77433"/>
<stop offset="1" stop-color="#FEAF38" stop-opacity="0.99"/>
</linearGradient>
<linearGradient id="paint4_linear_18788_357" x1="1.05437" y1="4.38165" x2="1.05437" y2="2.3112" gradientUnits="userSpaceOnUse">
<stop stop-color="#F77433"/>
<stop offset="1" stop-color="#FEAF38" stop-opacity="0.99"/>
</linearGradient>
<linearGradient id="paint5_linear_18788_357" x1="1.04518" y1="5.50659" x2="1.04518" y2="4.87329" gradientUnits="userSpaceOnUse">
<stop stop-color="#F77433"/>
<stop offset="1" stop-color="#FEAF38" stop-opacity="0.99"/>
</linearGradient>
<linearGradient id="paint6_linear_18788_357" x1="15.1" y1="17.9002" x2="15.1" y2="17.0935" gradientUnits="userSpaceOnUse">
<stop stop-color="#F77433"/>
<stop offset="1" stop-color="#FEAF38" stop-opacity="0.99"/>
</linearGradient>
<linearGradient id="paint7_linear_18788_357" x1="12.4237" y1="19.3023" x2="12.4237" y2="18.0801" gradientUnits="userSpaceOnUse">
<stop stop-color="#F77433"/>
<stop offset="1" stop-color="#FEAF38" stop-opacity="0.99"/>
</linearGradient>
<linearGradient id="paint8_linear_18788_357" x1="14.0618" y1="19.8381" x2="14.0618" y2="18.0675" gradientUnits="userSpaceOnUse">
<stop stop-color="#F77433"/>
<stop offset="1" stop-color="#FEAF38" stop-opacity="0.99"/>
</linearGradient>
</defs>
</svg>
