<svg width="288" height="50" viewBox="0 0 288 50" fill="none" xmlns="http://www.w3.org/2000/svg">
<path d="M20.7782 12.8071C25.1959 4.89952 33.5454 0 42.6033 0H288V40C288 45.5228 283.523 50 278 50H0L20.7782 12.8071Z" fill="#F77433"/>
<path d="M20.7782 12.8071C25.1959 4.89952 33.5454 0 42.6033 0H288V40C288 45.5228 283.523 50 278 50H0L20.7782 12.8071Z" fill="url(#paint0_linear_15526_18)"/>
<defs>
<linearGradient id="paint0_linear_15526_18" x1="62.6087" y1="35.9756" x2="254.172" y2="42.0581" gradientUnits="userSpaceOnUse">
<stop stop-color="#FEAF38"/>
<stop offset="1" stop-color="#FFD588" stop-opacity="0"/>
</linearGradient>
</defs>
</svg>
