<svg width="25" height="25" viewBox="0 0 25 25" fill="none" xmlns="http://www.w3.org/2000/svg">
<path fill-rule="evenodd" clip-rule="evenodd" d="M13.2986 0.12288C7.68417 1.18427 4.09113 6.74351 5.44488 12.2746C5.69476 13.2958 6.38087 14.7842 7.00482 15.6585C8.34697 17.5393 10.4928 18.9931 12.765 19.5608C14.0447 19.8806 16.1138 19.8806 17.3935 19.5608C21.3445 18.5735 24.3354 15.2786 24.9219 11.2667C25.0817 10.1738 24.9884 8.42744 24.7145 7.38623C24.4427 6.35299 23.6617 4.74583 23.0231 3.90578C21.6841 2.14427 19.7053 0.828957 17.5509 0.268252C16.4471 -0.0189611 14.4165 -0.0884693 13.2986 0.12288ZM16.9246 0.938617C19.8227 1.53584 22.315 3.54896 23.4697 6.22557C23.6493 6.64202 23.8708 7.25508 23.9618 7.58799C24.182 8.39374 24.2708 10.5791 24.1163 11.3952C23.7354 13.4087 22.8613 15.0396 21.419 16.4273C17.7282 19.9789 11.9954 19.8516 8.45501 16.1396C5.95595 13.5195 5.24775 9.48267 6.70793 6.18108C7.85587 3.58527 10.3783 1.53917 13.1625 0.945477C14.1167 0.741997 15.9539 0.738668 16.9246 0.938617ZM14.7507 4.42603C14.6817 4.49503 14.6253 4.76842 14.6253 5.03375C14.6253 5.45372 14.5959 5.52172 14.3983 5.55975C13.7402 5.68666 13.0366 5.83354 12.8443 5.88449C12.667 5.9313 12.577 5.85665 12.3555 5.47874C12.0722 4.99531 11.8245 4.89483 11.5957 5.17054C11.4894 5.29866 11.5092 5.41579 11.7094 5.84313C11.8566 6.15758 11.9098 6.37458 11.8451 6.39617C11.7864 6.41574 11.3923 6.629 10.9694 6.87001L10.2005 7.30815L9.81985 6.91844C9.39685 6.48525 9.13799 6.42754 8.97587 6.73049C8.84997 6.96575 8.93814 7.17296 9.31312 7.52373L9.56805 7.76212L8.96407 8.32121C8.48316 8.7665 8.36634 8.93347 8.39065 9.14128C8.4425 9.58638 8.72497 9.50224 9.55171 8.79566C10.5882 7.90991 11.7286 7.21695 12.7975 6.8233C13.8286 6.44368 15.3128 6.31929 16.3651 6.52439C17.7028 6.78517 19.5412 7.78502 20.7933 8.93276C21.1062 9.21957 21.4095 9.45432 21.4671 9.45432C21.6076 9.45432 21.8888 9.1659 21.8888 9.02184C21.8888 8.95838 21.6107 8.64837 21.2708 8.33281L20.6528 7.75909L20.9895 7.34023C21.2578 7.0063 21.3042 6.88666 21.2184 6.75026C21.0312 6.45317 20.773 6.49372 20.3746 6.88282L19.9925 7.25599L19.2955 6.84197C18.9121 6.61417 18.547 6.42784 18.4842 6.42784C18.2604 6.42784 18.2524 6.22719 18.46 5.82023C18.6788 5.39138 18.658 5.07481 18.4046 4.97755C18.155 4.88182 17.9851 5.01034 17.7378 5.48197C17.5316 5.87531 17.4673 5.92726 17.2482 5.87682C17.0648 5.83465 15.7117 5.56681 15.4626 5.52343C15.4515 5.52151 15.4288 5.25892 15.4122 4.93982C15.3843 4.40525 15.362 4.35743 15.129 4.33019C14.9899 4.31395 14.8197 4.35703 14.7507 4.42603ZM14.5749 7.29352C14.4639 7.31783 14.1234 7.38734 13.8182 7.44777C13.0187 7.60635 11.6778 8.26088 10.797 8.92257C9.93728 9.56832 8.63388 10.8585 8.41648 11.2791C8.27907 11.5447 8.29057 11.5811 8.65859 12.0446C9.72876 13.3927 11.57 14.7756 13.0388 15.3345C13.7996 15.624 13.9695 15.6504 15.0793 15.6521C16.1418 15.6538 16.3812 15.621 17.0358 15.3839C18.3266 14.9166 19.2954 14.2591 20.6501 12.9309C21.3314 12.263 21.8888 11.6399 21.8888 11.5464C21.8888 11.4528 21.6237 11.0686 21.2998 10.6928C20.0018 9.18658 18.1638 7.92726 16.643 7.50214C16.049 7.33609 14.9063 7.22088 14.5749 7.29352ZM16.2118 9.4402C17.3494 10.0206 17.8185 11.449 17.2434 12.5817C16.3395 14.362 13.785 14.3344 12.9473 12.5354C12.3526 11.2582 12.9687 9.78653 14.3077 9.28585C14.7962 9.10325 15.6938 9.17599 16.2118 9.4402ZM14.5934 10.0007C13.879 10.2617 13.5156 10.765 13.5156 11.4938C13.5156 13.0202 15.4571 13.6633 16.3865 12.4449C17.3303 11.2077 16.0536 9.46744 14.5934 10.0007ZM3.63252 17.3721C2.38591 18.3883 1.35298 19.2586 1.33714 19.3061C1.3213 19.3536 2.27878 20.3623 3.46485 21.5473L5.62132 23.7021L7.47514 21.4187C8.49476 20.1628 9.34217 19.0965 9.35842 19.049C9.37456 19.0015 9.06898 18.7262 8.67938 18.4374C7.8936 17.8549 6.87015 16.7954 6.34364 16.0192C6.15448 15.7405 5.97713 15.5153 5.94939 15.5186C5.92165 15.5219 4.87903 16.356 3.63252 17.3721ZM0.3386 20.4738C-0.677086 22.4783 0.704098 24.8183 2.99151 24.9684C3.64352 25.0111 3.78203 24.9849 4.37865 24.7058C4.74314 24.5352 5.04145 24.3587 5.04145 24.3137C5.04145 24.2124 0.780265 19.9461 0.679079 19.9461C0.638928 19.9461 0.485687 20.1836 0.3386 20.4738Z" fill="#FD9149"/>
</svg>
