<svg width="25" height="25" viewBox="0 0 25 25" fill="none" xmlns="http://www.w3.org/2000/svg">
<path fill-rule="evenodd" clip-rule="evenodd" d="M9.0319 0.191026C7.64953 0.551883 6.35768 1.57418 5.73765 2.79783C5.29062 3.67982 5.13436 4.49697 5.13436 5.95122V7.29285L6.18166 6.25002C7.10886 5.32662 7.23487 5.15372 7.28142 4.74085C7.39661 3.71934 8.0797 2.83745 9.12744 2.35773C9.94771 1.98225 11.1053 2.0337 11.866 2.4795C12.5427 2.87607 13.0973 3.54745 13.3213 4.24114C13.589 5.06967 13.5986 13.0481 13.3326 13.5812C13.0927 14.0621 12.5711 14.4734 12.0858 14.5643C11.1696 14.7362 10.1407 13.7073 10.3126 12.7911C10.4625 11.9917 11.2194 11.4132 11.9963 11.5038L12.3894 11.5497L12.384 9.08865L12.3784 6.62762L11.3248 5.51145L10.2712 4.39529L5.13559 9.5292C0.944723 13.7186 0 14.7176 0 14.959C0 16.0338 2.41036 19.1601 5.30179 21.8358C7.22159 23.6123 9.28527 24.9885 10.0295 24.9885C10.2711 24.9885 11.2684 24.0443 15.4593 19.8471L20.5933 14.7058L18.0549 12.2293L15.5165 9.75288L15.4877 6.78879L15.4589 3.82459L15.0408 2.9791C14.3119 1.50531 12.8722 0.392717 11.3232 0.106421C10.4443 -0.0560927 9.90173 -0.0360018 9.0319 0.191026ZM19.784 12.5695L21.8768 14.6661L21.8773 18.2369C21.8776 21.6029 21.8904 21.8283 22.0995 22.1712C23.0046 23.6557 25.0057 22.9427 25 21.1378C24.9944 19.3789 24.53 17.0711 23.9035 15.6893C22.8456 13.3563 20.8208 11.5452 18.3076 10.6842L17.6912 10.473L19.784 12.5695Z" fill="#FF5500"/>
</svg>
