<svg width="20" height="20" viewBox="0 0 20 20" fill="none" xmlns="http://www.w3.org/2000/svg">
<path fill-rule="evenodd" clip-rule="evenodd" d="M7.17574 0.0232032C6.57548 0.0767199 5.82366 0.244715 5.22149 0.459885C4.48349 0.723608 3.5738 1.24013 2.92005 1.76667C1.55892 2.86287 0.559221 4.4878 0.177334 6.22473C0.025783 6.91408 -0.0373341 7.87081 0.0221735 8.57728C0.319386 12.1065 2.9014 15.002 6.37222 15.6984C7.33815 15.8922 8.43894 15.8961 9.4245 15.7094C10.3407 15.5358 11.2206 15.1952 12.0482 14.6939C12.216 14.5923 12.3624 14.5092 12.3737 14.5092C12.3849 14.5092 13.573 15.6865 15.0139 17.1256C17.5535 19.6618 17.6395 19.7448 17.8217 19.8331C18.1521 19.9931 18.4908 20.035 18.832 19.958C19.4846 19.8106 19.9567 19.2615 19.9959 18.604C20.0136 18.3072 19.9758 18.1128 19.8478 17.843L19.7468 17.6299L17.1236 15.0038L14.5004 12.3776L14.5412 12.3091C14.5635 12.2715 14.6459 12.1357 14.7241 12.0075C15.3074 11.0512 15.6835 9.93079 15.8198 8.7439C15.8656 8.34462 15.8584 7.4206 15.8062 7.00179C15.6352 5.62955 15.1678 4.41975 14.3789 3.30718C14.1305 2.95697 13.8724 2.65868 13.487 2.27677C12.1732 0.974849 10.4877 0.189644 8.64744 0.0221504C8.31804 -0.00785407 7.51757 -0.00725248 7.17574 0.0232032ZM8.67968 2.76767C9.58871 2.89446 10.4632 3.27797 11.2063 3.87586C11.4461 4.06877 11.9033 4.54195 12.0882 4.78852C12.5975 5.46767 12.9163 6.21528 13.0749 7.10205C13.146 7.49923 13.1396 8.37675 13.0626 8.80657C12.6471 11.1249 10.7961 12.8543 8.45944 13.1071C8.11844 13.1441 7.39437 13.1234 7.08079 13.068C5.47256 12.7832 4.14201 11.8419 3.36046 10.4359C2.88556 9.58149 2.65199 8.50727 2.73097 7.54071C2.83583 6.25751 3.35254 5.13191 4.24516 4.24238C5.15512 3.33553 6.27604 2.82365 7.58212 2.71847C7.79992 2.70095 8.39131 2.72744 8.67968 2.76767ZM7.29717 3.55646C7.11985 3.59233 6.97792 3.67513 6.84562 3.81988C6.69487 3.98485 6.63241 4.15249 6.63386 4.38826C6.63581 4.70616 6.85489 5.01984 7.15231 5.13056C7.23455 5.16119 7.38585 5.18492 7.56959 5.19608C7.72813 5.20568 7.97065 5.23626 8.10851 5.26401C8.52818 5.34856 8.77483 5.29915 9.0085 5.08376C9.47173 4.65675 9.28172 3.87626 8.67033 3.6947C8.32549 3.59228 7.52063 3.51127 7.29717 3.55646ZM10.0514 4.8376C9.96029 4.8734 9.86672 4.93897 9.77428 5.03179C9.65842 5.14813 9.62481 5.20292 9.57638 5.35437C9.4733 5.67668 9.54116 5.92165 9.82343 6.24623C10.3 6.79426 10.5228 7.34582 10.5771 8.11215C10.6035 8.48514 10.6617 8.62957 10.8558 8.80403C11.1818 9.09716 11.6526 9.09077 11.9718 8.78892C12.0458 8.71893 12.1268 8.6103 12.1604 8.5359C12.2134 8.41874 12.2192 8.37116 12.2174 8.06711C12.2143 7.52896 12.1119 7.02359 11.898 6.49076C11.625 5.81081 11.0533 5.02122 10.7154 4.85726C10.5379 4.77113 10.2429 4.76238 10.0514 4.8376Z" fill="#DADADA"/>
</svg>
