<svg width="15" height="15" viewBox="0 0 15 15" fill="none" xmlns="http://www.w3.org/2000/svg">
<path fill-rule="evenodd" clip-rule="evenodd" d="M6.69275 0.0730747C4.16458 0.317558 1.76903 2.02859 0.687806 4.36224C-0.229269 6.34142 -0.229269 8.70419 0.687806 10.6834C1.40401 12.2292 2.78615 13.6044 4.34579 14.323C5.91447 15.0458 7.90091 15.2022 9.54044 14.7324C12.5347 13.8742 14.7058 11.2742 14.9704 8.22965C15.2865 4.59153 13.0463 1.32784 9.53707 0.313707C9.05403 0.174172 7.50991 -0.0402752 7.32463 0.006563C7.30532 0.0113938 7.02097 0.0413591 6.69275 0.0730747ZM8.82873 2.19501C9.40044 2.52911 9.63972 3.37373 9.31781 3.92158C8.75248 4.8839 7.43542 4.82264 6.96628 3.81215C6.79462 3.44249 6.8001 3.1457 6.98566 2.75203C7.30371 2.07732 8.17613 1.81365 8.82873 2.19501ZM7.8512 5.24152C8.17515 5.38288 8.54199 5.77131 8.69385 6.13369C8.84909 6.50419 8.82662 6.8922 8.51819 9.16809C8.23335 11.2695 8.19937 11.6636 8.29106 11.8006C8.40712 11.9738 8.68852 12.0499 9.13919 12.0299C9.67749 12.006 9.70585 12.064 9.3409 12.4423C8.37503 13.4435 6.75179 13.0901 6.37463 11.7965C6.26391 11.4165 6.26826 11.3581 6.58483 8.97836C6.85226 6.96859 6.8939 6.51379 6.82551 6.34919C6.73178 6.12347 6.36417 5.91091 5.95225 5.84433C5.37836 5.75149 5.34164 5.73742 5.42189 5.64101C5.4975 5.55014 6.23098 5.24642 6.69275 5.1148C6.99844 5.02764 7.48239 5.08056 7.8512 5.24152Z" fill="url(#paint0_linear_2239_194)"/>
<defs>
<linearGradient id="paint0_linear_2239_194" x1="7.5" y1="0" x2="7.5" y2="15" gradientUnits="userSpaceOnUse">
<stop stop-color="#FEAA6F"/>
<stop offset="1" stop-color="#FFD588"/>
</linearGradient>
</defs>
</svg>
