<svg width="25" height="25" viewBox="0 0 25 25" fill="none" xmlns="http://www.w3.org/2000/svg">
<path d="M9.87925 0.488095C9.76188 0.767858 9.56627 1.10119 9.42445 1.27976C9.27774 1.45238 9.00389 1.69048 8.77405 1.83334C8.55399 1.97619 8.37305 2.10119 8.37305 2.1131C8.37305 2.125 8.55399 2.25 8.77405 2.39286C9.28752 2.71429 9.61517 3.1131 9.87925 3.7381C9.99661 4.00596 10.0993 4.2262 10.1091 4.2262C10.1189 4.2262 10.2216 4.00596 10.3389 3.7381C10.603 3.1131 10.9307 2.71429 11.4441 2.39286C11.6642 2.25 11.8451 2.125 11.8451 2.1131C11.8451 2.10119 11.6642 1.97619 11.4441 1.83334C10.9307 1.51191 10.603 1.1131 10.3389 0.488095C10.2216 0.220238 10.1189 -9.53674e-07 10.1091 -9.53674e-07C10.0993 -9.53674e-07 9.99661 0.220238 9.87925 0.488095Z" fill="#ffffff"/>
<path d="M23.1028 4.89879C22.9072 5.32141 22.5845 5.70236 22.2372 5.9345L21.9536 6.11903L22.2128 6.27974C22.5698 6.49998 22.9023 6.89879 23.093 7.32736L23.2544 7.69641L23.406 7.35117C23.5918 6.9226 23.8902 6.55355 24.2471 6.30355L24.521 6.11903L24.208 5.89284C23.8364 5.61903 23.6456 5.38093 23.4207 4.9226L23.2495 4.58331L23.1028 4.89879Z" fill="#ffffff"/>
<path d="M10.8965 10.125L8.30957 12.381H9.61527H10.921L13.4003 10.2262C14.7647 9.04169 15.9335 8.02383 15.9971 7.96431C16.1095 7.85716 16.0802 7.85716 14.7989 7.86312L13.4835 7.86907L10.8965 10.125Z" fill="#ffffff"/>
<path d="M14.7792 10.4286C13.3366 11.6845 12.0455 12.8095 11.9037 12.9345L11.6494 13.1548L12.1384 14.3512C12.5003 15.2202 12.647 15.5298 12.691 15.4881C12.7253 15.4583 14.0212 14.3333 15.5763 12.9821C17.1265 11.6369 18.398 10.5059 18.398 10.4702C18.398 10.3809 17.4737 8.15475 17.4297 8.15475C17.4101 8.15475 16.2169 9.17856 14.7792 10.4286Z" fill="#ffffff"/>
<path d="M1.97685 10.6131C1.78124 11.0357 1.45848 11.4167 1.11127 11.6488L0.827637 11.8333L1.08682 11.994C1.44381 12.2143 1.77635 12.6131 1.96707 13.0417L2.12844 13.4107L2.28004 13.0655C2.46587 12.6369 2.76418 12.2678 3.12117 12.0178L3.39502 11.8333L3.08204 11.6071C2.71039 11.3333 2.51967 11.0952 2.29471 10.6369L2.12355 10.2976L1.97685 10.6131Z" fill="#ffffff"/>
<path d="M15.8946 14.0953C14.4764 15.3333 13.3174 16.3572 13.3125 16.381C13.3125 16.4107 13.6059 16.4286 13.9678 16.4286H14.6231L17.21 14.1905C18.6282 12.9583 19.8117 11.9226 19.841 11.8988C19.8654 11.8691 19.5769 11.8452 19.1808 11.8512L18.4717 11.8572L15.8946 14.0953Z" fill="#ffffff"/>
<path d="M18.3495 14.5893C16.8042 15.9285 15.5083 17.0655 15.4741 17.1071C15.4203 17.1726 15.4936 17.3869 15.8897 18.3571C16.1538 19 16.3934 19.5119 16.4228 19.5C16.4961 19.4643 21.9732 14.7083 22.0808 14.5833C22.1688 14.4881 22.1541 14.4345 21.6896 13.3154C21.4255 12.6666 21.2005 12.1428 21.1859 12.1428C21.1712 12.1428 19.8948 13.244 18.3495 14.5893Z" fill="#ffffff"/>
<path d="M6.86227 14.6607C6.696 15.2559 6.56396 15.7619 6.56396 15.7916C6.56396 15.8155 7.71807 15.8333 9.13135 15.8333H11.6987L11.2342 14.7024L10.7696 13.5714H8.96508H7.16058L6.86227 14.6607Z" fill="#ffffff"/>
<path d="M8.95033 17.0476C8.90143 17.0893 8.8623 17.1548 8.8623 17.1965C8.8623 17.2798 9.51271 18.8691 9.54694 18.8691C9.56161 18.8691 9.67898 18.4762 9.81101 17.9881C9.94305 17.506 10.0604 17.0774 10.0702 17.0357C10.1044 16.9286 9.0677 16.9405 8.95033 17.0476Z" fill="#ffffff"/>
<path d="M18.6768 18.9583L16.3882 20.9524H15.8845H15.3808L15.0776 21.2321L14.7744 21.5178L16.1192 21.5357L17.4641 21.5476L20.0461 19.3095C21.4643 18.0774 22.6477 17.0416 22.6771 17.0178C22.7015 16.9881 22.3299 16.9643 21.8457 16.9643L20.9655 16.9702L18.6768 18.9583Z" fill="#ffffff"/>
<path d="M21.1613 19.7321C19.6013 21.0893 18.3054 22.2322 18.2809 22.2798C18.2565 22.3274 18.4032 22.75 18.7211 23.5238L19.2052 24.6905L21.6992 22.5238C23.0734 21.3333 24.3742 20.1964 24.5992 20L25.0002 19.6429L24.5111 18.4524C24.2422 17.7976 24.0172 17.2619 24.0074 17.2619C24.0025 17.2619 22.7213 18.375 21.1613 19.7321Z" fill="#ffffff"/>
<path d="M4.0503 18.6131C3.89382 19.1964 3.752 19.7083 3.74222 19.744C3.72266 19.8036 4.2508 19.8214 6.29004 19.8214C7.70333 19.8214 8.86232 19.8095 8.86232 19.7916C8.86232 19.7738 8.65693 19.2678 8.41241 18.6607L7.95762 17.5595H6.14822H4.33883L4.0503 18.6131Z" fill="#ffffff"/>
<path d="M10.8915 17.6309C10.8769 17.6726 10.7351 18.1845 10.5786 18.7619L10.2852 19.8214H12.8525C14.2609 19.8214 15.415 19.8095 15.415 19.7916C15.415 19.7738 15.2096 19.2678 14.9651 18.6607L14.5103 17.5595H12.7107C11.317 17.5595 10.9062 17.5774 10.8915 17.6309Z" fill="#ffffff"/>
<path d="M2.20675 21.1131L1.74707 21.5178L3.03321 21.5357L4.31934 21.5476L4.64699 21.2678L4.97464 20.9821L3.91345 20.9524C2.99898 20.9286 2.84249 20.9107 2.76424 20.8155C2.67133 20.7143 2.65177 20.7262 2.20675 21.1131Z" fill="#ffffff"/>
<path d="M5.86937 21.5952C5.47326 21.9464 5.13583 22.25 5.12116 22.2678C5.10649 22.2916 5.24831 22.6904 5.44392 23.1607C5.63953 23.6309 5.8058 23.9881 5.81558 23.9583C5.83025 23.9226 5.97206 23.4166 6.13833 22.8273L6.44153 21.7559L6.7594 21.4702C6.93544 21.3154 7.13105 21.1369 7.19952 21.0714L7.32177 20.9583H6.95501L6.58824 20.9642L5.86937 21.5952Z" fill="#ffffff"/>
<path d="M8.62743 21.2381L8.31445 21.5178L9.60059 21.5357L10.8818 21.5476L11.1459 21.3274C11.6154 20.9345 11.6545 20.9524 10.2265 20.9583H8.93552L8.62743 21.2381Z" fill="#ffffff"/>
<path d="M12.4372 21.6072C12.0215 21.9703 11.6743 22.2739 11.6596 22.2858C11.6498 22.2977 11.8063 22.7024 12.0068 23.1905L12.3687 24.0715L12.6719 22.9584C12.8431 22.3453 13.0142 21.7977 13.0582 21.7381C13.1022 21.6727 13.2881 21.4822 13.4739 21.3155C13.6548 21.1429 13.8015 20.9881 13.8015 20.9762C13.8015 20.9643 13.6646 20.9524 13.4935 20.9524H13.1903L12.4372 21.6072Z" fill="#ffffff"/>
<path d="M0.573171 22.75C0.402012 23.3095 -0.02344 24.9405 0.00101126 24.9643C0.015682 24.9821 1.16978 25 2.56351 25C4.55873 25 5.09666 24.9821 5.09666 24.9226C5.09177 24.8869 4.89127 24.369 4.64186 23.7798L4.19196 22.7083L2.39235 22.6905C0.979062 22.6786 0.587842 22.6905 0.573171 22.75Z" fill="#ffffff"/>
<path d="M6.86203 23.7679C6.69576 24.3631 6.56372 24.8869 6.56372 24.9286C6.56372 24.9821 7.10654 25 9.10665 25C10.7596 25 11.6496 24.9821 11.6496 24.9405C11.6496 24.9107 11.4442 24.3869 11.1997 23.7798L10.7449 22.6786H8.95017H7.16033L6.86203 23.7679Z" fill="#ffffff"/>
<path d="M13.728 22.7381C13.6889 22.8155 13.1167 24.8869 13.1167 24.9524C13.1167 24.9762 14.2708 25 15.6841 25C17.0974 25 18.2515 24.9881 18.2515 24.9702C18.2515 24.9524 18.0412 24.4286 17.7869 23.8095L17.3223 22.6786H15.5423C14.349 22.6786 13.7475 22.6964 13.728 22.7381Z" fill="#ffffff"/>
</svg>
