<svg width="25" height="17" viewBox="0 0 25 17" fill="none" xmlns="http://www.w3.org/2000/svg">
<path fill-rule="evenodd" clip-rule="evenodd" d="M6.6166 0.0324115C6.49427 0.0824816 6.39992 0.208342 6.37651 0.352758C6.35807 0.466209 6.45997 0.700665 7.09738 2.01145C7.89239 3.64638 7.9111 3.67465 8.19622 3.67512C8.37207 3.67539 8.59357 3.46121 8.59357 3.29096C8.59357 3.21732 8.31484 2.59973 7.85418 1.65262C7.26105 0.433051 7.09268 0.118928 7.00272 0.0641213C6.88347 -0.00853708 6.74458 -0.0199292 6.6166 0.0324115ZM18.7232 0.0619291C18.5951 0.14594 16.4413 2.93252 16.3589 3.12082C16.1955 3.49445 16.6831 3.85528 16.9891 3.58723C17.1945 3.40731 19.3178 0.603148 19.3421 0.479715C19.3673 0.351388 19.2968 0.168098 19.1872 0.0771184C19.0842 -0.00834132 18.8425 -0.0162883 18.7232 0.0619291ZM12.3879 1.51917L12.2735 1.6336V2.52002C12.2735 3.0531 12.2895 3.43643 12.3138 3.48173C12.3359 3.52319 12.4056 3.58367 12.4684 3.6162C12.6467 3.70836 12.8034 3.69039 12.9481 3.56116L13.076 3.447L13.0881 2.6137C13.0947 2.1554 13.0895 1.73844 13.0767 1.68711C13.005 1.40161 12.6034 1.3037 12.3879 1.51917ZM8.64423 4.36823C8.42641 4.41043 8.41173 4.45166 7.57146 7.38089L6.76462 10.1934L4.77239 10.2028C3.38518 10.2094 2.75447 10.2256 2.69567 10.2564C2.64924 10.2807 2.58316 10.3558 2.54887 10.4232C2.51453 10.4906 2.16843 11.6644 1.77969 13.0316C1.39095 14.3989 1.03788 15.6364 0.995089 15.7818L0.917263 16.046H0.586777C0.281306 16.046 0.247287 16.0542 0.13689 16.1537C-0.0842954 16.3531 -0.0280791 16.7288 0.238087 16.83C0.389041 16.8874 24.6616 16.8819 24.774 16.8244C25.0105 16.7035 25.075 16.3767 24.9022 16.1755C24.8143 16.0731 24.7829 16.0643 24.4422 16.046L24.0765 16.0265L23.2701 13.2108C22.5525 10.7058 22.4519 10.3851 22.3577 10.3041L22.2518 10.213H20.2566H18.2614L18.2238 10.1249C18.2031 10.0765 17.8405 8.8213 17.4181 7.33564C16.9956 5.84998 16.624 4.59333 16.5923 4.54307C16.4609 4.33531 16.5667 4.3404 12.4998 4.34615C10.4267 4.34909 8.69171 4.35903 8.64423 4.36823ZM16.6486 7.67818C17.0371 9.04006 17.3468 10.1675 17.3369 10.1836C17.327 10.1998 15.1443 10.213 12.4865 10.213C8.76895 10.213 7.65402 10.2022 7.65402 10.1663C7.65402 10.1282 8.98681 5.4145 9.04381 5.25101C9.05731 5.21238 9.78421 5.20208 12.5016 5.20208H15.9423L16.6486 7.67818ZM10.8087 13.5114C11.198 14.8731 11.5097 16.0005 11.5012 16.0167C11.4928 16.0328 9.30907 16.046 6.64855 16.046H1.8112L1.83293 15.9374C1.852 15.842 3.16709 11.2101 3.21086 11.084C3.22428 11.0454 3.9502 11.0351 6.66432 11.0353L10.1008 11.0354L10.8087 13.5114ZM13.9652 11.2602C12.622 15.9821 12.6086 16.0259 12.5035 16.0382L12.4032 16.0501L11.7061 13.6111C11.3227 12.2697 11.0008 11.1413 10.9907 11.1036C10.9736 11.0392 11.0644 11.0351 12.5009 11.0351H14.0293L13.9652 11.2602ZM22.4718 13.4721C22.8549 14.8124 23.1765 15.9399 23.1866 15.9775C23.2039 16.0425 22.9541 16.046 18.3417 16.046H13.4786L13.5053 15.9384C13.5201 15.8792 13.8132 14.8442 14.1568 13.6384C14.5004 12.4327 14.8079 11.3537 14.84 11.2406L14.8986 11.0351H18.3369H21.7753L22.4718 13.4721Z" fill="#FD9149"/>
</svg>
