<svg width="12" height="15" viewBox="0 0 12 15" fill="none" xmlns="http://www.w3.org/2000/svg">
<g id="signout">
<path id="image 162 (Traced)" fill-rule="evenodd" clip-rule="evenodd" d="M5.10589 0.0932032C3.99296 0.403366 3.09215 1.25199 2.70644 2.3536C2.58126 2.7113 2.56029 2.91667 2.58112 3.58141C2.60448 4.32793 2.62335 4.4153 2.87285 4.92924C3.54324 6.31031 5.05509 7.12455 6.51504 6.89087C7.6509 6.70901 8.64975 5.96626 9.15317 4.92924C9.40266 4.4153 9.42153 4.32793 9.4449 3.58141C9.46572 2.91667 9.44475 2.7113 9.31957 2.3536C8.92791 1.23487 8.02231 0.392553 6.88384 0.0879782C6.43718 -0.0314714 5.54399 -0.0288589 5.10589 0.0932032ZM7.06527 1.15867C7.57333 1.39641 8.05156 1.87406 8.29213 2.38401C8.45418 2.72755 8.48008 2.87915 8.47856 3.47255C8.47631 4.31356 8.31927 4.69564 7.74321 5.26219C6.78573 6.20364 5.24028 6.20364 4.2828 5.26219C3.76538 4.75333 3.56676 4.31168 3.52692 3.58141C3.5013 3.11137 3.52481 2.92262 3.65029 2.59003C3.91516 1.88778 4.39093 1.39677 5.09152 1.1025C5.66025 0.863675 6.485 0.887115 7.06527 1.15867ZM3.32793 7.27295C2.40898 7.57709 1.16993 8.59394 0.48654 9.60469C-0.0338568 10.3744 -0.0699239 10.4735 0.0706434 10.7477C0.463463 11.5138 1.17559 12.3423 1.9298 12.9107C3.13424 13.8181 4.2262 14.2082 5.72273 14.2653C7.17223 14.3207 7.79249 14.1546 7.78987 13.7118C7.78755 13.316 7.52129 13.1692 6.98892 13.2702C6.00655 13.4565 4.64601 13.2921 3.70224 12.8731C2.77154 12.4598 1.83089 11.6923 1.28662 10.902L1.01789 10.5118L1.29424 10.1105C1.72552 9.48437 2.63946 8.66832 3.24426 8.3694L3.76981 8.10968L4.38346 8.34582C4.9643 8.56933 5.04935 8.58218 5.97672 8.58537C6.9067 8.58856 6.98958 8.57666 7.60954 8.3509L8.26266 8.11309L8.80106 8.38523C9.50237 8.73966 10.4138 9.59779 10.9091 10.3699C11.2494 10.9004 11.2989 10.9472 11.5197 10.9472C11.802 10.9472 12 10.7618 12 10.4973C12 10.268 11.4248 9.37892 10.9207 8.82913C10.4712 8.33871 9.74562 7.78957 9.10687 7.45619C8.50577 7.14254 8.12747 7.14153 7.23805 7.45118C6.33928 7.76417 5.70292 7.76838 4.82424 7.46729C4.03396 7.19646 3.69288 7.15212 3.32793 7.27295ZM7.35271 10.2034C7.21033 10.3827 7.19771 10.4657 7.22855 11.0211C7.28051 11.9572 7.62042 12.5238 8.34184 12.8767C8.69641 13.0502 8.82951 13.0729 9.53532 13.08C9.97226 13.0844 10.33 13.1068 10.3303 13.1298C10.3306 13.1528 10.2458 13.2507 10.1418 13.3475C9.88438 13.5869 9.80237 13.8205 9.90637 14.018C10.015 14.2245 10.1093 14.2832 10.3309 14.2828C10.6034 14.2823 12 12.902 12 12.6332C12 12.3591 10.6019 10.9467 10.3322 10.9483C10.109 10.9497 10.0149 11.0085 9.90658 11.2141C9.80165 11.4135 9.85833 11.5747 10.1379 11.8725L10.3593 12.1083H9.58205C8.80621 12.1083 8.80433 12.1079 8.54801 11.8725C8.2602 11.6081 8.15824 11.2887 8.15555 10.6429C8.1541 10.2994 8.12667 10.2107 7.99249 10.1168C7.75308 9.9491 7.5308 9.97922 7.35271 10.2034Z" fill="white"/>
</g>
</svg>
