<svg width="24" height="21" viewBox="0 0 24 21" fill="none" xmlns="http://www.w3.org/2000/svg">
<path d="M0.786667 0.226771C0.266667 0.546771 0 1.09344 0 1.8401C0 2.6001 0.373333 3.17344 1.02667 3.45344C1.37333 3.6001 1.4 3.65344 1.36 4.26677C1.29333 5.13344 1.66667 5.7601 2.4 6.05344C2.69333 6.17344 3.02667 6.26677 3.13333 6.26677C3.26667 6.26677 3.33333 6.4001 3.33333 6.69344C3.33333 7.69344 4.32 8.49344 5.36 8.3601C5.81333 8.29344 5.88 8.33344 5.94667 8.61344C6.05333 9.01344 6.81333 9.69344 7.29333 9.81344C7.49333 9.86677 7.89333 9.8401 8.18667 9.7601C8.69333 9.62677 8.74667 9.6401 8.98667 9.94677C9.53333 10.6801 10.7467 10.8934 11.5733 10.4001C12.0133 10.1334 12.0133 10.1334 12.36 10.4001C13.12 11.0001 14.2533 10.8534 14.9067 10.0534C15.2533 9.6401 15.32 9.6001 15.6533 9.73344C16.5333 10.0668 17.5733 9.65344 17.9467 8.81344C18.16 8.3201 18.2 8.30677 18.6533 8.3601C19.68 8.49344 20.6667 7.69344 20.6667 6.7201C20.6667 6.33344 20.72 6.29344 21.16 6.2001C22.2 6.01344 22.7333 5.29344 22.64 4.21344C22.6 3.65344 22.6267 3.58677 22.9733 3.45344C23.6267 3.17344 24 2.6001 24 1.8401C24 0.653438 23.3467 0.000104904 22.16 0.000104904C21.64 0.000104904 21.4 0.0801048 21.08 0.333438C20.6 0.746771 20.3467 1.45344 20.4533 2.13344C20.52 2.57344 20.4933 2.65344 20.2267 2.7201C19.6933 2.85344 19.1733 3.5201 19.1067 4.18677C19.04 4.77344 19.0133 4.8001 18.5867 4.8001C18.08 4.8001 17.44 5.2801 17.2133 5.85344C17.0667 6.2001 16.9867 6.2401 16.4267 6.22677C15.68 6.21344 14.9867 6.54677 14.7733 7.01344C14.64 7.29344 14.56 7.33344 14.28 7.2401C13.6133 7.0401 12.8267 7.1201 12.4133 7.4401L12.0133 7.73344L11.5067 7.38677C11 7.0401 10.4267 7.0001 9.65333 7.25344C9.45333 7.33344 9.34667 7.2801 9.22667 7.01344C9.01333 6.54677 8.32 6.21344 7.56 6.22677C7 6.2401 6.92 6.2001 6.85333 5.9201C6.72 5.41344 5.93333 4.8001 5.4 4.8001C4.94667 4.8001 4.93333 4.77344 4.93333 4.3201C4.93333 3.66677 4.49333 2.98677 3.93333 2.78677C3.49333 2.62677 3.48 2.61344 3.56 2.0001C3.64 1.29344 3.41333 0.720104 2.85333 0.280105C2.41333 -0.0665617 1.30667 -0.0932283 0.786667 0.226771ZM2.37333 0.880105C3.06667 1.3601 3.01333 2.34677 2.25333 2.73344C1.73333 3.01344 1.54667 2.98677 1.08 2.58677C0.0133333 1.69344 1.24 0.0801048 2.37333 0.880105ZM23 1.0001C23.4933 1.4801 23.4533 2.14677 22.92 2.58677C22.4667 2.97344 22.2933 3.0001 21.8 2.77344C21.44 2.61344 21.0667 2.05344 21.0667 1.66677C21.0667 1.54677 21.24 1.26677 21.4533 1.05344C21.96 0.560104 22.5467 0.533438 23 1.0001ZM4.12 3.8801C4.50667 4.57344 3.94667 5.46677 3.13333 5.46677C1.89333 5.46677 1.57333 3.8801 2.70667 3.4001C3.24 3.18677 3.84 3.38677 4.12 3.8801ZM21.8 3.77344C22.28 4.46677 21.7733 5.46677 20.9333 5.46677C20.36 5.46677 20.0667 5.2801 19.8667 4.8001C19.3733 3.61344 21.0667 2.7201 21.8 3.77344ZM5.74667 5.6401C6.32 6.0801 6.4 6.7601 5.94667 7.2801C5.12 8.25344 3.56 7.21344 4.16 6.09344C4.24 5.93344 4.4 5.73344 4.52 5.6401C4.8 5.42677 5.46667 5.42677 5.74667 5.6401ZM19.6667 5.8001C20.1333 6.25344 20.1067 6.8401 19.6 7.3601C19.2533 7.69344 19.12 7.74677 18.76 7.6801C18.2267 7.57344 17.8933 7.25344 17.7867 6.7201C17.7333 6.4001 17.7867 6.22677 18.0667 5.89344C18.52 5.34677 19.1867 5.30677 19.6667 5.8001ZM8.46667 7.26677C9.29333 8.0801 8.37333 9.49344 7.30667 9.05344C6.92 8.89344 6.53333 8.33344 6.53333 7.94677C6.53333 7.8401 6.69333 7.57344 6.88 7.34677C7.32 6.81344 7.98667 6.77344 8.46667 7.26677ZM17.12 7.34677C17.3067 7.57344 17.4667 7.8401 17.4667 7.94677C17.4667 8.33344 17.08 8.89344 16.6933 9.05344C15.6267 9.49344 14.7067 8.0801 15.5333 7.26677C16.0133 6.77344 16.68 6.81344 17.12 7.34677ZM11.1867 8.0801C11.5067 8.34677 11.6 8.53344 11.6 8.8801C11.6 9.8401 10.52 10.3334 9.81333 9.69344C9.25333 9.2001 9.33333 8.2801 9.97333 7.94677C10.4933 7.66677 10.72 7.6801 11.1867 8.0801ZM14.2667 8.2001C14.9333 8.90677 14.44 10.0001 13.4533 10.0001C13.0667 10.0001 12.8933 9.9201 12.68 9.65344C12.0933 8.90677 12.5333 7.86677 13.4533 7.86677C13.8133 7.86677 14.04 7.9601 14.2667 8.2001Z" fill="url(#paint0_linear_18788_504)"/>
<path d="M8.25344 12.3467L7.36011 13.2267L9.61344 16.9867C10.8534 19.0401 11.9201 20.7334 12.0001 20.7334C12.0801 20.7334 13.1468 19.0401 14.3868 16.9867L16.6401 13.2267L15.7468 12.3467L14.8534 11.4667H12.0001H9.13344L8.25344 12.3467ZM11.2001 12.1734C11.2001 12.2001 11.0668 12.3467 10.8934 12.5067L10.5868 12.8001L10.2668 12.4667L9.96011 12.1334H10.5734C10.9201 12.1334 11.2001 12.1467 11.2001 12.1734ZM14.0001 12.1734C14.0001 12.2001 13.8668 12.3467 13.6934 12.5067L13.3868 12.8001L13.0668 12.4667L12.7601 12.1334H13.3734C13.7201 12.1334 14.0001 12.1467 14.0001 12.1734ZM9.53344 12.6667C9.77344 12.9334 9.76011 12.9334 9.20011 12.9334C8.64011 12.9334 8.62677 12.9334 8.86677 12.6667C9.00011 12.5201 9.14677 12.4001 9.20011 12.4001C9.25344 12.4001 9.40011 12.5201 9.53344 12.6667ZM12.3334 12.6667C12.5734 12.9334 12.5601 12.9334 12.0001 12.9334C11.4401 12.9334 11.4268 12.9334 11.6668 12.6667C11.8001 12.5201 11.9468 12.4001 12.0001 12.4001C12.0534 12.4001 12.2001 12.5201 12.3334 12.6667ZM15.1334 12.6667C15.3734 12.9334 15.3601 12.9334 14.8001 12.9334C14.2401 12.9334 14.2268 12.9334 14.4668 12.6667C14.6001 12.5201 14.7468 12.4001 14.8001 12.4001C14.8534 12.4001 15.0001 12.5201 15.1334 12.6667ZM10.8134 16.0134C11.0801 17.3334 11.2534 18.3601 11.2001 18.3067C11.1201 18.2267 8.65344 14.1067 8.44011 13.6934C8.41344 13.6401 8.82677 13.6001 9.36011 13.6001H10.3468L10.8134 16.0134ZM12.5468 16.0001C12.2934 17.3201 12.0401 18.4001 12.0001 18.4001C11.9601 18.4001 11.7068 17.3201 11.4534 16.0001L10.9734 13.6001H12.0001H13.0268L12.5468 16.0001ZM15.5601 13.6934C15.3468 14.1067 12.8801 18.2267 12.8001 18.3067C12.7468 18.3601 12.9201 17.3334 13.1868 16.0134L13.6534 13.6001H14.6401C15.1734 13.6001 15.5868 13.6401 15.5601 13.6934Z" fill="url(#paint1_linear_18788_504)"/>
<defs>
<linearGradient id="paint0_linear_18788_504" x1="12" y1="10.768" x2="12" y2="0.000104904" gradientUnits="userSpaceOnUse">
<stop stop-color="#F77433"/>
<stop offset="1" stop-color="#FEAF38"/>
</linearGradient>
<linearGradient id="paint1_linear_18788_504" x1="12.0001" y1="20.7334" x2="12.0001" y2="11.4667" gradientUnits="userSpaceOnUse">
<stop stop-color="#F77433"/>
<stop offset="1" stop-color="#FEAF38"/>
</linearGradient>
</defs>
</svg>
