<svg width="34" height="38" viewBox="0 0 34 38" fill="none" xmlns="http://www.w3.org/2000/svg">
<path d="M1.37297 31.1357C2.37297 31.2727 5.44354 31.6357 5.46418 31.6407C5.6475 31.6985 5.79119 31.8421 5.84867 32.0257C5.84867 32.0257 6.1899 35.0358 6.33863 36.0344C6.55793 37.5062 8.55041 37.9674 9.56605 36.9094C10.9179 35.502 15.0853 31.3907 15.0853 31.3907H15.0856C15.6054 31.6909 16.1922 31.8575 16.7924 31.875C17.3926 31.8575 17.9793 31.6909 18.4992 31.3907C18.4992 31.3907 22.6674 35.502 24.0185 36.9094C25.0341 37.9682 27.0265 37.5062 27.2459 36.0344C27.3946 35.0344 27.7359 32.0257 27.7359 32.0257H27.7361C27.7936 31.8421 27.9373 31.6985 28.1206 31.6407C28.1206 31.6407 31.1307 31.3006 32.1287 31.1513C33.6005 30.932 34.0626 28.9387 33.0037 27.9231C31.9836 26.9437 29.0037 23.9231 29.0037 23.9231C29.2618 23.6918 29.555 23.4663 29.8631 23.2356C30.7236 22.5874 31.6131 21.9169 31.9543 20.8662C32.2804 19.86 31.9663 18.8157 31.6619 17.8037V17.8039C31.4459 17.2035 31.3148 16.576 31.2723 15.9395C31.3148 15.3028 31.4459 14.6753 31.6619 14.0751C31.9663 13.0645 32.2807 12.0201 31.9543 11.0126C31.613 9.96265 30.7236 9.29186 29.8631 8.64372C29.3572 8.30304 28.9013 7.89372 28.5081 7.42751C28.1808 6.90267 27.9283 6.33458 27.7581 5.74001C27.4043 4.72944 27.0424 3.68758 26.1618 3.04386C25.2813 2.40015 24.1886 2.38566 23.1236 2.36306C22.4989 2.3826 21.8745 2.31535 21.2681 2.16329C20.714 1.93728 20.1939 1.63539 19.7229 1.26621C18.8766 0.672464 17.9174 0 16.7924 0C15.6674 0 14.7081 0.672436 13.8619 1.26621C13.3909 1.63536 12.8708 1.93725 12.3167 2.16329C11.7104 2.31535 11.0857 2.38259 10.4607 2.36306C9.3982 2.38567 8.29441 2.40938 7.42334 3.04359C6.55198 3.67807 6.18084 4.73109 5.83013 5.74059H5.82985C5.65993 6.33545 5.40741 6.90323 5.07985 7.42809C4.68699 7.8946 4.23078 8.30394 3.72492 8.6443C2.86442 9.29246 1.97492 9.96294 1.6337 11.0137C1.30753 12.0199 1.62171 13.0642 1.92612 14.0762C2.14096 14.6758 2.27126 15.3022 2.31312 15.9376C2.27071 16.574 2.13957 17.2015 1.92361 17.802C1.6192 18.8126 1.30475 19.857 1.6312 20.8645C1.97243 21.9144 2.86191 22.5852 3.72241 23.2334C4.03045 23.4658 4.3237 23.6915 4.58177 23.9209C4.58177 23.9209 1.59934 26.9409 0.581769 27.9209C0.093212 28.3955 -0.107124 29.0936 0.0555403 29.7552C0.218483 30.4167 0.719884 30.9421 1.37304 31.1357L1.37297 31.1357ZM32.123 28.807C32.3113 28.9855 32.3883 29.2523 32.3241 29.5037C32.2745 29.7007 32.1255 29.8572 31.931 29.9163C31.8378 29.9331 27.9224 30.3976 27.8392 30.4219C27.2022 30.6072 26.7041 31.1052 26.5192 31.7425C26.4975 31.8161 26.0287 35.7526 26.0136 35.8343C25.9338 36.0525 25.7436 36.2115 25.5145 36.2508C25.2857 36.2905 25.0533 36.2045 24.9048 36.0257L19.5853 30.707L19.5856 30.7068C20.5552 29.8454 21.8331 29.414 23.1266 29.512C24.1891 29.4894 25.2929 29.4657 26.164 28.8315C27.0353 28.197 27.4065 27.1439 27.7572 26.1344H27.7575C27.8919 25.7204 28.0518 25.3147 28.2354 24.9199L32.123 28.807ZM4.47511 22.2344C3.73625 21.6789 3.03761 21.1532 2.82083 20.4783C2.61463 19.8438 2.86017 19.0271 3.12077 18.1627V18.1624C3.37523 17.4462 3.5245 16.6967 3.56329 15.9375C3.52451 15.1783 3.37551 14.4289 3.12077 13.7127C2.86017 12.8483 2.61463 12.0322 2.82083 11.4002C3.03958 10.7252 3.73654 10.1995 4.47454 9.64319C5.08168 9.23164 5.62518 8.73333 6.0884 8.1644C6.4927 7.54163 6.80354 6.86304 7.0114 6.15019C7.3119 5.28326 7.59566 4.46269 8.15954 4.05447C8.71339 3.65074 9.57525 3.6326 10.4877 3.61334V3.61306C11.2346 3.63371 11.9807 3.54582 12.7025 3.35246C13.3761 3.09186 14.0078 2.73388 14.5775 2.28996C15.342 1.75508 16.0619 1.25003 16.7927 1.25003C17.5235 1.25003 18.2433 1.75506 19.0064 2.28996C19.5762 2.73388 20.2078 3.09189 20.8814 3.35246C21.603 3.5461 22.349 3.63343 23.0957 3.61251C24.0089 3.6326 24.8708 3.65073 25.4244 4.05447C25.9869 4.46435 26.2718 5.28326 26.5725 6.15019H26.5728C26.7807 6.86224 27.0918 7.53997 27.4958 8.1619C27.9587 8.73054 28.5022 9.2289 29.1088 9.64069C29.8477 10.1962 30.5463 10.7219 30.7631 11.3968C30.9693 12.0313 30.7238 12.848 30.4632 13.7124L30.4634 13.7127C30.2087 14.4289 30.0597 15.1784 30.0209 15.9375C30.0597 16.6968 30.2087 17.4462 30.4634 18.1624C30.724 19.0268 30.9696 19.8429 30.7634 20.4749C30.5446 21.1498 29.8477 21.6755 29.1097 22.2319C28.5025 22.6434 27.9587 23.1417 27.4958 23.7107C27.0918 24.3334 26.7812 25.0123 26.574 25.7249C26.2735 26.5918 25.9897 27.4124 25.4258 27.8206C24.872 28.2243 24.0101 28.2425 23.0977 28.2617V28.262C22.3507 28.2414 21.6047 28.3293 20.8828 28.5226C20.2093 28.7832 19.5776 29.1412 19.0078 29.5851C18.2433 30.12 17.5235 30.625 16.7927 30.625C16.0619 30.625 15.342 30.12 14.579 29.5851C14.0092 29.1412 13.3775 28.7832 12.704 28.5226C11.9824 28.329 11.2363 28.2416 10.4897 28.2626C9.57646 28.2425 8.71453 28.2243 8.16096 27.8206C7.59846 27.4107 7.3136 26.5918 7.01281 25.7249H7.01253C6.80466 25.0128 6.49356 24.3351 6.08953 23.7132C5.62608 23.1443 5.08225 22.6462 4.47511 22.2344ZM1.46454 28.807C2.41768 27.8175 5.35518 24.92 5.35518 24.92C5.53878 25.3148 5.69865 25.7205 5.83342 26.1345C6.18415 27.1457 6.54715 28.1909 7.42663 28.8315C8.30612 29.4722 9.39985 29.4897 10.4648 29.5121H10.4646C11.7578 29.4141 13.0357 29.8455 14.0053 30.7068C14.0053 30.7068 10.0396 34.72 8.68578 36.0255C8.34315 36.3561 7.72064 36.3924 7.577 35.8344C7.327 34.8561 7.2232 32.8257 7.08704 31.8249V31.8251C7.02761 31.4702 6.85908 31.1427 6.6049 30.8885C6.35043 30.634 6.02315 30.4652 5.66825 30.4058C4.67133 30.2476 2.63897 30.1614 1.65961 29.9164C1.09711 29.7763 1.13534 29.1488 1.46458 28.807L1.46454 28.807Z" fill="#FF5500"/>
<path d="M16.7921 27.4993C19.8588 27.4993 22.7996 26.2811 24.9678 24.1129C27.136 21.9444 28.3543 19.0035 28.3543 15.9371C28.3543 12.8708 27.136 9.92964 24.9678 7.76143C22.7993 5.59321 19.8585 4.375 16.7921 4.375C13.7258 4.375 10.7846 5.59321 8.61641 7.76143C6.44819 9.92993 5.22998 12.8708 5.22998 15.9371C5.23333 19.0027 6.45262 21.9416 8.62034 24.1093C10.7881 26.277 13.7269 27.4963 16.7925 27.4996L16.7921 27.4993ZM16.7921 5.62429C19.5271 5.62429 22.1501 6.71079 24.0843 8.64464C26.0181 10.5788 27.1046 13.2019 27.1046 15.9368C27.1046 18.6717 26.0181 21.2948 24.0843 23.2289C22.1501 25.1628 19.5271 26.2493 16.7921 26.2493C14.0572 26.2493 11.4341 25.1628 9.49998 23.2289C7.56612 21.2948 6.47962 18.6717 6.47962 15.9368C6.48269 13.2027 7.57034 10.5816 9.50362 8.64821C11.4369 6.71493 14.0581 5.62729 16.7922 5.62421L16.7921 5.62429Z" fill="#FF5500"/>
<path d="M13.0422 15C13.7052 15 14.3411 14.7366 14.8101 14.2679C15.2788 13.7988 15.5422 13.1629 15.5422 12.5C15.5422 11.8371 15.2788 11.2011 14.8101 10.7321C14.3411 10.2634 13.7052 10 13.0422 10C12.3793 10 11.7434 10.2634 11.2744 10.7321C10.8056 11.2012 10.5422 11.8371 10.5422 12.5C10.5422 13.1629 10.8056 13.7989 11.2744 14.2679C11.7434 14.7366 12.3793 15 13.0422 15ZM13.0422 11.25C13.3737 11.25 13.6918 11.3817 13.9262 11.6161C14.1605 11.8504 14.2922 12.1685 14.2922 12.5C14.2922 12.8315 14.1605 13.1496 13.9262 13.3839C13.6918 13.6183 13.3737 13.75 13.0422 13.75C12.7108 13.75 12.3927 13.6183 12.1583 13.3839C11.9239 13.1496 11.7922 12.8315 11.7922 12.5C11.7922 12.1685 11.9239 11.8504 12.1583 11.6161C12.3927 11.3817 12.7108 11.25 13.0422 11.25Z" fill="#FF5500"/>
<path d="M20.5422 17.5C19.8793 17.5 19.2434 17.7634 18.7744 18.2321C18.3056 18.7012 18.0422 19.3371 18.0422 20C18.0422 20.6629 18.3056 21.2989 18.7744 21.7679C19.2434 22.2366 19.8793 22.5 20.5422 22.5C21.2052 22.5 21.8411 22.2366 22.3101 21.7679C22.7788 21.2988 23.0422 20.6629 23.0422 20C23.0422 19.3371 22.7788 18.7011 22.3101 18.2321C21.8411 17.7634 21.2052 17.5 20.5422 17.5ZM20.5422 21.25C20.2108 21.25 19.8927 21.1183 19.6583 20.8839C19.4239 20.6496 19.2922 20.3315 19.2922 20C19.2922 19.6685 19.4239 19.3504 19.6583 19.1161C19.8927 18.8817 20.2108 18.75 20.5422 18.75C20.8737 18.75 21.1918 18.8817 21.4262 19.1161C21.6605 19.3504 21.7922 19.6685 21.7922 20C21.7922 20.3315 21.6605 20.6496 21.4262 20.8839C21.1918 21.1183 20.8737 21.25 20.5422 21.25Z" fill="#FF5500"/>
<path d="M11.6629 21.3789C12.0329 21.7369 12.5278 21.9364 13.0426 21.9347C13.5574 21.9333 14.0515 21.7308 14.4193 21.3708C16.2619 19.4657 21.8678 13.8258 21.8678 13.8258V13.8255C22.2197 13.474 22.4172 12.9971 22.4172 12.4997C22.4172 12.0025 22.2197 11.5253 21.8678 11.1738C21.5104 10.834 21.0363 10.6445 20.543 10.6445C20.05 10.6445 19.5757 10.834 19.2185 11.1738C19.2185 11.1738 13.5765 16.7788 11.6707 18.6245C11.3096 18.9915 11.1065 19.4853 11.1051 20.0001C11.1037 20.5149 11.3038 21.0099 11.6626 21.379L11.6629 21.3789ZM12.549 19.512C14.4558 17.6677 18.241 13.9495 20.1005 12.057C20.3454 11.8137 20.7414 11.8148 20.9847 12.0598C21.228 12.3048 21.2266 12.7004 20.9819 12.944C19.0893 14.8023 15.3725 18.5852 13.5297 20.4918C13.2591 20.7628 12.8202 20.7628 12.5495 20.4921C12.2786 20.2215 12.2786 19.7826 12.5493 19.5119L12.549 19.512Z" fill="#FF5500"/>
</svg>
