<svg width="18" height="19" viewBox="0 0 18 19" fill="none" xmlns="http://www.w3.org/2000/svg">
<g id="bangles">
<path id="image 115 (Traced)" fill-rule="evenodd" clip-rule="evenodd" d="M10.9432 0.646809C10.0241 0.729175 8.9019 1.12779 7.75392 1.7797C6.13513 2.69897 4.4123 4.1401 3.06148 5.7049C1.71308 7.26686 0.704261 8.94736 0.264318 10.3644C-0.142243 11.6739 -0.0786858 12.7383 0.447353 13.4299C0.629752 13.6696 2.59597 15.6239 2.77635 15.7447C3.40622 16.1665 4.30151 16.2444 5.40778 15.9735C7.73709 15.4031 10.773 13.2033 12.9164 10.5329C14.304 8.80405 15.2122 7.03763 15.4779 5.55101C15.534 5.23669 15.5347 4.52627 15.4791 4.26816C15.3982 3.89276 15.2808 3.62907 15.072 3.35382C14.8994 3.12623 12.9296 1.16633 12.7393 1.03279C12.287 0.715371 11.6664 0.582023 10.9432 0.646809ZM11.6016 1.44758C12.0626 1.48939 12.4646 1.71454 12.6273 2.02192C12.6872 2.13521 12.7966 2.44402 12.7815 2.45739C12.7783 2.46022 12.6424 2.47935 12.4794 2.4999C11.1767 2.66417 9.74459 3.3937 8.04623 4.75816C6.12537 6.30141 4.83139 7.57218 3.86653 8.86298C2.81726 10.2667 2.15577 11.7559 1.97429 13.1231C1.9297 13.4592 1.9455 13.4429 1.71967 13.3844C1.26045 13.2654 0.952675 12.9484 0.836709 12.4748C0.787702 12.2748 0.770825 11.8475 0.801572 11.5855C0.978462 10.0781 2.05391 8.10242 3.75785 6.15454C4.09447 5.76971 5.12144 4.74251 5.50042 4.41156C6.6324 3.42302 7.71529 2.67652 8.78144 2.14983C9.66394 1.71386 10.3752 1.4884 11.0262 1.43836C11.257 1.42063 11.3144 1.42153 11.6016 1.44758ZM12.8086 3.27404C12.8083 3.3223 12.7367 3.72263 12.7077 3.83818L12.674 3.9723L12.5274 4.02381C10.8062 4.62819 8.84884 5.9475 7.13568 7.65789C5.43554 9.35528 4.06741 11.3672 3.44612 13.0835C3.40352 13.2012 3.36531 13.3008 3.36119 13.3049C3.3471 13.319 2.83396 13.4184 2.77409 13.4186C2.72111 13.4189 2.71539 13.412 2.72388 13.3585C2.93275 12.0449 3.36643 10.9884 4.20815 9.74282C4.75061 8.94007 5.36362 8.22314 6.28262 7.31668C6.97497 6.63377 7.43817 6.22088 8.25472 5.55884C9.92694 4.20304 11.2715 3.48508 12.5014 3.29123C12.7223 3.25642 12.8087 3.25159 12.8086 3.27404ZM16.0353 4.29318C16.035 4.30145 16.0554 4.39034 16.0807 4.4907C16.1538 4.78182 16.1642 5.40877 16.1028 5.83208C15.8043 7.88982 14.2302 10.5091 11.9384 12.7614C9.7296 14.9323 7.22918 16.4 5.22608 16.7014C5.05178 16.7276 4.83655 16.7411 4.58963 16.7412C4.22966 16.7414 4.13948 16.731 3.81397 16.6521C3.72963 16.6317 3.66682 16.6263 3.65464 16.6385C3.64246 16.6507 3.9309 16.9528 4.3864 17.4049C5.18478 18.1973 5.31997 18.3087 5.6484 18.4455C6.24744 18.6949 6.98166 18.705 7.8926 18.4766C9.08178 18.1784 10.4847 17.449 11.8692 16.4093C13.628 15.0884 15.1322 13.5171 16.2761 11.8058C17.918 9.34951 18.425 7.15992 17.6331 5.9455C17.5474 5.81406 17.3343 5.58467 16.7774 5.02429C16.3694 4.61389 16.0355 4.28488 16.0353 4.29318ZM12.2251 5.1834C11.7509 6.19365 11.1837 7.08881 10.3927 8.07487C9.95383 8.62202 9.65277 8.95858 9.09978 9.52019C7.93972 10.6983 6.74372 11.6479 5.54431 12.3429C5.171 12.5593 4.30731 12.9859 4.29765 12.9587C4.29399 12.9484 4.36391 12.7823 4.45303 12.5897C4.94012 11.5373 5.69385 10.4116 6.63122 9.3368C6.94104 8.98155 8.21846 7.70195 8.57295 7.39174C9.40806 6.66098 10.2048 6.07274 11.02 5.58505C11.2916 5.42258 12.2705 4.92553 12.3189 4.92553C12.3352 4.92553 12.2978 5.02841 12.2251 5.1834ZM13.9009 5.57453C14.0503 5.64898 14.2191 5.83601 14.281 5.99549C14.3475 6.16725 14.363 6.48776 14.3141 6.68242C14.202 7.12902 13.8528 7.5352 13.4826 7.64959C12.9936 7.80065 12.5632 7.50099 12.4787 6.95072C12.4083 6.49226 12.6617 5.94995 13.0813 5.66092C13.248 5.54611 13.3389 5.52015 13.578 5.51905C13.7603 5.51822 13.8024 5.52544 13.9009 5.57453ZM16.7108 8.09487C16.7864 8.13437 16.8744 8.22916 16.9265 8.32726C16.9576 8.3857 16.9674 8.4513 16.9674 8.60159C16.9675 8.77293 16.9592 8.81722 16.9045 8.93566C16.8304 9.09607 16.6559 9.27285 16.5309 9.31409C16.4196 9.35085 16.2331 9.33389 16.1612 9.28047C16.1299 9.25714 16.0784 9.19863 16.047 9.15046C15.9137 8.94644 15.9133 8.69199 16.0459 8.43969C16.1448 8.25145 16.2583 8.14714 16.4144 8.10112C16.5609 8.05793 16.637 8.05631 16.7108 8.09487ZM10.7968 9.93582C11.0459 10.0499 11.2065 10.2613 11.2539 10.5376C11.2764 10.6685 11.2748 10.7213 11.2434 10.8867C11.0492 11.9098 9.76513 12.5617 9.18464 11.9319C8.92802 11.6535 8.89545 11.214 9.10063 10.7978C9.30754 10.3782 9.7291 10.0225 10.1567 9.90671C10.3765 9.8472 10.6283 9.85863 10.7968 9.93582ZM13.491 12.9864C13.7213 13.1063 13.7664 13.4633 13.594 13.8013C13.5355 13.9159 13.3351 14.1247 13.2007 14.2109C12.9205 14.3907 12.536 14.412 12.3619 14.2575C12.1896 14.1045 12.2021 13.705 12.3878 13.4357C12.4884 13.2896 12.6784 13.1226 12.8325 13.0446C13.0203 12.9497 13.0566 12.9401 13.2386 12.9379C13.3607 12.9365 13.4152 12.9469 13.491 12.9864ZM6.23168 13.2322C6.49524 13.3009 6.69833 13.4577 6.80639 13.6761C6.85788 13.7802 6.8694 13.8325 6.87061 13.9677C6.87188 14.1106 6.86273 14.1514 6.80165 14.275C6.63161 14.619 6.29576 14.8933 5.92925 14.9874C5.74315 15.0352 5.40609 15.0314 5.2398 14.9796C4.97455 14.8971 4.81924 14.7673 4.7129 14.5392C4.62632 14.3535 4.63396 14.1793 4.73834 13.9595C4.99435 13.4204 5.67728 13.0878 6.23168 13.2322ZM8.61881 16.4698C8.96777 16.536 9.09523 16.8519 8.89479 17.1539C8.79294 17.3073 8.69293 17.385 8.51305 17.4503C8.00488 17.6347 7.5136 17.2852 7.71797 16.8846C7.82198 16.6807 8.00512 16.5381 8.23387 16.4828C8.39513 16.4438 8.46833 16.4413 8.61881 16.4698Z" fill="#FF5500"/>
</g>
</svg>
