<svg width="14" height="15" viewBox="0 0 14 15" fill="none" xmlns="http://www.w3.org/2000/svg">
<path d="M6.83555 0.973066C6.70125 1.01692 6.57244 1.09366 6.32302 1.28278C5.99687 1.53219 5.96398 1.53493 5.53367 1.38693C4.8841 1.16492 4.68403 1.23344 4.28935 1.82271C4.19616 1.95975 4.09201 2.09131 4.05364 2.11598C3.99883 2.15161 3.90016 2.15983 3.55482 2.16531C3.18207 2.16805 3.10532 2.17628 2.99843 2.22561C2.77917 2.32702 2.63939 2.53258 2.54346 2.90259C2.51879 2.99578 2.47494 3.13282 2.44479 3.20408C2.37901 3.35756 2.29405 3.40964 1.96789 3.50008C1.55403 3.61246 1.36492 3.73579 1.26077 3.96328C1.21143 4.07017 1.20321 4.14691 1.20047 4.51966C1.19499 4.865 1.18677 4.96367 1.15114 5.01849C1.12647 5.05686 0.99491 5.16101 0.85787 5.25419C0.268598 5.64887 0.197338 5.84895 0.422083 6.49852C0.572827 6.92608 0.567345 6.95897 0.317933 7.28787C0.0493344 7.64417 0 7.74832 0 7.96484C0 8.18137 0.0493344 8.28552 0.317933 8.64182C0.567345 8.97072 0.572827 9.00361 0.422083 9.43117C0.197338 10.0807 0.268598 10.2808 0.85787 10.6755C1.20321 10.9085 1.20321 10.9085 1.19499 11.358C1.18677 11.7992 1.22514 11.9692 1.3704 12.1309C1.48551 12.2597 1.62255 12.3282 1.94597 12.4214C2.38724 12.5502 2.43383 12.5968 2.54346 13.0271C2.63939 13.3971 2.77917 13.6027 2.99843 13.7041C3.10532 13.7534 3.18207 13.7616 3.55482 13.7644C3.90016 13.7699 3.99883 13.7781 4.05364 13.8137C4.09201 13.8384 4.19616 13.9699 4.28935 14.107C4.68128 14.6935 4.88684 14.7648 5.52545 14.5455C5.96946 14.3893 5.98316 14.392 6.30658 14.6359C6.68481 14.9183 6.78348 14.9648 7 14.9648C7.21104 14.9648 7.34808 14.9045 7.64409 14.6743C8.01958 14.3838 8.01684 14.3838 8.47455 14.5455C9.11316 14.7648 9.31872 14.6935 9.71065 14.107C9.80384 13.9699 9.90799 13.8384 9.94636 13.8137C10.0012 13.7781 10.0998 13.7699 10.4452 13.7644C10.9413 13.7589 11.0536 13.7287 11.2181 13.5424C11.325 13.419 11.3661 13.3258 11.4593 13.0079C11.5854 12.5776 11.6073 12.5557 12.0568 12.4214C12.3637 12.3309 12.4569 12.2871 12.5775 12.1829C12.7639 12.0185 12.794 11.9061 12.7995 11.41C12.805 11.0647 12.8132 10.966 12.8489 10.9112C12.8735 10.8728 13.0051 10.7687 13.1421 10.6755C13.7287 10.2836 13.7999 10.078 13.5807 9.43939C13.4244 8.99538 13.4272 8.98168 13.6711 8.65827C13.9534 8.28004 14 8.18137 14 7.96484C14 7.74832 13.9534 7.64965 13.6711 7.27142C13.4272 6.94801 13.4244 6.9343 13.5807 6.49029C13.7999 5.85169 13.7287 5.64613 13.1421 5.25419C13.0051 5.16101 12.8735 5.05686 12.8489 5.01849C12.8132 4.96367 12.805 4.865 12.7995 4.51966C12.794 4.02357 12.7639 3.9112 12.5775 3.74675C12.4542 3.63986 12.3692 3.60149 12.0294 3.49734C11.8951 3.45897 11.7443 3.40415 11.6977 3.37949C11.6018 3.33015 11.5278 3.18215 11.4565 2.90259C11.3606 2.53258 11.2208 2.32702 11.0016 2.22561C10.8947 2.17628 10.8179 2.16805 10.4452 2.16531C10.0998 2.15983 10.0012 2.15161 9.94636 2.11598C9.90799 2.09131 9.80384 1.95975 9.71065 1.82271C9.31872 1.23618 9.11316 1.16492 8.47455 1.38419C8.29914 1.44722 8.12373 1.49656 8.08262 1.49656C7.98669 1.49656 7.87157 1.43352 7.64409 1.25811C7.53994 1.17589 7.39193 1.07722 7.31793 1.03885C7.17541 0.967585 6.94792 0.934695 6.83555 0.973066ZM7.15348 1.41159C7.20008 1.439 7.3289 1.53493 7.44127 1.61989C7.86335 1.94879 8.02506 1.97346 8.54307 1.79531C8.72396 1.73227 8.91034 1.68293 8.96241 1.68019C9.08301 1.67745 9.17619 1.76516 9.38449 2.07487C9.68324 2.51614 9.79287 2.56821 10.4041 2.57369L10.7415 2.57791C10.8058 2.57871 10.8666 2.60713 10.9084 2.65592C10.944 2.69703 11.0043 2.83955 11.0427 2.97111C11.2373 3.62342 11.3113 3.7029 11.8841 3.88379C12.0842 3.94683 12.2706 4.02357 12.3117 4.05921C12.3587 4.09926 12.3861 4.15768 12.3869 4.21945L12.3912 4.56077C12.3966 5.18293 12.4405 5.27338 12.8927 5.58035C13.1997 5.78865 13.2874 5.88458 13.2847 6.00243C13.2819 6.05451 13.2326 6.24088 13.1695 6.42177C12.9859 6.95349 13.0133 7.09053 13.3833 7.57565C13.6711 7.95662 13.6711 7.97307 13.3833 8.35404C13.0133 8.83916 12.9859 8.9762 13.1695 9.50791C13.2326 9.68881 13.2819 9.87518 13.2847 9.92726C13.2874 10.0451 13.1997 10.141 12.8927 10.3493C12.4405 10.6563 12.3966 10.7468 12.3912 11.3689L12.3869 11.7064C12.3861 11.7706 12.3577 11.8314 12.3089 11.8732C12.2678 11.9089 12.1253 11.9692 11.9937 12.0075C11.325 12.2076 11.2428 12.2898 11.0427 12.9586C11.0043 13.0901 10.944 13.2327 10.9084 13.2738C10.8666 13.3226 10.8058 13.351 10.7415 13.3518L10.4041 13.356C9.78191 13.3615 9.69146 13.4053 9.38449 13.8576C9.17619 14.1645 9.08027 14.2522 8.96241 14.2495C8.91034 14.2468 8.72396 14.1974 8.54307 14.1344C8.01135 13.9507 7.87431 13.9782 7.38919 14.3482C7.00822 14.6359 6.99178 14.6359 6.61081 14.3482C6.12569 13.9782 5.98865 13.9507 5.45693 14.1344C5.27604 14.1974 5.08966 14.2468 5.03759 14.2495C4.91973 14.2522 4.82381 14.1645 4.61551 13.8576C4.30854 13.4053 4.21809 13.3615 3.59593 13.356L3.2546 13.3517C3.19284 13.351 3.13442 13.3235 3.09436 13.2765C3.05873 13.2354 2.98199 13.049 2.91895 12.8489C2.74628 12.3008 2.64487 12.1994 2.09671 12.0377C1.75959 11.9363 1.66641 11.8869 1.62803 11.7855C1.61159 11.7471 1.60337 11.5416 1.60611 11.3278C1.60885 10.9797 1.60337 10.9249 1.54855 10.8016C1.46907 10.6234 1.38959 10.5412 1.10728 10.3493C0.800313 10.141 0.712608 10.0451 0.715348 9.92726C0.718089 9.87518 0.767424 9.68881 0.830462 9.50791C1.0141 8.9762 0.986688 8.83916 0.61668 8.35404C0.328896 7.97307 0.328896 7.95662 0.61668 7.57565C0.981206 7.09875 1.01135 6.95075 0.844166 6.46014C0.646829 5.88732 0.644088 5.89554 1.10728 5.58035C1.55951 5.27338 1.60611 5.18019 1.61159 4.56077L1.61372 4.21945C1.61411 4.15773 1.64134 4.09923 1.68833 4.05921C1.72944 4.02357 1.91582 3.94683 2.1159 3.88379C2.66954 3.70838 2.75176 3.62342 2.92991 3.05059C2.98473 2.8697 3.05873 2.69703 3.09436 2.65318C3.13439 2.60619 3.19289 2.57895 3.25461 2.57857L3.59593 2.57643C4.21535 2.57095 4.30854 2.52436 4.61551 2.07213C4.82381 1.76516 4.91973 1.67745 5.03759 1.68019C5.08966 1.68293 5.27604 1.73227 5.45693 1.79531C5.97494 1.97346 6.13665 1.94879 6.55873 1.61989C6.82459 1.41433 6.91778 1.35952 7 1.35952C7.03837 1.35952 7.10689 1.38419 7.15348 1.41159Z" fill="#012433"/>
<path d="M6.47904 2.73223C5.54168 2.82815 4.57418 3.20364 3.84239 3.76002C3.52446 4.00121 3.48882 4.07248 3.60394 4.22048C3.69713 4.33833 3.79579 4.31641 4.03698 4.13277C4.93597 3.43935 6.09532 3.06934 7.20261 3.12416C8.425 3.1872 9.54051 3.66958 10.3902 4.50552C11.0068 5.11398 11.4508 5.86495 11.6701 6.67897C12.0703 8.16174 11.766 9.70755 10.8314 10.9272C10.6478 11.1684 10.6259 11.2671 10.7437 11.3602C10.8862 11.4726 10.9548 11.4425 11.1603 11.1766C11.5194 10.7079 11.7989 10.1817 11.988 9.61436C12.5389 7.94522 12.2238 6.12533 11.1439 4.73027C10.0503 3.3215 8.26056 2.55408 6.47904 2.73223Z" fill="#012433"/>
<path d="M3.00382 4.55788C2.91338 4.63737 2.653 4.99093 2.505 5.2376C1.70742 6.55867 1.52927 8.16203 2.01439 9.62288C2.53789 11.1988 3.76576 12.4267 5.34172 12.9502C6.97798 13.4956 8.78143 13.2024 10.1518 12.1691C10.478 11.9224 10.5136 11.8594 10.3958 11.7086C10.3026 11.5908 10.2039 11.6127 9.96271 11.7963C9.42826 12.2047 8.84721 12.4898 8.2086 12.6542C6.73679 13.0324 5.16631 12.6981 3.98503 11.7552C1.91024 10.0998 1.54846 7.10683 3.16827 5.00189C3.3519 4.7607 3.37383 4.66203 3.25598 4.56885C3.16553 4.49759 3.07782 4.49484 3.00382 4.55788Z" fill="#012433"/>
<path d="M5.31458 4.93318C4.55812 5.11682 4.17166 6.05965 4.53619 6.83256C4.76093 7.30397 5.27346 7.5945 5.7257 7.50405C5.95318 7.45746 6.12311 7.36427 6.304 7.18338C7.03032 6.46255 6.69868 5.12504 5.74488 4.92496C5.56947 4.88933 5.49273 4.88933 5.31458 4.93318ZM5.72844 5.34704C5.92029 5.4046 6.07652 5.54712 6.18341 5.76639C6.26563 5.93357 6.27386 5.9692 6.27386 6.21039C6.27386 6.43788 6.26563 6.48996 6.19711 6.63522C6.05185 6.94493 5.83533 7.10115 5.54754 7.10115C5.25976 7.10115 5.04324 6.94493 4.89797 6.63522C4.82945 6.48996 4.82123 6.43788 4.82123 6.21039C4.82123 5.9692 4.82945 5.93357 4.91168 5.76639C5.01583 5.5526 5.1748 5.4046 5.35569 5.34704C5.5174 5.29771 5.56399 5.29771 5.72844 5.34704Z" fill="#012433"/>
<path d="M7.98939 5.18841C7.91813 5.25144 5.7666 10.3658 5.7666 10.4809C5.7666 10.6344 5.95572 10.7303 6.07631 10.6371C6.13387 10.596 8.31554 5.42411 8.31554 5.33367C8.31554 5.25693 8.19495 5.14181 8.11547 5.14181C8.0771 5.14181 8.02228 5.16374 7.98939 5.18841Z" fill="#012433"/>
<path d="M8.22485 8.43365C7.93981 8.50217 7.6164 8.75706 7.47113 9.03114C7.04357 9.83146 7.46017 10.8483 8.28241 11.0073C8.72367 11.095 9.23346 10.8181 9.44998 10.3687C9.72132 9.80679 9.62539 9.15996 9.20879 8.7461C8.92375 8.46106 8.57567 8.35143 8.22485 8.43365ZM8.76204 8.90507C8.92375 9.00099 9.0142 9.10515 9.09916 9.29152C9.34309 9.82598 9.07998 10.4865 8.57841 10.5989C8.15633 10.6921 7.75069 10.3111 7.71781 9.79034C7.6904 9.33537 7.9124 8.95988 8.28789 8.83929C8.40574 8.80092 8.63871 8.83381 8.76204 8.90507Z" fill="#012433"/>
</svg>
