<svg width="45" height="51" viewBox="0 0 45 51" fill="none" xmlns="http://www.w3.org/2000/svg">
<path d="M1.83988 41.724C3.17995 41.9076 7.29474 42.3941 7.3224 42.4008C7.56805 42.4782 7.76061 42.6708 7.83764 42.9168C7.83764 42.9168 8.29492 46.9505 8.49421 48.2887C8.7881 50.261 11.4582 50.879 12.8192 49.4612C14.6308 47.5753 20.2154 42.0658 20.2154 42.0658H20.2158C20.9124 42.4681 21.6987 42.6913 22.503 42.7148C23.3073 42.6913 24.0936 42.4681 24.7902 42.0658C24.7902 42.0658 30.376 47.5753 32.1865 49.4612C33.5475 50.8802 36.2175 50.261 36.5115 48.2887C36.7108 46.9486 37.1681 42.9168 37.1681 42.9168H37.1684C37.2454 42.6708 37.438 42.4782 37.6837 42.4008C37.6837 42.4008 41.7174 41.945 43.0548 41.745C45.0271 41.4511 45.6463 38.7799 44.2273 37.4189C42.8604 36.1065 38.867 32.0587 38.867 32.0587C39.2129 31.7487 39.6059 31.4466 40.0186 31.1374C41.1718 30.2688 42.3638 29.3703 42.821 27.9622C43.2581 26.6138 42.8371 25.2143 42.4292 23.8582V23.8586C42.1398 23.0539 41.964 22.213 41.9072 21.3601C41.964 20.5068 42.1398 19.6659 42.4292 18.8616C42.8371 17.5074 43.2585 16.1078 42.821 14.7576C42.3637 13.3507 41.1718 12.4518 40.0186 11.5832C39.3408 11.1267 38.7298 10.5782 38.2029 9.95339C37.7644 9.25008 37.426 8.48879 37.1979 7.69202C36.7238 6.33778 36.2388 4.94162 35.0588 4.079C33.8787 3.21637 32.4145 3.19696 30.9873 3.16668C30.1502 3.19285 29.3134 3.10274 28.5008 2.89896C27.7582 2.59609 27.0613 2.19153 26.4301 1.69682C25.296 0.90115 24.0106 0 22.503 0C20.9955 0 19.7099 0.901112 18.576 1.69682C17.9448 2.1915 17.2479 2.59605 16.5053 2.89896C15.6928 3.10274 14.8556 3.19285 14.0181 3.16668C12.5943 3.19696 11.1151 3.22874 9.94781 4.07862C8.78013 4.92888 8.28277 6.34 7.81279 7.6928H7.81242C7.58471 8.48996 7.24632 9.25082 6.80736 9.95417C6.2809 10.5793 5.66955 11.1279 4.99166 11.584C3.83853 12.4526 2.64653 13.3511 2.18928 14.7592C1.75219 16.1075 2.1732 17.507 2.58114 18.8632C2.86904 19.6667 3.04366 20.5061 3.09975 21.3575C3.04291 22.2104 2.86718 23.0513 2.57778 23.856C2.16985 25.2102 1.74846 26.6098 2.18592 27.9599C2.6432 29.3669 3.83517 30.2658 4.9883 31.1344C5.40109 31.4458 5.79407 31.7483 6.1399 32.0557C6.1399 32.0557 2.14323 36.1028 0.779613 37.416C0.124911 38.052 -0.143554 38.9875 0.074428 39.874C0.292783 40.7606 0.964696 41.4646 1.83997 41.7241L1.83988 41.724ZM43.0471 38.6034C43.2995 38.8427 43.4027 39.2002 43.3167 39.537C43.2501 39.801 43.0505 40.0108 42.7898 40.09C42.665 40.1125 37.418 40.735 37.3066 40.7676C36.4529 41.0158 35.7855 41.6832 35.5377 42.5372C35.5085 42.6359 34.8803 47.911 34.8601 48.0205C34.7532 48.3129 34.4982 48.526 34.1912 48.5787C33.8846 48.6318 33.5732 48.5167 33.3742 48.277L26.2457 41.1496L26.2461 41.1493C27.5454 39.995 29.2579 39.4169 30.9913 39.5482C32.4151 39.5179 33.8943 39.4861 35.0616 38.6362C36.2293 37.786 36.7266 36.3748 37.1966 35.022H37.197C37.3772 34.4672 37.5914 33.9235 37.8375 33.3944L43.0471 38.6034ZM5.99697 29.7957C5.00685 29.0512 4.07062 28.3468 3.78011 27.4423C3.5038 26.5921 3.83283 25.4977 4.18205 24.3393V24.3389C4.52305 23.3791 4.72309 22.3748 4.77506 21.3575C4.72309 20.3401 4.52343 19.3358 4.18205 18.376C3.83283 17.2176 3.5038 16.124 3.78011 15.2771C4.07325 14.3726 5.00723 13.6681 5.99621 12.9226C6.80982 12.3711 7.53815 11.7033 8.15889 10.9409C8.70068 10.1063 9.11723 9.19697 9.39578 8.24169C9.79847 7.07994 10.1787 5.98032 10.9344 5.43328C11.6766 4.89225 12.8315 4.86794 14.0542 4.84214V4.84176C15.0552 4.86943 16.055 4.75165 17.0223 4.49254C17.9249 4.14332 18.7714 3.66359 19.535 3.06871C20.5594 2.35194 21.5241 1.67514 22.5034 1.67514C23.4827 1.67514 24.4474 2.3519 25.4699 3.06871C26.2335 3.66359 27.0799 4.14336 27.9826 4.49254C28.9495 4.75203 29.9493 4.86906 30.9499 4.84102C32.1736 4.86794 33.3287 4.89224 34.0705 5.43328C34.8243 5.98255 35.206 7.07994 35.6091 8.24169H35.6095C35.8881 9.1959 36.3049 10.1041 36.8464 10.9375C37.4667 11.6995 38.1951 12.3674 39.0079 12.9192C39.998 13.6637 40.9343 14.3681 41.2248 15.2726C41.5011 16.1228 41.1721 17.2172 40.8228 18.3756L40.8232 18.376C40.4818 19.3358 40.2822 20.3401 40.2302 21.3574C40.2822 22.3748 40.4818 23.3791 40.8232 24.3389C41.1724 25.4973 41.5015 26.5909 41.2251 27.4378C40.932 28.3423 39.998 29.0468 39.009 29.7923C38.1954 30.3438 37.4667 31.0116 36.8464 31.774C36.305 32.6086 35.8888 33.5183 35.611 34.4732C35.2083 35.635 34.8281 36.7346 34.0724 37.2816C33.3302 37.8226 32.1753 37.847 30.9525 37.8728V37.8731C29.9516 37.8455 28.9518 37.9632 27.9845 38.2224C27.0819 38.5716 26.2354 39.0513 25.4718 39.6462C24.4474 40.363 23.4827 41.0398 22.5034 41.0398C21.5241 41.0398 20.5594 40.363 19.5368 39.6462C18.7733 39.0513 17.9268 38.5715 17.0242 38.2224C16.0573 37.9629 15.0575 37.8458 14.0569 37.8739C12.8331 37.847 11.6781 37.8227 10.9363 37.2816C10.1825 36.7323 9.80075 35.635 9.39767 34.4732H9.3973C9.11874 33.519 8.70184 32.6108 8.16041 31.7774C7.53936 31.015 6.81059 30.3475 5.99697 29.7957ZM1.96259 38.6034C3.23987 37.2775 7.17633 33.3945 7.17633 33.3945C7.42236 33.9236 7.63661 34.4673 7.8172 35.0222C8.2872 36.3772 8.77365 37.7778 9.95222 38.6363C11.1308 39.4948 12.5965 39.5184 14.0236 39.5483H14.0233C15.7563 39.417 17.4688 39.9951 18.7681 41.1494C18.7681 41.1494 13.4537 46.5273 11.6396 48.2767C11.1804 48.7198 10.3462 48.7684 10.1537 48.0206C9.8187 46.7097 9.67961 43.9888 9.49714 42.6476V42.648C9.4175 42.1724 9.19166 41.7334 8.85104 41.3928C8.51004 41.0518 8.07145 40.8256 7.59587 40.746C6.25991 40.534 3.53641 40.4184 2.224 40.0901C1.47021 39.9024 1.52144 39.0615 1.96264 38.6035L1.96259 38.6034Z" fill="#F77433"/>
<path d="M22.5026 36.8519C26.6123 36.8519 30.5531 35.2194 33.4587 32.3139C36.3643 29.4079 37.9967 25.4669 37.9967 21.3578C37.9967 17.2487 36.3643 13.3073 33.4587 10.4018C30.5527 7.4962 26.6118 5.86371 22.5026 5.86371C18.3935 5.86371 14.4522 7.4962 11.5466 10.4018C8.64104 13.3077 7.00854 17.2487 7.00854 21.3578C7.01303 25.4659 8.64697 29.4042 11.5519 32.3091C14.4568 35.214 18.395 36.8479 22.5031 36.8524L22.5026 36.8519ZM22.5026 7.53784C26.1676 7.53784 29.6828 8.99383 32.2746 11.5853C34.8661 14.1772 36.3221 17.6923 36.3221 21.3573C36.3221 25.0223 34.8661 28.5374 32.2746 31.1293C29.6828 33.7208 26.1676 35.1768 22.5026 35.1768C18.8376 35.1768 15.3225 33.7208 12.7307 31.1293C10.1391 28.5374 8.68316 25.0223 8.68316 21.3573C8.68727 17.6935 10.1448 14.181 12.7355 11.5901C15.3263 8.99938 18.8388 7.54186 22.5027 7.53775L22.5026 7.53784Z" fill="#F77433"/>
<path d="M17.4776 20.101C18.366 20.101 19.2182 19.748 19.8467 19.1199C20.4748 18.4913 20.8278 17.6392 20.8278 16.7508C20.8278 15.8624 20.4748 15.0103 19.8467 14.3818C19.2181 13.7536 18.366 13.4006 17.4776 13.4006C16.5892 13.4006 15.7371 13.7536 15.1086 14.3818C14.4804 15.0103 14.1274 15.8624 14.1274 16.7508C14.1274 17.6392 14.4804 18.4914 15.1086 19.1199C15.7371 19.748 16.5892 20.101 17.4776 20.101ZM17.4776 15.0757C17.9218 15.0757 18.3481 15.2522 18.6621 15.5663C18.9762 15.8804 19.1527 16.3066 19.1527 16.7508C19.1527 17.195 18.9762 17.6213 18.6621 17.9353C18.3481 18.2494 17.9218 18.4259 17.4776 18.4259C17.0334 18.4259 16.6072 18.2494 16.2931 17.9353C15.979 17.6213 15.8025 17.195 15.8025 16.7508C15.8025 16.3066 15.979 15.8804 16.2931 15.5663C16.6072 15.2522 17.0334 15.0757 17.4776 15.0757Z" fill="#F77433"/>
<path d="M27.5282 23.4512C26.6398 23.4512 25.7876 23.8041 25.1591 24.4323C24.5309 25.0608 24.178 25.913 24.178 26.8014C24.178 27.6897 24.5309 28.5419 25.1591 29.1704C25.7876 29.7986 26.6398 30.1515 27.5282 30.1515C28.4165 30.1515 29.2687 29.7986 29.8972 29.1704C30.5254 28.5419 30.8783 27.6897 30.8783 26.8014C30.8783 25.913 30.5254 25.0608 29.8972 24.4323C29.2687 23.8041 28.4165 23.4512 27.5282 23.4512ZM27.5282 28.4764C27.084 28.4764 26.6577 28.3 26.3436 27.9859C26.0296 27.6718 25.8531 27.2455 25.8531 26.8014C25.8531 26.3572 26.0296 25.9309 26.3436 25.6168C26.6577 25.3027 27.084 25.1263 27.5282 25.1263C27.9724 25.1263 28.3986 25.3027 28.7127 25.6168C29.0268 25.9309 29.2032 26.3572 29.2032 26.8014C29.2032 27.2455 29.0268 27.6718 28.7127 27.9859C28.3986 28.3 27.9724 28.4764 27.5282 28.4764Z" fill="#F77433"/>
<path d="M15.6291 28.6497C16.1249 29.1294 16.7881 29.3968 17.478 29.3945C18.1678 29.3927 18.83 29.1212 19.3228 28.6389C21.7921 26.0858 29.3044 18.528 29.3044 18.528V18.5276C29.7759 18.0565 30.0406 17.4175 30.0406 16.7509C30.0406 16.0846 29.7759 15.4452 29.3044 14.9742C28.8254 14.5187 28.1901 14.2649 27.5291 14.2649C26.8684 14.2649 26.2328 14.5187 25.7542 14.9742C25.7542 14.9742 18.1935 22.4852 15.6395 24.9587C15.1557 25.4503 14.8835 26.1122 14.8816 26.802C14.8797 27.4919 15.1478 28.1552 15.6287 28.6499L15.6291 28.6497ZM16.8166 26.1479C19.3718 23.6764 24.4443 18.6937 26.936 16.1577C27.2643 15.8316 27.7949 15.8331 28.1209 16.1614C28.447 16.4897 28.4451 17.0199 28.1172 17.3463C25.581 19.8365 20.6003 24.9059 18.1308 27.461C17.7681 27.824 17.18 27.824 16.8172 27.4614C16.4542 27.0987 16.4542 26.5105 16.8169 26.1478L16.8166 26.1479Z" fill="#F77433"/>
</svg>
