<svg width="28" height="28" viewBox="0 0 28 28" fill="none" xmlns="http://www.w3.org/2000/svg">
<path fill-rule="evenodd" clip-rule="evenodd" d="M8.47557 5.47576C0.730506 13.2475 0.782292 13.1903 0.924744 13.8297C1.07201 14.4911 1.6081 14.7312 2.93628 14.7312H3.95736V21.0308V27.3303H7.65629H11.3552V23.5378C11.3552 21.2942 11.428 19.5924 11.5333 19.3704C11.6966 19.0267 11.9152 18.9955 14.1656 18.9955C15.8451 18.9955 16.685 19.069 16.8262 19.2281C16.9733 19.3939 17.0327 20.5935 17.0327 23.3955V27.3303H20.7316H24.4305V21.0519V14.7737L25.7377 14.6993C26.7788 14.6399 27.0943 14.5492 27.2861 14.2532C27.5502 13.8466 27.5924 13.3913 27.3957 13.073C27.2846 12.8931 16.7866 2.27927 15.0886 0.629954C14.7319 0.283382 14.3257 0 14.1862 0C14.0467 0 11.4769 2.46399 8.47557 5.47576Z" fill="#FD9149"/>
</svg>
