# LAMMPS data file written by OVITO Basic 3.7.11
2035 atoms
1 atom types
0.0 39.57150679 xlo xhi
0.0 38.07770017 ylo yhi
0.0 40.4361248 zlo zhi

Masses

1 63.550  # Cu

Atoms  

1 1 0 0 0
2 1 2.19842 1.26926 0
3 1 0 2.53851 0
4 1 2.19842 3.80777 0
271 1 1.46561 2.31199e-16 2.07269
272 1 3.66403 1.26926 2.07269
273 1 1.46561 2.53851 2.07269
274 1 3.66403 3.80777 2.07269
31 1 4.39683 0 0
33 1 4.39683 2.53851 0
32 1 6.59525 1.26926 0
34 1 6.59525 3.80777 0
301 1 5.86245 2.31199e-16 2.07269
302 1 8.06086 1.26926 2.07269
303 1 5.86245 2.53851 2.07269
304 1 8.06086 3.80777 2.07269
61 1 8.79367 0 0
62 1 10.9921 1.26926 0
63 1 8.79367 2.53851 0
64 1 10.9921 3.80777 0
331 1 10.2593 2.31199e-16 2.07269
332 1 12.4577 1.26926 2.07269
333 1 10.2593 2.53851 2.07269
334 1 12.4577 3.80777 2.07269
91 1 13.1905 0 0
93 1 13.1905 2.53851 0
5 1 0 5.07703 0
6 1 2.19842 6.34628 0
7 1 0 7.61554 0
275 1 1.46561 5.07703 2.07269
276 1 3.66403 6.34628 2.07269
277 1 1.46561 7.61554 2.07269
35 1 4.39683 5.07703 0
37 1 4.39683 7.61554 0
36 1 6.59525 6.34628 0
305 1 5.86245 5.07703 2.07269
306 1 8.06086 6.34628 2.07269
307 1 5.86245 7.61554 2.07269
65 1 8.79367 5.07703 0
66 1 10.9921 6.34628 0
67 1 8.79367 7.61554 0
335 1 10.2593 5.07703 2.07269
336 1 12.4577 6.34628 2.07269
337 1 10.2593 7.61554 2.07269
95 1 13.1905 5.07703 0
97 1 13.1905 7.61554 0
8 1 2.19842 8.8848 0
9 1 0 10.1541 0
10 1 2.19842 11.4233 0
278 1 3.66403 8.8848 2.07269
279 1 1.46561 10.1541 2.07269
280 1 3.66403 11.4233 2.07269
39 1 4.39683 10.1541 0
38 1 6.59525 8.8848 0
40 1 6.59525 11.4233 0
308 1 8.06086 8.8848 2.07269
309 1 5.86245 10.1541 2.07269
310 1 8.06086 11.4233 2.07269
68 1 10.9921 8.8848 0
69 1 8.79367 10.1541 0
70 1 10.9921 11.4233 0
338 1 12.4577 8.8848 2.07269
339 1 10.2593 10.1541 2.07269
340 1 12.4577 11.4233 2.07269
99 1 13.1905 10.1541 0
11 1 0 12.6926 0
281 1 1.46561 12.6926 2.07269
41 1 4.39683 12.6926 0
12 1 2.19842 13.9618 0
13 1 0 15.2311 0
14 1 2.19842 16.5003 0
282 1 3.66403 13.9618 2.07269
283 1 1.46561 15.2311 2.07269
284 1 3.66403 16.5003 2.07269
43 1 4.39683 15.2311 0
311 1 5.86245 12.6926 2.07269
42 1 6.59525 13.9618 0
44 1 6.59525 16.5003 0
312 1 8.06086 13.9618 2.07269
313 1 5.86245 15.2311 2.07269
314 1 8.06086 16.5003 2.07269
71 1 8.79367 12.6926 0
341 1 10.2593 12.6926 2.07269
72 1 10.9921 13.9618 0
73 1 8.79367 15.2311 0
74 1 10.9921 16.5003 0
342 1 12.4577 13.9618 2.07269
343 1 10.2593 15.2311 2.07269
344 1 12.4577 16.5003 2.07269
101 1 13.1905 12.6926 0
103 1 13.1905 15.2311 0
15 1 0 17.7696 0
16 1 2.19842 19.0389 0
17 1 0 20.3081 0
285 1 1.46561 17.7696 2.07269
286 1 3.66403 19.0389 2.07269
287 1 1.46561 20.3081 2.07269
45 1 4.39683 17.7696 0
47 1 4.39683 20.3081 0
46 1 6.59525 19.0389 0
315 1 5.86245 17.7696 2.07269
316 1 8.06086 19.0389 2.07269
317 1 5.86245 20.3081 2.07269
75 1 8.79367 17.7696 0
76 1 10.9921 19.0389 0
77 1 8.79367 20.3081 0
345 1 10.2593 17.7696 2.07269
346 1 12.4577 19.0389 2.07269
347 1 10.2593 20.3081 2.07269
105 1 13.1905 17.7696 0
107 1 13.1905 20.3081 0
18 1 2.19842 21.5774 0
19 1 0 22.8466 0
20 1 2.19842 24.1159 0
21 1 0 25.3851 0
288 1 3.66403 21.5774 2.07269
289 1 1.46561 22.8466 2.07269
290 1 3.66403 24.1159 2.07269
291 1 1.46561 25.3851 2.07269
49 1 4.39683 22.8466 0
51 1 4.39683 25.3851 0
561 1 2.85554 25.469 4.06883
48 1 6.59525 21.5774 0
50 1 6.59525 24.1159 0
318 1 8.06086 21.5774 2.07269
319 1 5.86245 22.8466 2.07269
320 1 8.06086 24.1159 2.07269
321 1 5.86245 25.3851 2.07269
78 1 10.9921 21.5774 0
79 1 8.79367 22.8466 0
80 1 10.9921 24.1159 0
81 1 8.79367 25.3851 0
348 1 12.4577 21.5774 2.07269
349 1 10.2593 22.8466 2.07269
350 1 12.4577 24.1159 2.07269
351 1 10.2593 25.3851 2.07269
109 1 13.1905 22.8466 0
111 1 13.1905 25.3851 0
621 1 11.8058 25.4549 4.23588
22 1 2.19842 26.6544 0
23 1 0 27.9236 0
24 1 2.19842 29.1929 0
292 1 3.66403 26.6544 2.07269
293 1 1.46561 27.9236 2.07269
294 1 3.66403 29.1929 2.07269
53 1 4.39683 27.9236 0
52 1 6.59525 26.6544 0
54 1 6.59525 29.1929 0
322 1 8.06086 26.6544 2.07269
323 1 5.86245 27.9236 2.07269
324 1 8.06086 29.1929 2.07269
82 1 10.9921 26.6544 0
83 1 8.79367 27.9236 0
84 1 10.9921 29.1929 0
352 1 12.4577 26.6544 2.07269
353 1 10.2593 27.9236 2.07269
354 1 12.4577 29.1929 2.07269
113 1 13.1905 27.9236 0
25 1 0 30.4622 0
26 1 2.19842 31.7314 0
27 1 0 33.0007 0
295 1 1.46561 30.4622 2.07269
296 1 3.66403 31.7314 2.07269
297 1 1.46561 33.0007 2.07269
55 1 4.39683 30.4622 0
57 1 4.39683 33.0007 0
56 1 6.59525 31.7314 0
325 1 5.86245 30.4622 2.07269
326 1 8.06086 31.7314 2.07269
327 1 5.86245 33.0007 2.07269
85 1 8.79367 30.4622 0
86 1 10.9921 31.7314 0
87 1 8.79367 33.0007 0
355 1 10.2593 30.4622 2.07269
356 1 12.4577 31.7314 2.07269
357 1 10.2593 33.0007 2.07269
115 1 13.1905 30.4622 0
117 1 13.1905 33.0007 0
28 1 2.19842 34.2699 0
29 1 0 35.5392 0
30 1 2.19842 36.8084 0
298 1 3.66403 34.2699 2.07269
299 1 1.46561 35.5392 2.07269
300 1 3.66403 36.8084 2.07269
59 1 4.39683 35.5392 0
58 1 6.59525 34.2699 0
60 1 6.59525 36.8084 0
328 1 8.06086 34.2699 2.07269
329 1 5.86245 35.5392 2.07269
330 1 8.06086 36.8084 2.07269
88 1 10.9921 34.2699 0
89 1 8.79367 35.5392 0
90 1 10.9921 36.8084 0
358 1 12.4577 34.2699 2.07269
359 1 10.2593 35.5392 2.07269
360 1 12.4577 36.8084 2.07269
119 1 13.1905 35.5392 0
542 1 0.712895 1.55856 4.40665
544 1 0.412532 3.82441 4.25296
543 1 2.87654 2.66885 4.18912
812 1 2.06828 1.38778 6.68759
814 1 2.19544 3.82839 6.24452
841 1 4.26605 38.1737 6.37788
1795 1 8.63828 35.451 13.0887
843 1 4.1331 2.58755 6.47053
573 1 7.16704 2.69517 4.43835
574 1 4.90596 3.83142 4.36872
572 1 5.01648 1.19861 4.42445
842 1 6.53123 1.27012 6.20972
844 1 6.5182 3.78662 6.52828
571 1 7.20161 37.9538 4.2254
873 1 8.7992 2.50206 6.51773
602 1 9.3669 1.25076 4.40686
603 1 11.8805 2.73256 4.30631
604 1 9.57394 3.68967 4.27101
872 1 10.922 1.39904 6.23116
874 1 10.905 3.76924 6.34245
601 1 11.6071 37.9698 4.14298
903 1 13.1527 2.65785 6.42372
546 1 0.597344 6.50837 4.11043
545 1 2.88383 5.06861 4.222
547 1 2.66392 7.64306 4.21341
816 1 2.20095 6.37774 6.2876
845 1 4.36255 5.05965 6.30663
847 1 4.27136 7.73371 6.26878
576 1 5.00543 6.44944 4.26593
575 1 7.03003 5.05344 4.29362
577 1 7.25625 7.71837 4.16019
846 1 6.67829 6.25767 6.17287
877 1 8.69314 7.36886 6.69348
875 1 8.62206 4.83711 6.50474
605 1 11.7062 5.04757 4.03941
607 1 11.6011 7.59058 3.99735
606 1 9.42823 6.25929 4.03019
876 1 10.785 6.34207 6.0085
1828 1 11.2198 36.7695 12.8206
1935 1 11.0973 34.2677 13.2241
548 1 0.5705 8.9331 4.35679
550 1 0.542008 11.4326 4.30386
549 1 2.75427 10.0144 4.2331
818 1 1.99439 8.90144 6.21253
820 1 2.14199 11.5329 6.44323
551 1 2.93106 12.6251 4.20401
837 1 -0.0301866 33.2223 6.3799
849 1 4.32603 10.2707 6.57466
579 1 7.15544 10.2199 4.11159
578 1 5.11204 8.89111 4.25653
580 1 5.06621 11.3988 4.31864
848 1 6.70697 8.83895 6.31251
850 1 6.44587 11.3267 6.46445
879 1 8.67584 9.98524 6.28155
609 1 11.5741 10.1133 4.12261
610 1 9.42022 11.4281 4.27052
608 1 9.49647 8.83065 4.34297
878 1 10.8949 8.70127 6.25133
880 1 10.9783 11.4638 6.51063
881 1 8.7564 12.503 6.3937
911 1 13.2392 12.7669 6.20977
815 1 -0.016424 4.87492 6.36869
554 1 0.721365 16.4463 4.25904
553 1 3.07011 15.2104 4.15587
552 1 0.795281 13.951 4.16256
822 1 2.19438 13.9858 6.5086
824 1 2.28158 16.4737 6.37724
813 1 -0.156852 2.48803 6.63378
823 1 0.0133232 15.2653 6.75809
851 1 4.35008 12.7446 6.5149
853 1 4.40613 15.2106 6.45575
581 1 7.22135 12.85 4.24351
583 1 7.28267 15.2277 4.37583
582 1 5.20101 14.0023 4.53944
584 1 5.13622 16.5893 4.25588
852 1 6.53451 13.959 6.63124
854 1 6.70614 16.5328 6.40301
611 1 11.6569 12.6173 4.19609
883 1 8.82116 15.2636 6.37078
613 1 11.7043 15.0854 4.33115
614 1 9.85702 16.4703 4.34573
612 1 9.51402 13.7949 4.21395
882 1 11.0039 13.8429 6.30858
884 1 11.0247 16.4527 6.46178
2006 1 5.78808 -0.331708 14.9787
555 1 2.84089 17.5854 4.32158
557 1 2.99404 20.2465 4.35588
556 1 0.822284 18.9488 4.31977
826 1 2.24029 18.9446 6.37456
855 1 4.56648 17.8034 6.3797
1965 1 5.80595 35.0529 15.0488
1913 1 13.1704 35.4894 12.6056
587 1 7.4061 20.3799 4.17504
857 1 4.34339 20.2927 6.36609
585 1 7.38231 17.6658 3.99084
586 1 5.14954 18.994 4.15069
856 1 6.58848 19.0307 6.51605
887 1 8.68213 20.4338 6.32713
885 1 8.75091 17.7114 6.2166
617 1 11.7661 20.1329 4.3339
615 1 11.8638 17.5702 4.1221
616 1 9.40328 19.0616 4.3178
886 1 11.1362 18.8875 6.43807
917 1 13.3385 20.2658 6.4481
560 1 0.657707 24.1182 4.06162
559 1 2.86316 22.8673 4.07658
558 1 0.603361 21.6754 4.14027
828 1 2.23675 21.4807 6.23129
830 1 2.14259 24.125 6.15182
861 1 4.19869 25.5694 6.29081
859 1 4.36811 22.9111 6.22311
588 1 4.94971 21.8948 4.05015
589 1 7.31211 22.7503 4.05677
590 1 5.06271 24.1727 4.18582
858 1 6.47409 21.5178 6.26398
860 1 6.39004 24.2133 6.2863
889 1 8.74058 22.9234 6.21747
619 1 11.7733 22.87 4.27742
620 1 9.6453 24.1579 4.15211
618 1 9.67674 21.4649 4.17027
888 1 11.0323 21.4366 6.28591
890 1 10.8799 23.9396 6.30795
891 1 8.82625 25.3292 6.30261
1768 1 9.00512 37.9697 13.2135
919 1 13.1052 22.7435 6.30295
564 1 0.59204 29.1562 4.23179
562 1 0.578974 26.5715 3.97991
563 1 2.85285 28.0173 4.38407
832 1 2.12425 26.5909 6.21947
834 1 1.90919 29.127 6.71135
833 1 -0.0773886 27.7792 6.4113
831 1 -0.1184 25.4093 6.15826
591 1 7.40555 25.3448 4.2606
863 1 4.2966 27.9579 6.47965
594 1 5.19699 29.2697 4.18256
593 1 7.29507 27.8778 4.22507
592 1 5.11432 26.7499 4.12637
862 1 6.58984 26.6491 6.29357
864 1 6.55377 29.2094 6.27139
893 1 8.73419 27.9884 6.39618
623 1 11.9128 28.183 4.37641
622 1 9.47335 26.7186 4.33576
624 1 9.36589 29.213 4.35977
892 1 11.0559 26.7105 6.32644
894 1 10.8755 29.3281 6.4465
923 1 13.1522 27.8876 6.50089
567 1 2.94454 32.797 4.31334
566 1 0.557205 31.6057 4.37621
565 1 2.73387 30.4375 4.08984
836 1 2.10834 31.6081 6.42393
1853 1 13.2018 0.18437 12.9246
867 1 4.60836 32.9721 6.29979
865 1 4.18278 30.5537 6.17211
596 1 5.06224 31.713 4.271
597 1 7.36885 33.0387 4.20705
595 1 7.26853 30.6069 4.15082
866 1 6.56075 31.8022 6.42082
895 1 8.85156 30.6346 6.37406
897 1 8.81186 33.031 6.4291
627 1 11.7813 33.0125 4.25951
625 1 11.658 30.4547 4.10209
626 1 9.48876 31.7525 4.49752
896 1 10.9892 31.9638 6.59078
1860 1 13.1527 33.1416 12.7502
541 1 2.82909 38.2067 4.13221
568 1 0.708582 34.1411 4.23272
570 1 0.754482 36.7978 4.23378
569 1 2.84613 35.5567 4.11495
838 1 2.27803 34.0865 6.35467
840 1 2.10154 36.9068 6.37987
871 1 8.66239 38.1919 6.47154
869 1 4.27879 35.4802 6.37578
600 1 4.90894 36.868 4.11806
598 1 5.1047 34.265 4.19606
599 1 7.34393 35.446 4.19152
868 1 6.60207 34.1213 6.17847
870 1 6.45444 36.8798 6.45955
899 1 8.70428 35.7293 6.69932
629 1 11.5904 35.442 4.46184
630 1 9.48575 36.7233 4.22602
628 1 9.60085 34.3034 4.10173
898 1 11.0231 34.3131 6.56877
900 1 10.718 36.8917 6.51529
1083 1 1.34421 2.35963 8.94508
1082 1 3.56902 1.13296 8.76196
1352 1 0.759971 1.13636 10.8951
1353 1 3.01805 2.45654 10.9486
1084 1 3.85343 3.61691 8.69946
1354 1 0.669996 3.73024 10.8083
1081 1 1.35406 0.0183486 8.79413
1351 1 2.86413 -0.26862 11.0418
1112 1 7.87166 1.19516 8.97061
1113 1 5.88694 2.40826 8.38891
1114 1 8.07428 3.80346 8.59821
1382 1 5.04339 1.08524 10.7388
1383 1 7.31431 2.63634 11.074
1384 1 5.164 3.72514 10.7375
1381 1 7.32762 0.0811397 10.8715
1111 1 5.9124 37.9729 8.55248
1143 1 10.2769 2.53213 8.55994
1142 1 12.4571 1.22578 8.62495
1412 1 9.41341 1.48602 10.8052
1413 1 11.6821 2.49764 10.6874
1414 1 9.48745 3.89395 11.1796
1144 1 12.412 3.90419 8.53708
1141 1 10.1666 0.174461 8.58641
1085 1 1.31993 4.7178 8.59956
1086 1 3.66947 6.20629 8.58693
1087 1 1.58221 7.47345 8.58744
1355 1 2.94596 4.90548 10.8231
1356 1 0.597719 6.38042 10.7305
1357 1 2.72011 7.46695 10.738
1116 1 7.89709 6.19554 8.63242
1117 1 5.70146 7.58614 8.42103
1115 1 5.76824 4.95154 8.47619
1385 1 7.15199 5.17545 10.8289
1386 1 4.95928 6.36356 10.8444
1387 1 7.17433 7.77534 10.4153
1147 1 10.0553 7.60145 8.52524
1145 1 10.1434 4.95082 8.7121
1146 1 12.1458 6.31416 8.33784
1416 1 9.39608 6.28076 10.5251
1800 1 11.6775 5.01745 10.9036
1832 1 11.4595 7.47066 10.6091
1358 1 0.62652 8.86536 10.7851
1089 1 1.59015 10.0943 8.60173
1090 1 3.64737 11.4194 8.86353
1088 1 3.53631 8.68441 8.69827
1359 1 0.609641 11.6016 10.8066
1672 1 2.83726 10.0923 11.114
1118 1 7.90529 8.85851 8.40587
1120 1 8.01328 11.4911 8.55894
1119 1 6.0585 10.1394 8.61658
1390 1 5.01652 11.5146 10.8341
1389 1 7.16113 10.1411 10.7444
1388 1 5.01924 8.91868 10.5776
1391 1 7.34428 12.7375 10.7578
1121 1 5.72207 12.6891 8.55248
1418 1 9.22294 8.90778 10.7156
1717 1 9.51723 11.4147 10.6587
1148 1 12.4304 8.90635 8.29805
1150 1 12.4089 11.6962 8.42072
1149 1 10.0107 10.2456 8.3458
1419 1 11.6418 10.1946 10.1994
1151 1 10.3903 12.7389 8.74795
1091 1 1.36608 12.465 8.55977
1360 1 2.81594 12.8026 10.8489
1094 1 3.85703 16.5603 8.62399
1092 1 3.6338 13.9508 8.70926
1093 1 1.56082 15.1622 8.75222
1362 1 0.617684 14.0698 10.6665
1363 1 2.99269 15.1298 10.7354
1364 1 0.868158 16.3727 10.983
1124 1 7.98723 16.5852 8.50487
1122 1 7.98848 14.0836 8.69512
1123 1 5.76952 15.2904 8.46322
1392 1 5.06352 13.9821 10.7273
1393 1 7.35034 15.0384 10.8342
1394 1 5.3832 16.5007 10.9451
1421 1 11.6101 12.7622 10.7434
1154 1 12.4929 16.4471 8.62511
1152 1 12.4485 14.0526 8.31012
1153 1 10.142 15.2395 8.56945
1422 1 9.62017 14.0142 10.8663
1423 1 11.7415 15.2614 10.6469
1424 1 9.53056 16.5567 10.6587
1095 1 1.42368 17.5858 8.61796
1096 1 3.66889 18.9183 8.46338
1097 1 1.33684 20.0366 8.3617
1365 1 2.93024 17.5781 10.926
1366 1 0.724414 18.9284 10.6888
1367 1 2.73821 20.109 10.6377
1126 1 8.02121 19.0727 8.46859
1127 1 5.74583 20.2228 8.77758
1125 1 5.94375 17.8521 8.8742
1395 1 7.19926 17.9341 11.1766
1396 1 5.03674 18.8303 10.9604
1397 1 7.30067 20.2153 10.6933
1155 1 10.3406 17.6743 8.54854
1156 1 12.6174 19.0115 8.62678
1157 1 10.2622 20.2397 8.31132
1425 1 11.7223 17.6926 10.6821
1426 1 9.51295 18.8814 10.3867
1427 1 11.5875 20.1459 10.8476
1368 1 0.472967 21.1754 10.6524
1100 1 3.53829 23.9358 8.34897
1099 1 1.30066 22.6457 8.36633
1098 1 3.43164 21.3948 8.49198
1369 1 2.73658 22.6924 10.3974
1370 1 0.636899 24.0057 10.7023
1371 1 2.84149 25.2854 10.5303
1101 1 1.149 25.036 8.34545
1129 1 5.77833 22.9554 8.28012
1398 1 4.83827 21.2206 10.6205
1128 1 7.87737 21.4336 8.36328
1130 1 7.85445 24.149 8.36176
1399 1 7.02054 22.8459 10.5554
1400 1 4.97334 24.1069 10.4943
1401 1 6.99614 25.291 10.6707
1428 1 9.36251 21.4953 10.4911
1158 1 12.3397 21.6668 8.42392
1160 1 12.2596 24.036 8.66832
1159 1 10.1446 22.7224 8.39621
1429 1 11.4175 23.1046 10.8561
1430 1 9.23684 24.1763 10.4804
1431 1 11.7166 25.5669 10.8175
1102 1 3.47752 26.7169 8.57195
1103 1 1.34758 27.8596 8.41041
1104 1 3.5915 29.0831 8.63701
1372 1 0.709124 26.6602 10.7747
1373 1 2.85968 28.0441 10.7097
1775 1 0.597359 29.2058 10.8442
1131 1 5.87936 25.419 8.45663
1132 1 8.00233 26.5394 8.69451
1133 1 5.67388 27.8139 8.55151
1402 1 4.9562 26.6902 10.6139
1404 1 4.94584 29.2282 10.8043
1134 1 8.00672 28.9773 8.56662
1403 1 7.15061 27.8519 10.7612
1161 1 10.3093 25.4965 8.51956
1163 1 10.18 27.9667 8.55904
1162 1 12.4192 26.6572 8.49608
1432 1 9.71833 26.5346 10.7267
1433 1 11.7681 27.9084 10.6437
1164 1 12.4967 29.1468 8.70366
1818 1 9.4778 29.0588 10.7428
1107 1 1.41306 32.9017 8.63755
1106 1 3.81725 31.6245 8.58386
1105 1 1.48865 30.3037 8.9078
1375 1 3.03432 30.6777 10.7559
1377 1 2.75106 33.1123 10.7628
1376 1 0.488584 31.6632 10.7881
1135 1 5.78979 30.4987 8.67138
1787 1 5.29349 31.6658 10.9533
1136 1 8.17601 31.6201 8.70087
1137 1 5.89231 33.0181 8.52776
1405 1 7.31629 30.24 10.637
1438 1 7.45371 33.0041 10.6701
1167 1 10.4256 33.1652 8.46208
1894 1 11.7013 33.1983 10.8122
1165 1 10.4355 30.4977 8.67743
1166 1 12.468 31.7352 8.58362
1436 1 9.56503 31.693 10.6342
1435 1 11.8564 30.6697 10.7445
1109 1 1.33971 35.5001 8.45454
1378 1 0.674083 34.3386 10.5464
1379 1 3.06791 35.4846 10.8726
1108 1 3.68888 34.0562 8.49375
1380 1 0.593186 36.8043 11.0324
1110 1 3.58652 36.7546 8.68519
1408 1 5.26142 34.2195 10.6769
1138 1 8.15254 34.1988 8.61783
1409 1 7.25844 35.6344 10.8046
1139 1 6.10189 35.5348 8.51038
1140 1 8.0231 36.7319 8.8892
1410 1 5.27539 36.7737 10.746
1411 1 11.8209 -0.0809026 10.6034
1170 1 12.2687 36.8488 8.62347
1835 1 9.38322 34.312 10.6836
1439 1 11.6011 35.5544 10.7885
1169 1 10.3023 35.5054 8.73791
1168 1 12.4866 34.0813 8.61219
1440 1 9.67102 37.0739 10.7633
1670 1 2.13611 1.3036 13.2063
1668 1 2.24352 3.75412 13.1278
1708 1 4.42197 0.280607 13.2618
1964 1 1.19881 -0.273282 15.1475
1456 1 12.9126 17.5992 13.0893
1676 1 4.6949 2.54043 12.9436
1731 1 6.76762 1.35825 13.0351
1721 1 6.68444 3.97761 13.1347
1760 1 8.7882 2.8417 13.0051
1772 1 11.0156 1.24965 12.6782
1861 1 10.9677 3.6896 13.1828
1981 1 7.83018 36.3177 15.243
1667 1 2.0035 6.18461 13.0474
1694 1 4.23057 4.9005 13.0858
1780 1 6.61754 36.9035 13.0158
1727 1 4.02457 7.65006 12.9382
1791 1 6.32004 6.56323 12.8205
1854 1 8.62249 7.54979 12.6404
1773 1 8.85179 5.14589 13.458
1904 1 10.7893 6.34965 12.7406
1797 1 -0.0151247 12.5669 12.9104
1783 1 6.57824 34.3264 12.8501
1825 1 2.09005 11.3116 13.092
1682 1 1.89031 8.86608 12.9934
1732 1 4.30489 10.1225 13.3412
2034 1 8.46327 11.4265 14.7181
1871 1 6.43421 8.85858 12.7686
1816 1 6.6509 11.5126 12.856
1361 1 4.41533 12.6076 13.0009
1831 1 8.77252 9.93462 12.7067
1830 1 10.7031 8.96277 12.3319
1900 1 10.8057 11.566 13.019
1774 1 13.1552 12.6627 12.8551
1961 1 8.08146 33.8246 14.8425
2024 1 1.16134 35.4129 15.1898
1646 1 1.9208 13.9199 13.0867
1726 1 2.23031 16.271 13.4444
1747 1 4.23209 15.3138 12.7814
1801 1 6.61409 14.2267 12.8453
1648 1 6.59188 16.5841 13.24
1420 1 8.66976 12.9148 12.8426
1728 1 8.7976 15.4101 12.8951
1759 1 10.9897 13.925 13.1175
1729 1 11.0013 16.3973 12.7136
1988 1 1.16089 20.3681 14.922
1985 1 1.6016 17.7906 15.1681
1657 1 1.99395 18.6242 12.9406
1969 1 3.67162 19.3226 15.1081
1715 1 4.26163 17.693 13.2211
1709 1 4.21855 20.2929 12.7097
1640 1 6.42083 19.0107 13.2396
1976 1 5.91945 20.4671 15.0032
1649 1 8.64468 20.1401 12.5063
1688 1 8.78827 17.7352 13.3007
1898 1 12.3688 19.2119 15.0244
2021 1 10.0874 20.5555 14.9146
1696 1 10.7901 18.9809 12.9258
1956 1 3.48783 21.6217 14.7876
1642 1 2.09279 21.3697 12.8153
1930 1 1.2599 22.6923 14.7512
1751 1 2.05553 23.946 12.5442
1908 1 3.26744 24.0939 14.9372
1872 1 1.2396 25.707 14.9415
1630 1 4.21251 22.8073 12.3411
1954 1 7.91587 21.6579 14.5994
1639 1 6.31329 21.5958 12.7952
1679 1 6.45279 24.2183 12.7463
1936 1 5.57756 23.0438 15.0765
2009 1 7.9302 24.5037 14.9461
1740 1 8.61851 22.7997 12.628
1658 1 12.2062 21.7622 15.1361
1659 1 12.4543 24.112 14.9554
2019 1 9.95386 22.9808 15.0891
1650 1 10.9157 21.617 12.8684
1627 1 10.9219 24.2688 12.8032
2013 1 10.359 25.6814 15.194
1837 1 1.38176 28.2078 15.5808
1880 1 3.22455 26.6471 14.7643
1771 1 2.07305 26.6175 12.5617
1777 1 2.22526 29.2364 12.7873
1839 1 3.53611 29.0559 15.2537
1916 1 13.0324 20.3521 13.2159
2000 1 3.78568 36.6576 15.2677
1931 1 5.38918 25.4824 14.9395
1803 1 4.11749 25.2998 12.7924
1794 1 4.35833 27.9 13.0059
1932 1 5.70645 27.8455 15.302
1812 1 6.65139 29.186 12.9318
1866 1 6.42567 26.6118 12.7472
1937 1 7.9473 26.8877 15.1873
2027 1 7.99389 29.5516 14.991
1802 1 8.83554 25.3528 12.6672
1865 1 8.74382 27.8971 12.792
1819 1 11.0463 29.2676 12.7115
2023 1 10.1209 28.0433 14.9447
1637 1 11.1226 26.6205 13.1775
1876 1 3.36775 31.6572 14.9837
1855 1 1.23156 30.4929 15.1829
1736 1 2.01931 31.7852 12.8906
1878 1 1.29276 32.8764 14.9081
1924 1 3.40012 34.0874 15.3261
1757 1 2.12632 34.4655 12.8076
1406 1 4.3527 33.248 12.7796
1893 1 5.57386 30.411 14.9492
1762 1 4.35459 30.5228 13.1017
1996 1 5.49254 32.8775 14.7939
1407 1 6.71313 31.6569 13.0627
1434 1 8.893 30.4875 12.6829
1437 1 10.9946 31.7258 12.8559
1918 1 8.87248 33.0142 12.7733
1711 1 4.38427 35.7623 13.0847
1779 1 2.21606 36.8176 13.2517
915 1 13.2354 17.7228 6.34311
1716 1 13.2792 15.1635 12.74
901 1 12.965 0.041443 6.48405
1891 1 12.8398 10.2347 12.5917
921 1 12.9754 25.1922 6.43382
1906 1 13.035 7.55724 12.4102
905 1 13.0683 5.22473 6.247
1705 1 13.1332 22.7431 12.9269
1730 1 13.0665 25.3656 12.8972
1745 1 13.2856 27.9727 13.1001
1710 1 -0.225005 35.5705 13.0299
817 1 0.00836776 7.29608 6.39713
1761 1 -0.198507 30.6763 12.9587
1754 1 -0.0455567 33.2772 12.7293
1806 1 0.0587381 10.0091 12.8506
1662 1 -0.153939 7.60802 12.8656
811 1 -0.0249056 38.0616 6.21029
92 1 15.3889 1.26926 0
94 1 15.3889 3.80777 0
361 1 14.6561 2.31199e-16 2.07269
362 1 16.8545 1.26926 2.07269
363 1 14.6561 2.53851 2.07269
364 1 16.8545 3.80777 2.07269
121 1 17.5873 0 0
123 1 17.5873 2.53851 0
632 1 13.8923 1.2467 4.43494
122 1 19.7858 1.26926 0
124 1 19.7858 3.80777 0
391 1 19.0529 2.31199e-16 2.07269
392 1 21.2514 1.26926 2.07269
393 1 19.0529 2.53851 2.07269
394 1 21.2514 3.80777 2.07269
151 1 21.9842 0 0
152 1 24.1826 1.26926 0
153 1 21.9842 2.53851 0
154 1 24.1826 3.80777 0
421 1 23.4498 2.31199e-16 2.07269
422 1 25.6482 1.26926 2.07269
423 1 23.4498 2.53851 2.07269
424 1 25.6482 3.80777 2.07269
181 1 26.381 0 0
183 1 26.381 2.53851 0
96 1 15.3889 6.34628 0
365 1 14.6561 5.07703 2.07269
366 1 16.8545 6.34628 2.07269
367 1 14.6561 7.61554 2.07269
125 1 17.5873 5.07703 0
127 1 17.5873 7.61554 0
126 1 19.7858 6.34628 0
395 1 19.0529 5.07703 2.07269
396 1 21.2514 6.34628 2.07269
397 1 19.0529 7.61554 2.07269
155 1 21.9842 5.07703 0
156 1 24.1826 6.34628 0
157 1 21.9842 7.61554 0
425 1 23.4498 5.07703 2.07269
426 1 25.6482 6.34628 2.07269
427 1 23.4498 7.61554 2.07269
185 1 26.381 5.07703 0
187 1 26.381 7.61554 0
697 1 24.9319 7.49847 4.15634
98 1 15.3889 8.8848 0
100 1 15.3889 11.4233 0
368 1 16.8545 8.8848 2.07269
369 1 14.6561 10.1541 2.07269
370 1 16.8545 11.4233 2.07269
129 1 17.5873 10.1541 0
641 1 16.1427 12.8191 4.36226
128 1 19.7858 8.8848 0
130 1 19.7858 11.4233 0
398 1 21.2514 8.8848 2.07269
399 1 19.0529 10.1541 2.07269
400 1 21.2514 11.4233 2.07269
158 1 24.1826 8.8848 0
159 1 21.9842 10.1541 0
160 1 24.1826 11.4233 0
428 1 25.6482 8.8848 2.07269
429 1 23.4498 10.1541 2.07269
430 1 25.6482 11.4233 2.07269
189 1 26.381 10.1541 0
371 1 14.6561 12.6926 2.07269
131 1 17.5873 12.6926 0
102 1 15.3889 13.9618 0
104 1 15.3889 16.5003 0
372 1 16.8545 13.9618 2.07269
373 1 14.6561 15.2311 2.07269
374 1 16.8545 16.5003 2.07269
133 1 17.5873 15.2311 0
401 1 19.0529 12.6926 2.07269
132 1 19.7858 13.9618 0
134 1 19.7858 16.5003 0
402 1 21.2514 13.9618 2.07269
403 1 19.0529 15.2311 2.07269
404 1 21.2514 16.5003 2.07269
161 1 21.9842 12.6926 0
431 1 23.4498 12.6926 2.07269
162 1 24.1826 13.9618 0
163 1 21.9842 15.2311 0
164 1 24.1826 16.5003 0
432 1 25.6482 13.9618 2.07269
433 1 23.4498 15.2311 2.07269
434 1 25.6482 16.5003 2.07269
191 1 26.381 12.6926 0
193 1 26.381 15.2311 0
106 1 15.3889 19.0389 0
375 1 14.6561 17.7696 2.07269
376 1 16.8545 19.0389 2.07269
377 1 14.6561 20.3081 2.07269
135 1 17.5873 17.7696 0
137 1 17.5873 20.3081 0
136 1 19.7858 19.0389 0
405 1 19.0529 17.7696 2.07269
406 1 21.2514 19.0389 2.07269
407 1 19.0529 20.3081 2.07269
165 1 21.9842 17.7696 0
166 1 24.1826 19.0389 0
167 1 21.9842 20.3081 0
435 1 23.4498 17.7696 2.07269
436 1 25.6482 19.0389 2.07269
437 1 23.4498 20.3081 2.07269
195 1 26.381 17.7696 0
197 1 26.381 20.3081 0
108 1 15.3889 21.5774 0
110 1 15.3889 24.1159 0
378 1 16.8545 21.5774 2.07269
379 1 14.6561 22.8466 2.07269
380 1 16.8545 24.1159 2.07269
381 1 14.6561 25.3851 2.07269
139 1 17.5873 22.8466 0
141 1 17.5873 25.3851 0
138 1 19.7858 21.5774 0
140 1 19.7858 24.1159 0
408 1 21.2514 21.5774 2.07269
409 1 19.0529 22.8466 2.07269
410 1 21.2514 24.1159 2.07269
411 1 19.0529 25.3851 2.07269
168 1 24.1826 21.5774 0
169 1 21.9842 22.8466 0
170 1 24.1826 24.1159 0
171 1 21.9842 25.3851 0
438 1 25.6482 21.5774 2.07269
439 1 23.4498 22.8466 2.07269
440 1 25.6482 24.1159 2.07269
441 1 23.4498 25.3851 2.07269
199 1 26.381 22.8466 0
201 1 26.381 25.3851 0
112 1 15.3889 26.6544 0
114 1 15.3889 29.1929 0
382 1 16.8545 26.6544 2.07269
383 1 14.6561 27.9236 2.07269
384 1 16.8545 29.1929 2.07269
143 1 17.5873 27.9236 0
142 1 19.7858 26.6544 0
144 1 19.7858 29.1929 0
412 1 21.2514 26.6544 2.07269
413 1 19.0529 27.9236 2.07269
414 1 21.2514 29.1929 2.07269
172 1 24.1826 26.6544 0
173 1 21.9842 27.9236 0
174 1 24.1826 29.1929 0
442 1 25.6482 26.6544 2.07269
443 1 23.4498 27.9236 2.07269
444 1 25.6482 29.1929 2.07269
203 1 26.381 27.9236 0
714 1 22.7421 29.3122 4.06182
116 1 15.3889 31.7314 0
385 1 14.6561 30.4622 2.07269
386 1 16.8545 31.7314 2.07269
387 1 14.6561 33.0007 2.07269
145 1 17.5873 30.4622 0
147 1 17.5873 33.0007 0
146 1 19.7858 31.7314 0
415 1 19.0529 30.4622 2.07269
416 1 21.2514 31.7314 2.07269
417 1 19.0529 33.0007 2.07269
175 1 21.9842 30.4622 0
176 1 24.1826 31.7314 0
177 1 21.9842 33.0007 0
445 1 23.4498 30.4622 2.07269
446 1 25.6482 31.7314 2.07269
447 1 23.4498 33.0007 2.07269
205 1 26.381 30.4622 0
207 1 26.381 33.0007 0
118 1 15.3889 34.2699 0
120 1 15.3889 36.8084 0
388 1 16.8545 34.2699 2.07269
389 1 14.6561 35.5392 2.07269
390 1 16.8545 36.8084 2.07269
149 1 17.5873 35.5392 0
148 1 19.7858 34.2699 0
150 1 19.7858 36.8084 0
418 1 21.2514 34.2699 2.07269
419 1 19.0529 35.5392 2.07269
420 1 21.2514 36.8084 2.07269
178 1 24.1826 34.2699 0
179 1 21.9842 35.5392 0
180 1 24.1826 36.8084 0
448 1 25.6482 34.2699 2.07269
449 1 23.4498 35.5392 2.07269
450 1 25.6482 36.8084 2.07269
209 1 26.381 35.5392 0
633 1 16.0878 2.65177 4.27791
634 1 13.8503 3.76886 4.21237
902 1 15.407 1.20798 6.28021
904 1 15.4849 3.7915 6.2488
931 1 17.818 38.096 6.30414
913 1 13.2407 15.2012 6.31684
933 1 17.6881 2.5554 6.15203
662 1 18.4758 1.35647 4.08905
663 1 20.5543 2.53713 4.21968
664 1 18.2458 3.9722 4.22104
932 1 19.8411 1.51137 6.12636
934 1 19.8716 4.06978 6.21599
961 1 22.0517 0.026076 6.3837
963 1 21.9888 2.50163 6.49322
693 1 24.861 2.59454 4.29046
694 1 22.7095 3.6782 4.30275
692 1 22.7632 1.25526 4.3449
962 1 24.1265 1.13814 6.59079
964 1 24.1134 3.73383 6.53091
636 1 13.8173 6.40848 3.98237
637 1 15.9657 7.53304 4.1303
635 1 16.2807 5.21448 4.10034
906 1 15.3116 6.22085 6.27756
937 1 17.3489 7.47952 6.35589
935 1 17.5226 5.16872 6.40706
665 1 20.6552 5.11304 4.00889
667 1 20.4851 7.83228 4.23829
666 1 18.3839 6.57135 4.39153
936 1 19.8045 6.56044 6.20832
967 1 21.9437 7.67789 6.20975
965 1 21.9835 5.04617 6.26914
696 1 22.63 6.30955 4.29333
695 1 24.9167 5.08639 4.18931
966 1 24.1703 6.22202 6.28803
908 1 15.4434 8.84996 6.10814
639 1 15.9922 10.4142 4.05077
640 1 13.836 11.4124 4.20374
638 1 13.8435 8.77394 4.11418
910 1 15.3896 11.2954 6.26101
939 1 17.5032 10.2804 6.03181
941 1 17.6168 12.7023 6.4575
668 1 18.2733 8.96805 4.24498
669 1 20.4865 10.278 4.14205
670 1 18.3012 11.5033 4.07575
938 1 19.5994 9.01498 6.22862
940 1 19.6191 11.458 6.52431
969 1 21.9189 10.1045 6.12204
698 1 22.6397 8.91376 4.1565
700 1 22.4731 11.4814 4.30131
699 1 24.9835 10.142 4.37221
968 1 24.2964 8.69209 6.39662
970 1 24.1965 11.4366 6.28516
1001 1 26.3339 12.6437 6.41479
971 1 21.9519 12.7147 6.48025
643 1 16.0483 15.1095 4.19372
642 1 13.9179 13.965 4.19167
644 1 13.9004 16.4415 4.29086
912 1 15.4478 14.1338 6.34292
914 1 15.3777 16.721 6.18752
943 1 17.6266 15.3245 6.39489
671 1 20.2747 12.7433 4.401
672 1 18.3901 14.2044 4.14541
674 1 18.151 16.6314 4.28057
673 1 20.6216 15.2155 4.18973
942 1 19.7153 14.038 6.47154
944 1 19.9489 16.576 6.43835
973 1 21.8536 15.2157 6.54666
701 1 24.7184 12.7866 4.10241
703 1 24.9204 15.3317 4.42669
704 1 22.7222 16.5311 4.10236
702 1 22.6031 14.0159 4.25078
972 1 24.3374 13.936 6.46566
974 1 24.2718 16.522 6.4293
1003 1 26.4403 15.248 6.51716
647 1 16.1616 20.1949 4.50395
646 1 14.0533 19.0559 4.27304
645 1 16.0368 17.6348 4.0271
916 1 15.3146 19.1035 6.55691
947 1 17.8222 20.2621 6.46767
1817 1 22.0275 37.9826 12.9939
677 1 20.4259 20.418 4.38984
945 1 17.7539 17.6635 6.51703
675 1 20.4697 17.8355 4.10929
676 1 18.4039 19.043 4.39733
946 1 19.8736 19.0468 6.40343
975 1 22.1923 17.6819 6.43294
977 1 21.9851 20.3222 6.24798
706 1 22.7373 19.0774 4.19716
705 1 24.8469 17.7697 4.34446
707 1 24.9177 20.4053 4.18906
976 1 24.1387 19.0747 6.29488
650 1 14.0665 24.0194 4.20085
649 1 16.1645 22.8438 4.20477
648 1 13.8964 21.5595 4.22102
918 1 15.267 21.691 6.3396
920 1 15.3277 24.2425 6.37605
651 1 15.9419 25.4827 4.08549
949 1 17.648 23.0273 6.33168
680 1 18.275 24.211 4.13091
678 1 18.2039 21.6305 4.07278
679 1 20.4267 22.7764 4.05527
948 1 19.7238 21.8084 6.18151
950 1 19.8135 24.1493 6.2805
979 1 21.9717 22.8814 6.52502
708 1 22.7058 21.5713 4.12571
710 1 22.6424 24.078 4.35708
709 1 24.7468 23.0323 4.267
978 1 23.9731 21.6168 6.3008
980 1 24.2488 24.0937 6.42812
981 1 21.693 25.4103 6.40044
652 1 13.7678 26.72 4.52359
951 1 17.2635 25.6531 6.11185
654 1 13.8437 29.3354 4.2209
653 1 16.1153 27.8198 4.45898
922 1 15.2127 26.8189 6.79625
924 1 15.3152 29.3178 6.55997
683 1 20.5781 28.0348 3.96434
681 1 20.4694 25.408 4.04691
953 1 17.6136 28.064 6.46609
682 1 18.3461 26.6884 4.09241
684 1 18.1734 29.1319 4.19729
952 1 19.7395 26.7501 6.15287
954 1 19.827 29.4299 6.50569
983 1 22.0608 28.1516 6.36001
711 1 24.7328 25.483 4.39704
713 1 24.7042 28.0086 4.18458
712 1 22.6563 26.8057 4.10821
982 1 23.9809 26.5447 6.37525
984 1 24.2921 29.1006 6.4588
655 1 16.0023 30.5272 4.32106
657 1 16.0247 32.9626 4.15834
656 1 13.8763 31.7478 4.29573
926 1 15.3176 31.6229 6.43626
955 1 17.5269 30.6345 6.3344
957 1 17.6004 33.1908 6.21502
925 1 13.1461 30.4401 6.42702
687 1 20.5252 32.9136 4.23545
685 1 20.3988 30.4006 4.16732
686 1 18.3389 31.8488 4.0495
956 1 19.688 31.8393 6.2924
985 1 22.0584 30.6333 6.32501
987 1 21.956 32.9684 6.42933
716 1 22.763 31.6495 4.15712
715 1 24.8629 30.4379 4.32606
717 1 25.0357 33.2357 4.36724
986 1 24.1394 31.7018 6.24697
1015 1 26.409 30.5071 6.20353
631 1 16.2506 38.1579 4.35893
928 1 15.3719 34.275 6.33545
658 1 13.8975 34.3868 4.10636
660 1 13.9457 36.9942 4.46719
659 1 16.2019 35.7092 4.09875
930 1 15.4576 36.8473 6.31749
959 1 17.5498 35.6142 6.30553
929 1 13.0353 35.6096 6.37821
661 1 20.6551 38.0057 4.36819
688 1 18.4118 34.3333 4.03598
690 1 18.4525 37.0613 4.111
689 1 20.5065 35.4237 4.4104
958 1 19.7995 34.4298 6.46381
960 1 19.9851 36.8564 6.53071
718 1 22.6706 34.0962 4.3024
691 1 25.0191 0.094622 4.18739
989 1 22.0317 35.4918 6.47455
719 1 24.8182 35.6388 4.36692
720 1 22.6224 36.6065 4.40621
988 1 24.1037 34.1412 6.43987
990 1 24.2296 36.7908 6.41506
1019 1 26.4074 35.5918 6.50159
1953 1 23.4312 35.4665 15.4285
1173 1 14.4552 2.42784 8.60053
1174 1 16.7443 3.79486 8.41517
1172 1 16.8396 1.23985 8.36277
1442 1 13.9413 1.32979 10.7434
1443 1 16.1691 2.57838 10.6102
1444 1 13.9947 3.91343 10.7065
1171 1 14.6223 38.1045 8.33276
1203 1 19.0305 2.59488 8.10742
1202 1 21.0472 1.21456 8.48055
1472 1 18.4235 1.19981 10.6589
1473 1 20.6751 2.64028 10.5662
1204 1 21.0504 3.7082 8.45959
1474 1 18.4153 3.74677 10.2542
1233 1 23.2158 2.62406 8.63737
1232 1 25.5289 1.31754 8.50711
1723 1 24.7899 2.57592 10.5812
1793 1 22.8677 1.35405 10.7367
1504 1 22.6759 3.94371 10.6816
1234 1 25.442 3.71897 8.60151
1501 1 25.0649 38.0732 10.6309
1176 1 16.7223 6.38618 8.60313
1177 1 14.4546 7.62389 8.18803
1446 1 13.7443 6.32445 10.5212
1175 1 14.6593 5.11368 8.60476
1476 1 16.3117 5.00882 10.585
1417 1 15.7807 7.74793 10.5633
1205 1 18.89 4.99878 8.23924
1207 1 18.8004 7.73546 8.10805
1206 1 21.1229 6.38088 8.44382
1477 1 20.3687 7.65753 10.3259
1826 1 20.5781 5.26758 10.582
1475 1 18.1687 6.18832 10.2935
1235 1 23.3292 5.11888 8.53228
1237 1 23.518 7.58938 8.35486
1236 1 25.6475 6.25304 8.72012
1505 1 24.8917 5.01179 10.6822
1506 1 22.604 6.37024 10.7116
1507 1 24.8821 7.64237 10.6322
1448 1 13.7163 8.98184 10.5019
1178 1 16.4579 8.8326 8.33121
1180 1 16.7347 11.5057 8.69338
1179 1 14.4349 10.3399 8.46698
1450 1 13.9261 11.5001 10.6968
1449 1 15.9999 10.1479 10.5327
1181 1 14.6136 12.6726 8.28683
1478 1 18.0122 9.05432 10.2741
1210 1 21.1591 11.5968 8.51672
1208 1 21.2445 9.00865 8.28098
1209 1 18.9293 10.0876 8.49048
1479 1 20.3427 10.2938 10.5536
1480 1 18.1134 11.5335 10.7043
1481 1 20.3364 12.7791 10.5768
1211 1 18.9478 12.783 8.49358
1756 1 22.5678 8.97848 10.3985
1238 1 25.6179 8.98629 8.5253
1240 1 25.5799 11.498 8.4016
1239 1 23.3761 10.1315 8.44802
1509 1 24.7208 10.2791 10.5786
1510 1 22.6295 11.5003 10.6339
1241 1 23.4723 12.591 8.56367
1511 1 24.8966 12.7412 10.686
1451 1 16.0022 12.9141 10.7739
1182 1 16.749 14.0077 8.57085
1183 1 14.5919 15.1102 8.30718
1452 1 13.8003 13.92 10.725
1453 1 15.9901 15.4397 10.7641
1454 1 13.951 16.5105 10.7052
1184 1 16.8173 16.6946 8.55335
1214 1 21.2324 16.4815 8.80262
1212 1 21.2441 14.056 8.585
1213 1 19.074 15.2454 8.35866
1482 1 18.285 14.0039 10.578
1483 1 20.5441 15.1683 10.7324
1484 1 18.2751 16.515 10.5985
1242 1 25.6424 13.9686 8.63187
1244 1 25.5882 16.4686 8.40013
1243 1 23.4699 15.2048 8.39735
1512 1 22.7001 14.0057 10.6024
1514 1 22.5421 16.594 10.9338
1513 1 24.908 15.1924 10.6578
1187 1 14.6236 20.3852 8.6357
1185 1 14.5555 17.8766 8.6881
1186 1 16.7617 19.2574 8.58494
1455 1 15.9781 17.658 10.7843
1457 1 15.9184 20.2368 10.8506
1700 1 13.7945 19.0078 10.845
1217 1 19.0667 20.3763 8.50575
1216 1 21.2675 18.8581 8.42209
1215 1 19.0781 17.803 8.49247
1485 1 20.262 18.0698 10.5127
1486 1 18.2387 19.0807 10.7612
1487 1 20.5568 20.3384 10.7386
1247 1 23.5169 20.2798 8.52785
1246 1 25.7089 19.007 8.46999
1245 1 23.4912 17.7539 8.65587
1515 1 24.8322 17.8857 10.7772
1516 1 22.5429 19.1007 10.7146
1517 1 24.7711 20.3964 10.7369
1458 1 13.6081 21.5963 10.82
1188 1 16.8324 21.6682 8.39609
1190 1 16.8596 24.1385 8.17885
1189 1 14.5977 22.7635 8.74101
1459 1 16.0642 22.9445 10.6723
1460 1 13.8877 23.937 10.8887
1461 1 15.967 25.4135 10.8025
1488 1 18.3576 21.502 10.677
1218 1 21.2888 21.285 8.37937
1219 1 18.9634 22.8395 8.59257
1220 1 21.497 23.9564 8.826
1489 1 20.3404 22.8391 10.9093
1490 1 18.3032 23.9951 10.54
1249 1 23.7832 22.7447 8.70603
1518 1 22.6116 21.7048 10.4864
1248 1 25.7991 21.4762 8.83788
1250 1 25.7018 24.0646 8.46792
1519 1 24.7906 22.8638 11.081
1520 1 22.6781 24.1155 11.0155
1521 1 24.989 25.6113 10.5994
1191 1 14.7167 25.367 8.76244
1194 1 16.8395 29.012 8.50569
1193 1 14.7657 27.9288 8.9883
1192 1 16.9273 26.6697 8.48676
1462 1 13.9793 26.6165 10.9732
1463 1 16.1818 28.0017 10.8096
1464 1 13.9364 29.3908 10.8815
1221 1 19.3037 25.3564 8.41166
1491 1 20.6631 25.4321 10.6386
1222 1 21.3515 26.6299 8.45069
1223 1 19.1056 27.9948 8.56353
1224 1 21.3367 29.0838 8.60503
1492 1 18.3081 26.489 10.8233
1493 1 20.4117 28.0287 10.647
1494 1 18.1942 29.0927 10.722
1251 1 23.5128 25.3813 8.74038
1252 1 25.5518 26.6765 8.3118
1253 1 23.4185 27.8444 8.41072
1522 1 22.8891 26.9742 10.6877
1523 1 24.87 28.2267 10.7958
1524 1 22.6613 29.3467 10.8063
1254 1 25.7829 29.2803 8.58533
1465 1 15.9934 30.4016 10.8586
1195 1 14.5686 30.3983 8.69363
1196 1 16.8772 31.8191 8.51896
1197 1 14.6667 32.976 8.64825
1466 1 14.1123 31.7963 10.7832
1467 1 16.1351 33.0217 10.7249
1225 1 19.1101 30.452 8.57242
1497 1 20.4754 32.8028 10.594
1226 1 21.0755 31.6103 8.52559
1227 1 18.9961 33.0093 8.47254
1495 1 20.4703 30.3612 10.825
1496 1 18.2295 31.5903 10.9751
1255 1 23.494 30.4132 8.60677
1256 1 25.4278 31.7075 8.50544
1257 1 23.4333 32.9468 8.41478
1526 1 22.6399 31.7477 10.6613
1527 1 24.9213 32.9613 10.7655
1525 1 24.8617 30.4522 10.7898
1441 1 16.3839 38.1334 10.5022
1199 1 14.4741 35.5839 8.24802
1468 1 13.82 34.434 10.524
1470 1 13.9959 36.8397 10.561
1198 1 16.7236 34.2011 8.39206
1200 1 16.8742 36.8805 8.46837
1469 1 16.2163 35.6925 10.5113
1201 1 19.0726 0.0586274 8.66822
1471 1 20.8378 0.0145766 10.7081
1230 1 21.2425 36.747 8.46625
1498 1 18.3994 34.0851 10.8838
1228 1 21.2122 34.2223 8.3954
1499 1 20.7258 35.5974 10.7539
1229 1 18.8963 35.4425 8.79082
1500 1 18.4024 36.7668 10.7141
1231 1 23.3392 0.071253 8.6764
1528 1 22.6034 34.0702 10.5402
1259 1 23.4663 35.4697 8.74712
1258 1 25.5917 34.1734 8.71972
1260 1 25.541 36.7477 8.52088
1529 1 24.8554 35.3061 11.1707
1530 1 22.8878 36.6425 11.017
1755 1 15.519 1.15451 12.7261
1445 1 15.3527 3.72746 13.0024
1960 1 16.8657 1.12196 14.6009
1874 1 25.6835 37.0166 15.4656
1899 1 17.7294 2.51077 12.6049
1815 1 17.6645 37.9362 12.7579
1952 1 19.0707 2.3877 14.531
2002 1 21.182 1.11896 14.8021
1868 1 19.8706 1.24574 12.3966
1847 1 19.6695 3.99558 12.5815
1882 1 21.097 3.46693 14.4854
1502 1 21.9687 2.47301 12.6518
1822 1 24.3304 1.33007 13.0447
1933 1 23.2661 2.56283 14.8729
1912 1 25.8994 1.48841 15.2447
1769 1 24.0365 3.86029 12.911
1447 1 15.2647 6.08007 12.5843
1922 1 17.2727 7.56045 12.4812
1706 1 17.5596 5.04996 12.7612
1901 1 25.6107 34.3771 15.162
907 1 12.9137 7.59923 6.31862
1836 1 19.4945 6.45202 12.8091
1873 1 21.9072 7.51789 12.6576
1799 1 21.8137 5.27246 12.9985
1823 1 24.0831 6.32875 12.6768
1692 1 24.0681 34.3891 13.2731
1920 1 14.875 8.88422 12.6479
1879 1 15.1979 11.4473 13.0461
1974 1 16.8694 11.5212 14.8631
1749 1 17.2253 9.9624 12.9894
1946 1 14.6686 12.7514 14.9238
1856 1 19.4837 8.92027 12.5451
1698 1 19.5556 11.3212 12.8881
1742 1 20.9178 11.5967 15.0865
1788 1 21.813 12.7957 12.5921
1883 1 21.7682 10.0318 12.5671
2026 1 25.2111 11.2554 14.6913
2030 1 23.0846 10.1384 14.7544
1508 1 24.0002 8.85454 12.7174
1993 1 23.9341 11.4096 12.8321
1744 1 24.0721 36.8135 13.2205
1834 1 17.5626 12.7276 12.7014
2032 1 16.7877 14.2151 14.9404
2004 1 14.6706 15.4385 14.8787
1995 1 16.7927 16.6926 15.3887
1702 1 15.2698 13.9565 12.7316
1693 1 15.2856 16.4345 12.9856
1970 1 23.413 38.1526 15.4281
2001 1 19.0512 12.8438 14.8905
1703 1 17.5641 15.3549 12.6611
1978 1 21.2104 13.9435 14.9816
1743 1 19.6583 13.9773 12.7999
1915 1 19.0126 15.2616 14.8971
1925 1 21.261 16.5844 14.8975
1686 1 19.8749 16.6859 12.9155
1685 1 21.8819 15.2331 12.8912
2016 1 23.3141 12.5224 14.9257
1991 1 25.7194 13.7489 14.9789
1971 1 23.5168 15.1653 15.0886
1748 1 24.0436 13.9076 12.8909
1690 1 24.0354 16.5301 12.9612
1959 1 25.582 16.2804 15.1215
1939 1 19.1825 35.6207 14.7693
2005 1 19.0612 -0.0324225 14.8389
2010 1 14.3491 17.8484 15.2839
2007 1 16.763 18.9639 14.9415
1811 1 15.0959 18.9139 13.1562
1895 1 14.5611 20.3039 15.277
1903 1 21.2407 34.2639 15.3315
1638 1 17.4773 20.3578 12.8524
1661 1 17.4219 17.7694 12.8789
1884 1 18.8869 17.7685 15.2728
1887 1 21.3005 19.2422 14.7902
1909 1 19.0522 20.3233 15.4471
1651 1 19.7312 19.0991 12.9172
1666 1 22.0352 18.0158 12.8042
1655 1 22.0071 20.5136 12.8856
1914 1 23.3467 17.9384 15.2891
1955 1 25.5821 19.0173 15.2373
1927 1 23.5189 20.3729 15.1051
1902 1 24.2218 19.1175 12.9447
1560 1 26.3859 0.0547986 12.8484
1984 1 16.8632 21.6239 15.0463
1973 1 14.7567 22.9699 14.9389
1647 1 15.2334 24.0928 12.8366
1967 1 15.1897 21.4253 12.9316
1926 1 16.8641 24.135 14.9093
1634 1 17.369 22.692 12.6829
1007 1 26.3347 20.6436 6.31247
1881 1 21.5465 21.7735 15.2774
1664 1 19.1918 22.9188 14.9699
1631 1 19.7954 21.6035 12.9591
1636 1 19.7466 24.3915 12.6333
1990 1 21.1441 24.2123 14.9387
1885 1 18.8987 25.5804 14.8875
1644 1 21.9339 22.8469 13.009
1998 1 25.7409 21.8664 15.0538
2008 1 23.6143 22.8245 15.0944
1625 1 24.2055 21.7516 12.9221
1982 1 24.1413 24.3266 13.0453
1635 1 23.2985 25.6215 15.0592
1766 1 21.9433 35.3536 12.8561
1738 1 15.4031 29.0817 12.7829
1665 1 15.3487 26.6529 12.8111
1660 1 17.5653 27.9108 13.1865
1770 1 17.5931 35.5589 12.8878
1632 1 17.4228 25.365 12.9045
2029 1 21.0302 29.2047 14.8639
1629 1 19.6689 26.8089 13.0292
1968 1 19.608 29.3291 12.8372
2025 1 21.1616 26.7264 14.9462
1663 1 21.7879 27.9161 12.8215
1673 1 22.0585 25.3782 12.9166
1654 1 23.2399 28.0231 14.9396
1767 1 24.3139 26.6318 12.8835
1784 1 23.997 29.1272 13.101
2031 1 25.4462 26.9549 14.8832
1938 1 25.417 29.2832 15.129
1821 1 13.0576 30.4145 12.7818
1707 1 15.291 31.6113 12.9616
1966 1 16.8507 31.8688 15.0667
1987 1 14.5133 33.3106 14.5859
1776 1 17.4014 30.3239 12.9563
1896 1 21.2483 36.7172 14.7986
1785 1 17.5929 32.9008 13.0718
1958 1 19.0873 32.9397 14.8764
1929 1 20.983 31.4418 14.8512
1897 1 18.8317 30.0842 15.0301
1714 1 21.8278 32.8337 12.9737
1763 1 21.9809 30.4123 13.0284
2020 1 25.5099 31.7239 14.9977
1877 1 23.172 32.8605 15.039
1890 1 23.3964 30.3674 14.8625
1725 1 24.1794 31.8551 12.9081
1718 1 19.8585 34.0459 12.7513
1994 1 16.9866 34.3057 15.1061
1805 1 15.1956 36.7924 12.6241
1691 1 16.8317 36.7671 14.7871
1923 1 14.5462 35.7289 14.5396
1852 1 15.4472 34.2995 12.594
1778 1 19.8524 36.7471 12.7387
1009 1 26.3603 22.9398 6.57179
1013 1 26.5268 27.8441 6.30476
1017 1 26.2938 33.1554 6.5035
1503 1 26.2867 2.90915 13.334
1790 1 26.6549 25.4491 13.2295
1746 1 26.2224 35.7231 13.1246
909 1 13.0041 10.0834 6.1274
927 1 13.3616 33.0345 6.31692
1813 1 13.2364 2.6308 12.9378
1415 1 13.0959 5.07021 12.9647
182 1 28.5794 1.26926 0
184 1 28.5794 3.80777 0
451 1 27.8466 2.31199e-16 2.07269
452 1 30.045 1.26926 2.07269
453 1 27.8466 2.53851 2.07269
454 1 30.045 3.80777 2.07269
211 1 30.7778 0 0
213 1 30.7778 2.53851 0
212 1 32.9763 1.26926 0
214 1 32.9763 3.80777 0
481 1 32.2434 2.31199e-16 2.07269
482 1 34.4419 1.26926 2.07269
483 1 32.2434 2.53851 2.07269
484 1 34.4419 3.80777 2.07269
241 1 35.1747 0 0
242 1 37.3731 1.26926 0
243 1 35.1747 2.53851 0
244 1 37.3731 3.80777 0
511 1 36.6403 2.31199e-16 2.07269
512 1 38.8387 1.26926 2.07269
513 1 36.6403 2.53851 2.07269
514 1 38.8387 3.80777 2.07269
186 1 28.5794 6.34628 0
455 1 27.8466 5.07703 2.07269
456 1 30.045 6.34628 2.07269
457 1 27.8466 7.61554 2.07269
215 1 30.7778 5.07703 0
217 1 30.7778 7.61554 0
216 1 32.9763 6.34628 0
485 1 32.2434 5.07703 2.07269
486 1 34.4419 6.34628 2.07269
487 1 32.2434 7.61554 2.07269
245 1 35.1747 5.07703 0
246 1 37.3731 6.34628 0
247 1 35.1747 7.61554 0
515 1 36.6403 5.07703 2.07269
516 1 38.8387 6.34628 2.07269
517 1 36.6403 7.61554 2.07269
188 1 28.5794 8.8848 0
190 1 28.5794 11.4233 0
458 1 30.045 8.8848 2.07269
459 1 27.8466 10.1541 2.07269
460 1 30.045 11.4233 2.07269
219 1 30.7778 10.1541 0
218 1 32.9763 8.8848 0
220 1 32.9763 11.4233 0
488 1 34.4419 8.8848 2.07269
489 1 32.2434 10.1541 2.07269
490 1 34.4419 11.4233 2.07269
248 1 37.3731 8.8848 0
249 1 35.1747 10.1541 0
250 1 37.3731 11.4233 0
518 1 38.8387 8.8848 2.07269
519 1 36.6403 10.1541 2.07269
520 1 38.8387 11.4233 2.07269
461 1 27.8466 12.6926 2.07269
221 1 30.7778 12.6926 0
192 1 28.5794 13.9618 0
194 1 28.5794 16.5003 0
462 1 30.045 13.9618 2.07269
463 1 27.8466 15.2311 2.07269
464 1 30.045 16.5003 2.07269
223 1 30.7778 15.2311 0
491 1 32.2434 12.6926 2.07269
222 1 32.9763 13.9618 0
224 1 32.9763 16.5003 0
492 1 34.4419 13.9618 2.07269
493 1 32.2434 15.2311 2.07269
494 1 34.4419 16.5003 2.07269
251 1 35.1747 12.6926 0
521 1 36.6403 12.6926 2.07269
252 1 37.3731 13.9618 0
253 1 35.1747 15.2311 0
254 1 37.3731 16.5003 0
522 1 38.8387 13.9618 2.07269
523 1 36.6403 15.2311 2.07269
524 1 38.8387 16.5003 2.07269
196 1 28.5794 19.0389 0
465 1 27.8466 17.7696 2.07269
466 1 30.045 19.0389 2.07269
467 1 27.8466 20.3081 2.07269
225 1 30.7778 17.7696 0
227 1 30.7778 20.3081 0
226 1 32.9763 19.0389 0
495 1 32.2434 17.7696 2.07269
496 1 34.4419 19.0389 2.07269
497 1 32.2434 20.3081 2.07269
255 1 35.1747 17.7696 0
256 1 37.3731 19.0389 0
257 1 35.1747 20.3081 0
525 1 36.6403 17.7696 2.07269
526 1 38.8387 19.0389 2.07269
527 1 36.6403 20.3081 2.07269
198 1 28.5794 21.5774 0
200 1 28.5794 24.1159 0
468 1 30.045 21.5774 2.07269
469 1 27.8466 22.8466 2.07269
470 1 30.045 24.1159 2.07269
471 1 27.8466 25.3851 2.07269
229 1 30.7778 22.8466 0
231 1 30.7778 25.3851 0
228 1 32.9763 21.5774 0
230 1 32.9763 24.1159 0
498 1 34.4419 21.5774 2.07269
499 1 32.2434 22.8466 2.07269
500 1 34.4419 24.1159 2.07269
501 1 32.2434 25.3851 2.07269
258 1 37.3731 21.5774 0
259 1 35.1747 22.8466 0
260 1 37.3731 24.1159 0
261 1 35.1747 25.3851 0
528 1 38.8387 21.5774 2.07269
529 1 36.6403 22.8466 2.07269
530 1 38.8387 24.1159 2.07269
531 1 36.6403 25.3851 2.07269
202 1 28.5794 26.6544 0
204 1 28.5794 29.1929 0
472 1 30.045 26.6544 2.07269
473 1 27.8466 27.9236 2.07269
474 1 30.045 29.1929 2.07269
233 1 30.7778 27.9236 0
232 1 32.9763 26.6544 0
234 1 32.9763 29.1929 0
502 1 34.4419 26.6544 2.07269
503 1 32.2434 27.9236 2.07269
504 1 34.4419 29.1929 2.07269
262 1 37.3731 26.6544 0
263 1 35.1747 27.9236 0
264 1 37.3731 29.1929 0
532 1 38.8387 26.6544 2.07269
533 1 36.6403 27.9236 2.07269
534 1 38.8387 29.1929 2.07269
206 1 28.5794 31.7314 0
475 1 27.8466 30.4622 2.07269
476 1 30.045 31.7314 2.07269
477 1 27.8466 33.0007 2.07269
235 1 30.7778 30.4622 0
237 1 30.7778 33.0007 0
236 1 32.9763 31.7314 0
505 1 32.2434 30.4622 2.07269
506 1 34.4419 31.7314 2.07269
507 1 32.2434 33.0007 2.07269
265 1 35.1747 30.4622 0
266 1 37.3731 31.7314 0
267 1 35.1747 33.0007 0
535 1 36.6403 30.4622 2.07269
536 1 38.8387 31.7314 2.07269
537 1 36.6403 33.0007 2.07269
208 1 28.5794 34.2699 0
210 1 28.5794 36.8084 0
478 1 30.045 34.2699 2.07269
479 1 27.8466 35.5392 2.07269
480 1 30.045 36.8084 2.07269
239 1 30.7778 35.5392 0
238 1 32.9763 34.2699 0
240 1 32.9763 36.8084 0
508 1 34.4419 34.2699 2.07269
509 1 32.2434 35.5392 2.07269
510 1 34.4419 36.8084 2.07269
268 1 37.3731 34.2699 0
269 1 35.1747 35.5392 0
270 1 37.3731 36.8084 0
538 1 38.8387 34.2699 2.07269
539 1 36.6403 35.5392 2.07269
540 1 38.8387 36.8084 2.07269
809 1 38.0265 35.652 4.08779
723 1 29.223 2.61712 4.42534
724 1 26.988 3.76156 4.20464
722 1 27.1107 1.35345 4.11017
992 1 28.5672 1.29518 6.55818
994 1 28.5355 3.83204 6.69825
993 1 26.4646 2.67869 6.39879
1023 1 30.7214 2.61827 6.34352
753 1 33.6717 2.4318 4.04109
752 1 31.2837 1.34955 4.08952
754 1 31.5676 3.79493 4.0636
1022 1 32.9882 1.34432 6.06265
1024 1 32.908 3.73218 6.49545
751 1 33.6054 37.9552 4.23094
1053 1 35.0944 2.58989 6.37913
782 1 35.8726 1.30403 4.24392
783 1 37.8982 2.66087 4.12362
784 1 35.7755 3.85728 4.34181
1052 1 37.1622 0.908358 6.57297
1054 1 37.3817 3.61704 6.29278
781 1 38.1756 0.134169 4.25527
2028 1 32.2524 30.5875 15.2856
725 1 29.3446 5.10754 4.14218
726 1 26.9615 6.34903 4.23204
727 1 29.3892 7.72285 4.24693
996 1 28.5493 6.31046 6.28393
1027 1 30.6046 7.62948 6.28705
1695 1 26.2341 33.0824 13.0736
1989 1 38.804 34.2127 14.8505
1025 1 30.8131 4.9658 6.4388
757 1 33.65 7.78363 4.12106
756 1 31.4698 6.31994 4.47363
755 1 33.6466 5.19512 4.29479
1026 1 32.899 6.37228 6.48294
1055 1 35.0068 5.04864 6.67203
1057 1 35.0959 7.54563 6.26648
785 1 38.0443 5.09789 4.26288
787 1 38.0965 7.49946 4.28949
786 1 35.8331 6.40226 4.18365
1056 1 37.4802 6.18658 6.67197
1684 1 37.2136 37.1561 12.8848
1781 1 26.3208 15.2395 12.8911
728 1 27.2188 8.81481 4.18
730 1 27.1237 11.4779 4.22362
729 1 29.5229 10.5103 4.2649
998 1 28.4444 8.89709 6.49791
1000 1 28.4625 11.3486 6.42486
999 1 26.4039 10.1502 6.30772
1029 1 30.593 10.1269 6.41956
760 1 31.6299 11.649 4.18538
759 1 33.7189 10.1314 3.99648
758 1 31.4419 9.1055 4.01631
1028 1 32.7648 8.89975 6.22532
1030 1 32.9444 11.2718 6.33928
1059 1 35.1159 10.1022 6.45884
761 1 33.7522 12.8194 3.99933
790 1 35.7911 11.5278 4.27583
789 1 37.9981 10.2185 4.28949
788 1 35.8745 8.81982 4.35729
1058 1 37.4422 8.72595 6.48202
1060 1 37.2938 11.6263 6.37765
1061 1 35.1425 12.6858 6.49759
731 1 29.1802 12.9214 4.32537
732 1 26.8102 14.0336 4.28213
733 1 29.3416 15.4287 4.47236
734 1 27.1966 16.4061 4.23208
1002 1 28.5366 13.9205 6.49559
1004 1 28.6364 16.3188 6.5465
1031 1 30.7951 12.596 6.45222
1033 1 30.8175 15.2019 6.42274
762 1 31.4357 14.0776 4.36209
763 1 33.9042 15.3277 4.21924
764 1 31.5336 16.4852 4.19918
1032 1 33.0759 13.9512 6.24025
1034 1 32.9072 16.62 6.65005
791 1 38.0164 12.7706 4.2154
793 1 38.17 15.2194 4.25231
1063 1 35.2289 15.2699 6.77149
792 1 35.933 13.9571 4.47766
794 1 35.8319 16.5508 4.49132
1062 1 37.312 14.2018 6.42614
1064 1 37.4549 16.6026 6.6548
736 1 27.016 19.0877 4.27615
735 1 29.4366 17.7531 4.08877
737 1 29.1967 20.1305 4.19399
1006 1 28.5365 18.9529 6.44906
1037 1 30.6764 20.165 6.40046
1005 1 26.4583 17.8451 6.44971
1782 1 37.1489 34.3493 13.0189
1035 1 30.6695 17.7732 6.31426
765 1 33.6409 17.7255 4.46819
767 1 33.703 20.3391 4.13979
766 1 31.634 19.0056 4.18529
1036 1 33.0458 19.15 6.61211
796 1 35.8864 18.9968 4.13526
1065 1 35.2659 17.9558 6.25222
1067 1 34.8149 20.4523 6.29447
797 1 38.2209 20.3245 4.39955
795 1 38.2261 17.7361 3.97306
1066 1 37.442 19.2845 6.61422
740 1 27.1378 24.1667 4.25524
738 1 27.1991 21.5907 4.30596
739 1 29.4832 22.823 4.10949
1008 1 28.626 21.5936 6.4412
1010 1 28.4511 23.9098 6.13522
741 1 29.2868 25.4155 3.99865
1712 1 26.1494 12.5337 12.7465
1039 1 30.7872 22.7552 6.17769
769 1 33.7519 22.9328 4.3866
768 1 31.4413 21.7958 4.00743
770 1 31.6028 24.2695 4.10985
1038 1 32.7429 21.5625 6.45469
1040 1 33.0863 23.8574 6.37011
1071 1 35.2875 25.2605 6.62978
798 1 35.9598 21.5224 4.18944
1069 1 35.2044 22.678 6.48008
799 1 38.059 22.7211 4.36177
800 1 35.8324 24.0864 4.63623
1068 1 37.4535 21.6933 6.61843
1070 1 37.4553 24.1547 6.3973
829 1 39.5333 22.8873 6.34781
742 1 27.0774 26.5896 4.10477
743 1 29.3733 27.9649 4.29742
744 1 27.0943 29.0591 4.22956
1012 1 28.6236 26.3809 6.31652
1014 1 28.6094 29.301 6.49744
1043 1 31.0076 27.7529 6.3495
1765 1 26.2596 7.72668 12.785
1011 1 26.3603 25.3845 6.26968
771 1 33.7392 25.4138 4.19726
1041 1 30.7324 25.2609 6.39797
773 1 33.619 27.8601 4.23257
772 1 31.6322 26.5455 4.20284
774 1 31.5789 29.0773 4.06757
1042 1 33.0278 26.419 6.73567
1044 1 32.9746 29.0874 6.48443
1073 1 35.0717 27.8227 6.37189
804 1 35.7944 29.11 4.30056
801 1 37.9552 25.2994 4.19863
803 1 37.9004 27.8985 4.01204
802 1 35.8958 26.7686 4.10183
1072 1 37.4127 26.5774 6.30152
1074 1 37.1396 29.2596 6.14562
745 1 29.0983 30.3803 4.26089
746 1 27.079 31.8977 4.20352
747 1 29.3021 33.0184 4.20796
1016 1 28.5304 31.7917 6.34918
1045 1 30.5884 30.4939 6.40275
991 1 26.3133 38.1886 6.26886
1047 1 30.7051 32.9074 6.32789
776 1 31.3063 31.5633 4.13935
777 1 33.65 32.8202 4.36883
775 1 33.7507 30.536 4.38134
1046 1 32.8408 31.9218 6.39126
1077 1 34.9965 32.9367 6.44284
1075 1 35.0304 30.1934 6.34448
806 1 35.8243 31.5872 4.24644
807 1 38.0738 33.0815 4.20407
805 1 38.0803 30.4939 4.085
1076 1 37.4982 31.7703 6.36713
1949 1 36.2709 35.459 15.1152
721 1 29.2271 38.2012 4.08608
1021 1 30.8701 0.193823 6.42285
748 1 27.1811 34.4247 4.3427
749 1 29.3574 35.4595 4.13461
750 1 27.1065 36.8157 4.3691
1018 1 28.7019 34.2948 6.40161
1020 1 28.5338 36.7688 6.36093
1049 1 30.8071 35.5876 6.37705
780 1 31.2535 37.0661 4.36707
779 1 33.5561 35.4819 4.4379
778 1 31.4754 34.1225 4.34246
1048 1 33.0112 34.3838 6.66312
1050 1 32.933 36.729 6.36618
1079 1 35.1629 35.5505 6.7018
1051 1 35.0378 0.129627 6.66434
808 1 35.7176 34.1298 4.54671
810 1 35.783 36.9634 4.5611
1078 1 37.2774 34.2887 6.5453
1080 1 37.3483 36.6236 6.24984
839 1 39.5926 35.5843 6.40671
1262 1 30.0176 1.32786 8.55006
1263 1 27.6198 2.68567 8.85982
1533 1 29.2614 2.56531 10.9129
1532 1 26.9921 1.39195 10.753
1264 1 29.8638 3.90489 8.67263
1534 1 26.98 3.82455 10.8273
1261 1 27.6041 38.1201 8.77522
1294 1 34.266 3.88221 8.80897
1293 1 32.2226 2.59607 8.50316
1292 1 34.1465 1.37883 8.56452
1562 1 31.5827 1.36156 10.7081
1563 1 33.8048 2.77397 10.8445
1564 1 31.4542 3.91104 10.7513
1323 1 36.5246 2.53678 8.76002
1322 1 38.6956 1.18096 8.64471
1592 1 36.1267 1.44029 11.1848
1593 1 38.1409 2.50098 10.8456
1594 1 35.9232 3.93085 10.6739
1324 1 38.4707 3.66584 8.71824
1266 1 29.9829 6.30017 8.47408
1267 1 27.6292 7.60319 8.65587
1265 1 27.6793 5.00855 8.50361
1536 1 27.0236 6.31593 10.7957
1537 1 29.2944 7.87494 10.5426
1535 1 29.1651 5.09438 10.6868
1296 1 34.3388 6.23072 8.66392
1297 1 32.1943 7.61198 8.49351
1295 1 32.1093 5.22032 8.52288
1565 1 33.3336 5.29983 10.7051
1566 1 31.152 6.50409 10.6211
1567 1 33.5653 7.71179 10.6665
1325 1 36.596 5.20237 8.70271
1327 1 36.4516 7.72442 8.5311
1326 1 38.8645 6.38921 8.57342
1595 1 38.2524 5.23017 10.6696
1596 1 35.7708 6.57409 10.6792
1597 1 38.0492 7.58424 10.8124
1269 1 27.5864 10.1621 8.54327
1538 1 27.0269 9.01361 10.56
1268 1 30.0675 8.99964 8.4731
1270 1 29.9688 11.5654 8.66647
1540 1 27.0601 11.4756 10.728
1539 1 29.3108 10.3086 10.642
1271 1 27.8163 12.7742 8.6751
1541 1 29.3719 12.8119 10.8438
1298 1 34.4876 8.95534 8.56695
1299 1 32.1716 10.2127 8.42784
1300 1 34.4321 11.3738 8.62368
1569 1 33.5797 10.3167 10.6261
1570 1 31.3718 11.6645 10.976
1719 1 31.5181 9.06832 10.7512
1329 1 36.6386 10.2668 8.40314
1328 1 38.8987 8.79503 8.56503
1330 1 38.5601 11.5158 8.69346
1599 1 38.0375 10.1871 10.5489
1600 1 35.7514 11.5178 10.8249
1598 1 35.9228 8.9747 10.7721
1601 1 37.8529 12.734 10.7219
1272 1 29.9942 13.9841 8.56117
1273 1 27.8771 15.2056 8.5721
1542 1 27.1886 14.0569 10.717
1543 1 29.3314 15.207 10.9136
1274 1 29.936 16.5782 8.66507
1544 1 27.2203 16.5629 10.8101
1301 1 32.0244 12.7018 8.83693
1571 1 33.495 12.8413 11.0392
1303 1 32.0579 15.354 8.68329
1302 1 34.1471 14.1969 8.55498
1572 1 31.3241 14.1215 10.5955
1304 1 34.2408 16.4544 8.69801
1576 1 33.612 15.3931 11.0574
1574 1 31.4776 16.4878 10.8642
1331 1 36.3294 12.8407 8.68468
1334 1 38.8638 16.448 8.93268
1332 1 38.8139 13.979 8.656
1333 1 36.7067 15.301 8.72969
1602 1 35.7416 13.9652 10.8447
1603 1 38.1507 15.3628 11.063
1604 1 35.9273 16.3202 10.845
1275 1 27.8172 17.9516 8.56228
1277 1 27.9836 20.4163 8.54119
1276 1 29.9409 18.9711 8.44417
1545 1 29.3872 18.0223 10.7548
1546 1 27.1019 19.0424 10.7975
1547 1 29.1279 20.5326 10.9841
1306 1 34.3456 18.9476 8.67348
1305 1 32.0657 17.8087 8.8164
1307 1 32.1286 20.1991 8.77961
1578 1 33.4205 20.2223 11.1662
1606 1 33.6252 17.7287 11.0289
1724 1 31.4224 19.1176 10.9954
1335 1 36.5854 17.8443 8.55454
1337 1 36.3974 20.4562 8.56066
1336 1 38.735 18.8297 8.70127
1605 1 38.0245 17.775 11.1913
1607 1 37.988 20.2156 10.7542
1892 1 35.7965 18.9159 10.7887
1278 1 30.188 21.4301 8.37888
1279 1 27.9023 22.6881 8.67301
1548 1 27.0046 21.6103 10.9691
1280 1 29.9855 24.023 8.25006
1550 1 26.8347 24.147 10.5085
1951 1 29.17 22.8326 10.6735
1551 1 29.1229 25.4129 10.4381
1281 1 27.7341 25.4136 8.51083
1310 1 34.2357 24.1272 8.68483
1308 1 34.1409 21.3932 8.5527
1309 1 31.9131 22.7789 8.86498
1579 1 31.2989 21.6893 10.8524
1580 1 31.3575 24.1834 10.8914
1858 1 33.5549 22.6655 10.8863
1581 1 33.5434 25.3123 10.8398
1338 1 38.6767 21.1904 8.57087
1608 1 35.7979 21.6934 10.9439
1340 1 38.6139 23.8791 8.67083
1339 1 36.4692 22.8021 8.58448
1610 1 35.7201 24.1524 10.7288
1758 1 37.985 22.7442 10.8078
1611 1 38.0643 25.3297 10.6526
1341 1 36.5826 25.295 8.66283
1284 1 30.1442 29.1603 8.58323
1282 1 29.9954 26.65 8.39023
1283 1 27.8762 27.9072 8.58061
1552 1 26.9654 26.6704 10.7093
1553 1 29.2603 28.0889 10.5734
1697 1 27.1629 29.3771 10.8189
1311 1 32.1531 25.3051 8.81431
1314 1 34.37 29.1281 8.53972
1312 1 34.4163 26.6721 8.62323
1313 1 32.1976 28.0116 8.62913
1582 1 31.544 26.7859 10.8369
1584 1 31.5365 29.2268 10.7701
1583 1 33.6632 27.7976 10.9286
1342 1 38.6287 26.6695 8.52828
1612 1 35.9247 26.4754 10.6919
1343 1 36.5733 27.963 8.33238
1613 1 38.0262 27.7916 10.6182
1614 1 35.9998 29.2229 10.7211
1344 1 38.6011 29.3033 8.5617
1286 1 30.2133 31.7776 8.4913
1287 1 27.8031 33.1063 8.3849
1285 1 27.7532 30.6346 8.55029
1555 1 29.3707 30.3735 10.9695
1556 1 27.1828 31.83 10.7357
1557 1 29.4092 32.9831 10.6113
1315 1 32.232 30.3814 8.51461
1316 1 34.392 31.6869 8.44425
1317 1 32.4891 33.0601 8.63335
1585 1 33.6924 30.3214 10.8019
1586 1 31.4606 31.6768 10.4947
1587 1 33.4153 32.9334 10.902
1347 1 36.6365 33.1927 8.6033
1345 1 36.5635 30.6748 8.54295
1346 1 38.8787 31.8645 8.57173
1615 1 37.8141 30.4857 10.7766
1616 1 35.5991 31.8691 10.5342
1617 1 37.8947 32.9461 10.8775
1531 1 29.1505 38.2195 10.7802
1558 1 27.1124 34.3338 10.6866
1290 1 29.8418 36.952 8.46784
1288 1 30.0625 34.3877 8.44674
1289 1 27.7607 35.3238 8.54263
1559 1 29.1712 35.643 10.6303
1677 1 26.8494 36.7384 10.8942
1561 1 33.8232 38.4443 10.7364
1291 1 32.0746 38.3506 8.67749
1588 1 31.2692 34.4177 10.6866
1319 1 32.1259 35.6953 8.70932
1318 1 34.5023 34.354 8.8973
1590 1 31.2387 36.8519 10.624
1589 1 33.4608 35.4785 11.0231
1320 1 34.0553 36.9828 8.62669
1321 1 36.3259 38.2106 8.89126
1591 1 38.1221 38.0917 10.5805
1348 1 38.7632 34.3215 8.56188
1618 1 35.7841 34.4171 10.835
1620 1 35.7461 37.0985 11.0858
1349 1 36.5248 35.7009 8.80132
1619 1 38.0739 35.5621 10.6646
1350 1 38.6852 36.6906 8.31716
2003 1 30.3654 1.35618 14.8057
1683 1 28.3748 1.33701 12.8944
1674 1 28.5652 4.09702 13.1056
1680 1 35.0264 0.315852 13.124
1699 1 39.4729 25.3549 12.7957
1917 1 28.2642 2.41461 14.9375
1623 1 30.8514 2.6926 12.9955
1671 1 32.9459 1.64693 12.96
2015 1 34.2231 1.49185 15.3266
1652 1 32.9847 4.03597 12.6195
1643 1 30.6737 -0.0515586 12.7195
1656 1 35.0726 2.75247 13.3297
1641 1 37.3939 1.49708 13.2271
1633 1 37.2584 3.84985 12.7285
1669 1 39.5738 0.105942 13.0514
1807 1 26.3654 5.30763 12.7639
1739 1 28.4077 6.45189 12.4981
1689 1 30.695 7.89209 12.6122
1626 1 30.7624 5.22716 12.9549
1624 1 32.9574 6.47786 13.0205
1621 1 35.0167 7.7739 12.7409
1628 1 34.981 5.31326 12.7842
1701 1 37.3666 6.29234 12.9994
1733 1 26.1156 10.1333 12.7328
1741 1 28.4525 8.92596 12.5015
1737 1 28.3331 11.228 12.9522
1786 1 30.6407 12.8497 13.2363
1568 1 30.4424 10.1406 12.9806
1869 1 32.6953 9.00735 12.7903
1809 1 32.5785 11.416 13.0844
1814 1 34.9558 10.2936 12.8463
1838 1 37.3869 11.1591 12.6877
1734 1 37.179 8.75845 12.653
1859 1 28.4736 13.8137 13.0096
2012 1 27.7714 15.2112 14.7515
1789 1 28.6421 16.5069 12.9707
1849 1 30.7707 15.1628 12.8338
1796 1 32.8078 13.9193 13.0954
1573 1 32.8146 16.4296 13.394
1848 1 34.9875 15.1213 13.5002
1846 1 35.1003 12.7093 12.8818
1889 1 37.1549 13.9085 13.1672
1704 1 37.3571 16.3013 13.4865
1975 1 27.469 17.5602 14.9668
1977 1 27.7607 19.838 14.9337
1947 1 28.4382 18.8579 13.0642
1792 1 26.2677 17.792 12.9262
1957 1 30.7451 17.7667 12.8377
1851 1 30.6399 20.1463 13.1059
1575 1 32.7989 19.1367 13.3603
1886 1 35.0847 17.5496 12.7002
1681 1 34.8892 20.3839 13.2252
1945 1 36.5215 20.3919 15.0308
1934 1 37.1172 18.8038 13.3356
2022 1 38.929 18.79 15.1245
1980 1 38.5718 36.5118 15.2459
2014 1 36.5967 0.0214137 15.0927
1653 1 39.4912 15.0313 13.1894
1864 1 26.2777 23.1576 13.0734
1720 1 28.3092 21.646 13.2806
1735 1 28.4021 24.1988 12.56
1549 1 30.5359 22.7009 12.8916
1577 1 32.8586 21.636 13.3559
1942 1 34.1257 24.0759 14.7679
1910 1 32.8052 24.1469 12.965
1857 1 35.0363 23.0091 12.8061
1713 1 30.7023 25.2421 12.8654
1609 1 34.9606 25.4014 12.8944
1850 1 37.1172 21.6118 12.933
1986 1 38.6506 21.4796 15.1805
2017 1 36.2778 22.7759 14.8273
1840 1 38.7356 23.9157 14.8043
1875 1 37.2633 24.1538 12.8612
1972 1 36.7565 25.1422 14.9275
1764 1 32.2056 0.186644 14.9171
1941 1 34.2212 34.3482 15.7101
1798 1 28.6548 29.157 13.029
1862 1 28.646 26.7278 12.7619
1827 1 30.7959 27.9669 12.9092
2011 1 32.1979 27.9302 14.983
1963 1 34.395 26.4773 15.243
1919 1 32.9169 29.0585 13.0724
1940 1 32.8154 26.6133 13.1187
1928 1 34.253 29.2823 15.269
1843 1 35.0525 27.8489 13.267
1911 1 38.747 26.6864 14.7085
1870 1 38.7 29.1647 15.0213
1888 1 36.6532 27.6521 14.9896
1374 1 37.2625 26.5942 12.7817
1844 1 37.3287 29.221 12.9037
1841 1 26.1677 30.4689 13.035
1999 1 27.9379 32.9565 15.0002
1944 1 29.9913 31.6218 15.1251
1950 1 27.723 30.5675 14.8815
1722 1 28.4252 31.563 12.7481
1845 1 30.8305 30.5285 12.9824
1833 1 30.5299 32.9281 12.673
1948 1 32.0027 33.0933 15.2879
1921 1 34.307 31.7296 15.2593
1997 1 29.9876 28.9975 15.1474
1810 1 32.9826 31.7043 13.2819
1867 1 34.8323 30.3074 13.0995
1829 1 34.7752 33.1799 12.8651
1863 1 38.4887 31.637 14.859
1752 1 36.8677 31.9616 12.9323
1905 1 36.4813 30.4468 14.8026
1943 1 36.6358 32.8968 15.1178
2033 1 27.7973 0.0268463 15.0116
1962 1 29.8064 34.2134 15.1772
1979 1 29.977 36.8819 15.2103
1675 1 28.359 36.7523 12.7096
1808 1 28.4296 34.1523 12.8446
1907 1 27.9688 35.5852 15.2303
1983 1 30.5601 35.5589 13.0527
1622 1 39.5793 4.98971 12.9761
1750 1 35.0978 35.6215 13.081
2018 1 31.9824 35.5945 15.2791
1992 1 34.1184 36.8576 15.4845
1820 1 32.6875 34.3759 13.1036
1687 1 33.1641 37.1414 12.9677
825 1 39.4471 17.9139 6.39935
819 1 39.5249 10.3203 6.70454
1678 1 39.3264 22.6655 12.7855
1753 1 39.3185 20.1056 12.917
1824 1 39.4597 17.3946 13.4635
821 1 39.5298 12.6392 6.71385
827 1 39.6284 20.2767 6.32179
835 1 39.3404 30.3263 6.48647
1645 1 39.6044 2.48741 12.9989
1804 1 39.3875 28.0288 12.8008
1842 1 26.2738 20.3442 13.1321
1554 1 26.4456 27.913 13.0191
997 1 26.4439 7.6651 6.42853
995 1 26.3248 5.10329 6.32298
2035 1 4.501523497524533 30.01655330361706 38
